aurora-dev mailing list archives

Site index · List index
Message view « Date » · « Thread »
Top « Date » · « Thread »
From Apache Jenkins Server <jenk...@builds.apache.org>
Subject Build failed in Jenkins: aurora-packaging-nightly #295
Date Sun, 08 May 2016 00:50:30 GMT
See <https://builds.apache.org/job/aurora-packaging-nightly/295/>

------------------------------------------
[...truncated 8272 lines...]
    71% |######################          | 364kB 26.3MB/s eta 0:00:01
    71% |#######################         | 368kB 27.4MB/s eta 0:00:01
    72% |#######################         | 372kB 27.6MB/s eta 0:00:01
    73% |#######################         | 376kB 26.7MB/s eta 0:00:01
    74% |#######################         | 380kB 27.0MB/s eta 0:00:01
    75% |########################        | 385kB 28.0MB/s eta 0:00:01
    75% |########################        | 389kB 28.0MB/s eta 0:00:01
    76% |########################        | 393kB 26.9MB/s eta 0:00:01
    77% |########################        | 397kB 26.8MB/s eta 0:00:01
    78% |#########################       | 401kB 27.6MB/s eta 0:00:01
    79% |#########################       | 405kB 27.9MB/s eta 0:00:01
    79% |#########################       | 409kB 27.1MB/s eta 0:00:01
    80% |#########################       | 413kB 27.0MB/s eta 0:00:01
    81% |##########################      | 417kB 27.9MB/s eta 0:00:01
    82% |##########################      | 421kB 26.9MB/s eta 0:00:01
    83% |##########################      | 425kB 24.8MB/s eta 0:00:01
    83% |##########################      | 430kB 23.9MB/s eta 0:00:01
    84% |###########################     | 434kB 24.0MB/s eta 0:00:01
    85% |###########################     | 438kB 23.1MB/s eta 0:00:01
    86% |###########################     | 442kB 21.5MB/s eta 0:00:01
    87% |###########################     | 446kB 20.7MB/s eta 0:00:01
    87% |############################    | 450kB 20.6MB/s eta 0:00:01
    88% |############################    | 454kB 20.1MB/s eta 0:00:01
    89% |############################    | 458kB 18.8MB/s eta 0:00:01
    90% |############################    | 462kB 18.7MB/s eta 0:00:01
    91% |#############################   | 466kB 19.3MB/s eta 0:00:01
    91% |#############################   | 471kB 19.4MB/s eta 0:00:01
    92% |#############################   | 475kB 18.5MB/s eta 0:00:01
    93% |#############################   | 479kB 18.5MB/s eta 0:00:01
    94% |##############################  | 483kB 19.2MB/s eta 0:00:01
    95% |##############################  | 487kB 19.3MB/s eta 0:00:01
    95% |##############################  | 491kB 18.6MB/s eta 0:00:01
    96% |##############################  | 495kB 18.5MB/s eta 0:00:01
    97% |############################### | 499kB 19.7MB/s eta 0:00:01
    98% |############################### | 503kB 20.4MB/s eta 0:00:01
    99% |############################### | 507kB 20.6MB/s eta 0:00:01
    99% |############################### | 512kB 21.2MB/s eta 0:00:01
    100% |################################| 516kB 686kB/s 
Collecting pytest-cov<1.9,>=1.8 (from pantsbuild.pants==0.0.80)
  Downloading pytest-cov-1.8.1.tar.gz
Collecting setproctitle==1.1.9 (from pantsbuild.pants==0.0.80)
  Downloading setproctitle-1.1.9.tar.gz
Collecting pywatchman==1.2.0 (from pantsbuild.pants==0.0.80)
  Downloading pywatchman-1.2.0.tar.gz
Collecting futures==3.0.5 (from pantsbuild.pants==0.0.80)
  Downloading futures-3.0.5-py2-none-any.whl
Collecting twitter.common.lang==0.3.4 (from twitter.common.collections<0.4,>=0.3.1->pantsbuild.pants==0.0.80)
  Downloading twitter.common.lang-0.3.4.tar.gz
Collecting twitter.common.log==0.3.4 (from twitter.common.confluence<0.4,>=0.3.1->pantsbuild.pants==0.0.80)
  Downloading twitter.common.log-0.3.4.tar.gz
Collecting monotonic>=0.1 (from fasteners==0.14.1->pantsbuild.pants==0.0.80)
  Downloading monotonic-1.1-py2.py3-none-any.whl
Collecting py>=1.4.25 (from pytest<2.7,>=2.6->pantsbuild.pants==0.0.80)
  Downloading py-1.4.31-py2.py3-none-any.whl (81kB)

    4% |#                               | 4.1kB 19.7MB/s eta 0:00:01
    9% |###                             | 8.2kB 20.4MB/s eta 0:00:01
    14% |####                            | 12kB 22.0MB/s eta 0:00:01
    19% |######                          | 16kB 23.2MB/s eta 0:00:01
    24% |#######                         | 20kB 23.9MB/s eta 0:00:01
    29% |#########                       | 24kB 24.3MB/s eta 0:00:01
    34% |###########                     | 28kB 24.7MB/s eta 0:00:01
    39% |############                    | 32kB 24.5MB/s eta 0:00:01
    44% |##############                  | 36kB 25.1MB/s eta 0:00:01
    49% |###############                 | 40kB 26.0MB/s eta 0:00:01
    54% |#################               | 45kB 27.3MB/s eta 0:00:01
    59% |###################             | 49kB 28.0MB/s eta 0:00:01
    64% |####################            | 53kB 27.6MB/s eta 0:00:01
    69% |######################          | 57kB 28.1MB/s eta 0:00:01
    74% |#######################         | 61kB 28.6MB/s eta 0:00:01
    79% |#########################       | 65kB 28.5MB/s eta 0:00:01
    84% |###########################     | 69kB 28.9MB/s eta 0:00:01
    89% |############################    | 73kB 29.8MB/s eta 0:00:01
    94% |##############################  | 77kB 29.9MB/s eta 0:00:01
    99% |############################### | 81kB 28.3MB/s eta 0:00:01
    100% |################################| 86kB 4.1MB/s 
Collecting cov-core>=1.14.0 (from pytest-cov<1.9,>=1.8->pantsbuild.pants==0.0.80)
  Downloading cov-core-1.15.0.tar.gz
Collecting twitter.common.options==0.3.4 (from twitter.common.log==0.3.4->twitter.common.confluence<0.4,>=0.3.1->pantsbuild.pants==0.0.80)
  Downloading twitter.common.options-0.3.4.tar.gz
Building wheels for collected packages: pantsbuild.pants, twitter.common.collections, pathspec,
twitter.common.dirutil, ansicolors, pystache, psutil, Markdown, Pygments, docutils, twitter.common.confluence,
zincutils, coverage, pytest, pytest-cov, setproctitle, pywatchman, twitter.common.lang, twitter.common.log,
cov-core, twitter.common.options
  Running setup.py bdist_wheel for pantsbuild.pants
  Stored in directory: /aurora/.cache/pip/wheels/48/62/17/4f31c622c372daa09d5a7a88c11f11d0f95e7607234fcaf467
  Running setup.py bdist_wheel for twitter.common.collections
  Stored in directory: /aurora/.cache/pip/wheels/22/95/58/b1bb2d6215df640704e5f042961849cd5065e9de06b1dc45ff
  Running setup.py bdist_wheel for pathspec
  Stored in directory: /aurora/.cache/pip/wheels/05/fc/50/1a7e8fc57b03fe4c1299f1cf04e89ac8606614769ca65a9f5f
  Running setup.py bdist_wheel for twitter.common.dirutil
  Stored in directory: /aurora/.cache/pip/wheels/76/53/02/30c6555526a37b47c12707315e49cc80a00f4ed460eeadae27
  Running setup.py bdist_wheel for ansicolors
  Stored in directory: /aurora/.cache/pip/wheels/3a/e9/7a/d539da1af316475bbfe0710f15249d194ccf96755293af318d
  Running setup.py bdist_wheel for pystache
  Stored in directory: /aurora/.cache/pip/wheels/9f/ad/66/0c671b563cdf76d88f1ab37a9db5e1804e2dd32cff0e70454e
  Running setup.py bdist_wheel for psutil
  Stored in directory: /aurora/.cache/pip/wheels/b7/ab/a3/e2163d42dd018b3e7f4345b27155c636740d08518756700c53
  Running setup.py bdist_wheel for Markdown
  Stored in directory: /aurora/.cache/pip/wheels/54/57/5d/d85a28804ddffc92283587426652d63ed9578cc01fbf6be957
  Running setup.py bdist_wheel for Pygments
  Stored in directory: /aurora/.cache/pip/wheels/ea/0e/59/c878cc73abc93eff6f42d83a924b5901f4163c3c9e1e1ffc1f
  Running setup.py bdist_wheel for docutils
  Stored in directory: /aurora/.cache/pip/wheels/db/de/bd/b99b1e12d321fbc950766c58894c6576b1a73ae3131b29a151
  Running setup.py bdist_wheel for twitter.common.confluence
  Stored in directory: /aurora/.cache/pip/wheels/90/18/a8/d677845746312f8516cd6a01a0b85e0f67f9ab749e43a97cae
  Running setup.py bdist_wheel for zincutils
  Stored in directory: /aurora/.cache/pip/wheels/73/6a/2d/857f0489540ab349dd98f4a42c0304752b823384081f7ea48b
  Running setup.py bdist_wheel for coverage
  Stored in directory: /aurora/.cache/pip/wheels/09/d5/14/fad8864342631171117f01b9b2473a07c053e5c1054d40e48c
  Running setup.py bdist_wheel for pytest
  Stored in directory: /aurora/.cache/pip/wheels/ca/1c/fe/8b76e537572f91c810910e822cccb178ba3156e432e644ac89
  Running setup.py bdist_wheel for pytest-cov
  Stored in directory: /aurora/.cache/pip/wheels/e5/94/08/eab43cda4e17e6ae729ed2cd832d7ca4e3ddca7fa6886ec2b8
  Running setup.py bdist_wheel for setproctitle
  Stored in directory: /aurora/.cache/pip/wheels/92/60/bb/4befe8cc3a0f788bb05e52dca267e8518c1945ec4a333e8a6e
  Running setup.py bdist_wheel for pywatchman
  Stored in directory: /aurora/.cache/pip/wheels/a2/9e/3d/0788616f9838aac6679fc49331c4330a909d59a71705c5cd4a
  Running setup.py bdist_wheel for twitter.common.lang
  Stored in directory: /aurora/.cache/pip/wheels/f8/19/5b/a692ceccd33ecc58cb76355907bf2c5b731ea55f2d327b3733
  Running setup.py bdist_wheel for twitter.common.log
  Stored in directory: /aurora/.cache/pip/wheels/ae/21/7b/3acc42071d312adee241fae3dffe98d48253de8f898bd3849a
  Running setup.py bdist_wheel for cov-core
  Stored in directory: /aurora/.cache/pip/wheels/86/e1/c2/9ff8cfe9773ce07003f2c2be096e169af4614c2f634671d49b
  Running setup.py bdist_wheel for twitter.common.options
  Stored in directory: /aurora/.cache/pip/wheels/25/6c/16/b1b9b9ee2b552fafda05238ae29eefd587f87cd150fc04e2be
Successfully built pantsbuild.pants twitter.common.collections pathspec twitter.common.dirutil
ansicolors pystache psutil Markdown Pygments docutils twitter.common.confluence zincutils
coverage pytest pytest-cov setproctitle pywatchman twitter.common.lang twitter.common.log
cov-core twitter.common.options
Installing collected packages: twitter.common.lang, twitter.common.collections, six, pathspec,
twitter.common.dirutil, ansicolors, requests, pystache, psutil, setuptools, pex, Markdown,
Pygments, docutils, twitter.common.options, twitter.common.log, twitter.common.confluence,
monotonic, fasteners, zincutils, coverage, py, pytest, cov-core, pytest-cov, setproctitle,
pywatchman, futures, pantsbuild.pants
  Found existing installation: setuptools 18.0.1
    Uninstalling setuptools-18.0.1:
      Successfully uninstalled setuptools-18.0.1
Successfully installed Markdown-2.1.1 Pygments-1.4 ansicolors-1.0.2 cov-core-1.15.0 coverage-3.7.1
docutils-0.12 fasteners-0.14.1 futures-3.0.5 monotonic-1.1 pantsbuild.pants-0.0.80 pathspec-0.3.4
pex-1.1.4 psutil-3.1.1 py-1.4.31 pystache-0.5.3 pytest-2.6.4 pytest-cov-1.8.1 pywatchman-1.2.0
requests-2.5.3 setproctitle-1.1.9 setuptools-5.4.1 six-1.10.0 twitter.common.collections-0.3.4
twitter.common.confluence-0.3.4 twitter.common.dirutil-0.3.4 twitter.common.lang-0.3.4 twitter.common.log-0.3.4
twitter.common.options-0.3.4 zincutils-0.3.1
fatal: Not a git repository (or any of the parent directories): .git

00:50:18 00:00 [main]
               (To run a reporting server: ./pants server)
00:50:18 00:00   [setup]
00:50:18 00:00     [parse]fatal: Not a git repository (or any of the parent directories):
.git

               Executing tasks in goals: bootstrap -> imports -> unpack-jars -> deferred-sources
-> gen -> jvm-platform-validate -> resolve -> compile -> resources -> binary
00:50:18 00:00   [bootstrap]
00:50:18 00:00     [jar-dependency-management]
00:50:18 00:00     [bootstrap-jvm-tools]
00:50:18 00:00   [imports]
00:50:18 00:00     [ivy-imports]
00:50:18 00:00   [unpack-jars]
00:50:18 00:00     [unpack-jars]
00:50:18 00:00   [deferred-sources]
00:50:18 00:00     [deferred-sources]
00:50:18 00:00   [gen]
00:50:18 00:00     [thrift]
00:50:18 00:00     [protoc]
00:50:18 00:00     [antlr]
00:50:18 00:00     [ragel]
00:50:18 00:00     [jaxb]
00:50:18 00:00     [wire]
00:50:18 00:00   [jvm-platform-validate]
00:50:18 00:00     [jvm-platform-validate]
00:50:19 00:01   [resolve]
00:50:19 00:01     [ivy]
00:50:19 00:01       [cache] INFO] 
Downloading https://repo1.maven.org/maven2/org/apache/ivy/ivy/2.4.0/ivy-2.4.0.jar

  0% .                                                    30 KB
  0% ..                                                   60 KB
  0% ...                                                  80 KB
  0% ....                                                110 KB
  0% .....                                               130 KB
  0% ......                                              160 KB
  0% .......                                             180 KB
  0% ........                                            210 KB
  0% .........                                           230 KB
  0% ..........                                          260 KB
  0% ...........                                         280 KB
  0% ............                                        310 KB
  0% .............                                       330 KB
  0% ..............                                      360 KB
  0% ...............                                     380 KB
  0% ................                                    410 KB
  0% .................                                   430 KB
  0% ..................                                  460 KB
  0% ...................                                 480 KB
  0% ....................                                510 KB
  0% .....................                               530 KB
  0% ......................                              560 KB
  0% .......................                             580 KB
  0% ........................                            610 KB
  0% .........................                           630 KB
  0% ..........................                          660 KB
  0% ...........................                         680 KB
  0% ............................                        710 KB
  0% .............................                       730 KB
  0% ..............................                      760 KB
  0% ...............................                     780 KB
  0% ................................                    810 KB
  0% .................................                   830 KB
  0% ..................................                  860 KB
  0% ...................................                 880 KB
  0% ....................................                910 KB
  0% .....................................               930 KB
  0% ......................................              960 KB
  0% .......................................             980 KB
  0% ........................................           1010 KB
  0% .........................................          1030 KB
  0% ..........................................         1060 KB
  0% ...........................................        1080 KB
  0% ............................................       1110 KB
  0% .............................................      1130 KB
  0% ..............................................     1160 KB
  0% ...............................................    1180 KB
  0% ................................................   1210 KB
  0% .................................................  1230 KB
100% .................................................. 1252 KB 0.522s
INFO] sha1: 5abe4c24bbe992a9ac07ca563d5bd3e8d569e9ed

00:50:19 00:01       [ivy-bootstrap]
00:50:22 00:04       [bootstrap-nailgun-server]
                   Caching artifacts for 1 target.
00:50:25 00:07   [compile]
00:50:25 00:07     [compile-jvm-prep-command]
00:50:25 00:07       [jvm_prep_command]
00:50:25 00:07     [compile-prep-command]
00:50:25 00:07     [python-eval]
00:50:25 00:07     [pythonstyle]
00:50:25 00:07       [cache]       
                   No cached artifacts for 7 targets.
                   Invalidated 7 targets.
00:50:30 00:12     [compile]
00:50:30 00:12     [zinc]
00:50:30 00:12     [jvm-dep-check]
00:50:30 00:12   [resources]
00:50:30 00:12     [prepare]
00:50:30 00:12     [services]
00:50:30 00:12   [binary]
00:50:30 00:12     [binary-jvm-prep-command]
00:50:30 00:12       [jvm_prep_command]
00:50:30 00:12     [binary-prep-command]
00:50:30 00:12     [python-binary-create]
00:50:34 00:16       [chroot]INFO] Attempting to fetch thrift binary from: https://dl.bintray.com/pantsbuild/bin/build-support/bin/thrift/linux/x86_64/0.9.1/thrift
...

FAILURE: Failed to fetch binary bin/thrift/linux/x86_64/0.9.1/thrift from any source: (Failed
to fetch binary from https://dl.bintray.com/pantsbuild/bin/build-support/bin/thrift/linux/x86_64/0.9.1/thrift:
Problem GETing data from https://dl.bintray.com/pantsbuild/bin/build-support/bin/thrift/linux/x86_64/0.9.1/thrift:
HTTPSConnectionPool(host='akamai.bintray.com', port=443): Read timed out. (read timeout=1.0))


               Waiting for background workers to finish.
00:50:36 00:18   [complete]
               FAILURE
make[1]: *** [__pants_build] Error 1
make[1]: Leaving directory `/scratch'
make: *** [build] Error 2
dpkg-buildpackage: error: debian/rules build gave error exit status 2
Build step 'Execute shell' marked build as failure
Skipped archiving because build is not successful

Mime
View raw message