aurora-dev mailing list archives

Site index · List index
Message view « Date » · « Thread »
Top « Date » · « Thread »
From Apache Jenkins Server <jenk...@builds.apache.org>
Subject Build failed in Jenkins: aurora-packaging-nightly #318
Date Tue, 31 May 2016 01:01:55 GMT
See <https://builds.apache.org/job/aurora-packaging-nightly/318/>

------------------------------------------
[...truncated 17579 lines...]
    37% |###########                     | 356kB 29.2MB/s eta 0:00:01
    37% |############                    | 360kB 26.6MB/s eta 0:00:01
    37% |############                    | 364kB 26.0MB/s eta 0:00:01
    38% |############                    | 368kB 26.3MB/s eta 0:00:01
    38% |############                    | 372kB 26.2MB/s eta 0:00:01
    39% |############                    | 376kB 24.9MB/s eta 0:00:01
    39% |############                    | 380kB 24.0MB/s eta 0:00:01
    40% |############                    | 385kB 24.7MB/s eta 0:00:01
    40% |############                    | 389kB 24.8MB/s eta 0:00:01
    40% |#############                   | 393kB 3.8MB/s eta 0:00:01
    41% |#############                   | 397kB 3.8MB/s eta 0:00:01
    41% |#############                   | 401kB 3.8MB/s eta 0:00:01
    42% |#############                   | 405kB 3.9MB/s eta 0:00:01
    42% |#############                   | 409kB 3.8MB/s eta 0:00:01
    43% |#############                   | 413kB 3.8MB/s eta 0:00:01
    43% |#############                   | 417kB 3.8MB/s eta 0:00:01
    43% |##############                  | 421kB 3.9MB/s eta 0:00:01
    44% |##############                  | 425kB 3.8MB/s eta 0:00:01
    44% |##############                  | 430kB 3.8MB/s eta 0:00:01
    45% |##############                  | 434kB 24.0MB/s eta 0:00:01
    45% |##############                  | 438kB 24.5MB/s eta 0:00:01
    46% |##############                  | 442kB 23.5MB/s eta 0:00:01
    46% |##############                  | 446kB 23.3MB/s eta 0:00:01
    46% |###############                 | 450kB 24.9MB/s eta 0:00:01
    47% |###############                 | 454kB 24.3MB/s eta 0:00:01
    47% |###############                 | 458kB 22.1MB/s eta 0:00:01
    48% |###############                 | 462kB 21.4MB/s eta 0:00:01
    48% |###############                 | 466kB 21.3MB/s eta 0:00:01
    49% |###############                 | 471kB 20.5MB/s eta 0:00:01
    49% |###############                 | 475kB 18.9MB/s eta 0:00:01
    49% |###############                 | 479kB 18.5MB/s eta 0:00:01
    50% |################                | 483kB 18.8MB/s eta 0:00:01
    50% |################                | 487kB 18.6MB/s eta 0:00:01
    51% |################                | 491kB 17.5MB/s eta 0:00:01
    51% |################                | 495kB 17.5MB/s eta 0:00:01
    52% |################                | 499kB 18.7MB/s eta 0:00:01
    52% |################                | 503kB 18.8MB/s eta 0:00:01
    52% |################                | 507kB 18.2MB/s eta 0:00:01
    53% |#################               | 512kB 18.6MB/s eta 0:00:01
    53% |#################               | 516kB 19.6MB/s eta 0:00:01
    54% |#################               | 520kB 19.7MB/s eta 0:00:01
    54% |#################               | 524kB 19.0MB/s eta 0:00:01
    54% |#################               | 528kB 18.5MB/s eta 0:00:01
    55% |#################               | 532kB 19.4MB/s eta 0:00:01
    55% |#################               | 536kB 19.5MB/s eta 0:00:01
    56% |##################              | 540kB 18.8MB/s eta 0:00:01
    56% |##################              | 544kB 18.8MB/s eta 0:00:01
    57% |##################              | 548kB 18.6MB/s eta 0:00:01
    57% |##################              | 552kB 18.9MB/s eta 0:00:01
    57% |##################              | 557kB 19.0MB/s eta 0:00:01
    58% |##################              | 561kB 19.5MB/s eta 0:00:01
    58% |##################              | 565kB 20.8MB/s eta 0:00:01
    59% |##################              | 569kB 21.8MB/s eta 0:00:01
    59% |###################             | 573kB 21.9MB/s eta 0:00:01
    60% |###################             | 577kB 22.7MB/s eta 0:00:01
    60% |###################             | 581kB 24.5MB/s eta 0:00:01
    60% |###################             | 585kB 25.5MB/s eta 0:00:01
    61% |###################             | 589kB 27.9MB/s eta 0:00:01
    61% |###################             | 593kB 28.5MB/s eta 0:00:01
    62% |###################             | 598kB 28.7MB/s eta 0:00:01
    62% |####################            | 602kB 28.7MB/s eta 0:00:01
    63% |####################            | 606kB 27.9MB/s eta 0:00:01
    63% |####################            | 610kB 1.4MB/s eta 0:00:01
    63% |####################            | 614kB 1.4MB/s eta 0:00:01
    64% |####################            | 618kB 1.4MB/s eta 0:00:01
    64% |####################            | 622kB 1.4MB/s eta 0:00:01
    65% |####################            | 626kB 1.4MB/s eta 0:00:01
    65% |#####################           | 630kB 1.4MB/s eta 0:00:01
    66% |#####################           | 634kB 1.4MB/s eta 0:00:01
    66% |#####################           | 638kB 1.4MB/s eta 0:00:01
    66% |#####################           | 643kB 1.4MB/s eta 0:00:01
    67% |#####################           | 647kB 1.4MB/s eta 0:00:01
    67% |#####################           | 651kB 20.1MB/s eta 0:00:01
    68% |#####################           | 655kB 21.1MB/s eta 0:00:01
    68% |#####################           | 659kB 21.2MB/s eta 0:00:01
    69% |######################          | 663kB 21.8MB/s eta 0:00:01
    69% |######################          | 667kB 21.9MB/s eta 0:00:01
    69% |######################          | 671kB 21.4MB/s eta 0:00:01
    70% |######################          | 675kB 27.5MB/s eta 0:00:01
    70% |######################          | 679kB 26.9MB/s eta 0:00:01
    71% |######################          | 684kB 26.4MB/s eta 0:00:01
    71% |######################          | 688kB 25.2MB/s eta 0:00:01
    72% |#######################         | 692kB 26.0MB/s eta 0:00:01
    72% |#######################         | 696kB 26.8MB/s eta 0:00:01
    72% |#######################         | 700kB 26.9MB/s eta 0:00:01
    73% |#######################         | 704kB 24.8MB/s eta 0:00:01
    73% |#######################         | 708kB 23.5MB/s eta 0:00:01
    74% |#######################         | 712kB 23.3MB/s eta 0:00:01
    74% |#######################         | 716kB 22.7MB/s eta 0:00:01
    75% |########################        | 720kB 21.7MB/s eta 0:00:01
    75% |########################        | 724kB 21.0MB/s eta 0:00:01
    75% |########################        | 729kB 21.3MB/s eta 0:00:01
    76% |########################        | 733kB 21.1MB/s eta 0:00:01
    76% |########################        | 737kB 20.5MB/s eta 0:00:01
    77% |########################        | 741kB 20.3MB/s eta 0:00:01
    77% |########################        | 745kB 13.6MB/s eta 0:00:01
    78% |########################        | 749kB 13.2MB/s eta 0:00:01
    78% |#########################       | 753kB 12.8MB/s eta 0:00:01
    78% |#########################       | 757kB 12.9MB/s eta 0:00:01
    79% |#########################       | 761kB 13.7MB/s eta 0:00:01
    79% |#########################       | 765kB 14.0MB/s eta 0:00:01
    80% |#########################       | 770kB 14.0MB/s eta 0:00:01
    80% |#########################       | 774kB 14.1MB/s eta 0:00:01
    80% |#########################       | 778kB 14.3MB/s eta 0:00:01
    81% |##########################      | 782kB 14.3MB/s eta 0:00:01
    81% |##########################      | 786kB 22.9MB/s eta 0:00:01
    82% |##########################      | 790kB 24.9MB/s eta 0:00:01
    82% |##########################      | 794kB 27.1MB/s eta 0:00:01
    83% |##########################      | 798kB 27.5MB/s eta 0:00:01
    83% |##########################      | 802kB 27.0MB/s eta 0:00:01
    83% |##########################      | 806kB 26.9MB/s eta 0:00:01
    84% |###########################     | 811kB 27.8MB/s eta 0:00:01
    84% |###########################     | 815kB 27.4MB/s eta 0:00:01
    85% |###########################     | 819kB 26.6MB/s eta 0:00:01
    85% |###########################     | 823kB 26.5MB/s eta 0:00:01
    86% |###########################     | 827kB 27.3MB/s eta 0:00:01
    86% |###########################     | 831kB 27.9MB/s eta 0:00:01
    86% |###########################     | 835kB 27.0MB/s eta 0:00:01
    87% |###########################     | 839kB 27.0MB/s eta 0:00:01
    87% |############################    | 843kB 27.6MB/s eta 0:00:01
    88% |############################    | 847kB 27.7MB/s eta 0:00:01
    88% |############################    | 851kB 26.9MB/s eta 0:00:01
    89% |############################    | 856kB 27.2MB/s eta 0:00:01
    89% |############################    | 860kB 28.1MB/s eta 0:00:01
    89% |############################    | 864kB 28.3MB/s eta 0:00:01
    90% |############################    | 868kB 27.4MB/s eta 0:00:01
    90% |#############################   | 872kB 27.0MB/s eta 0:00:01
    91% |#############################   | 876kB 27.9MB/s eta 0:00:01
    91% |#############################   | 880kB 27.8MB/s eta 0:00:01
    92% |#############################   | 884kB 27.3MB/s eta 0:00:01
    92% |#############################   | 888kB 27.2MB/s eta 0:00:01
    92% |#############################   | 892kB 28.1MB/s eta 0:00:01
    93% |#############################   | 897kB 28.1MB/s eta 0:00:01
    93% |##############################  | 901kB 26.9MB/s eta 0:00:01
    94% |##############################  | 905kB 26.8MB/s eta 0:00:01
    94% |##############################  | 909kB 27.5MB/s eta 0:00:01
    95% |##############################  | 913kB 27.9MB/s eta 0:00:01
    95% |##############################  | 917kB 27.1MB/s eta 0:00:01
    95% |##############################  | 921kB 27.1MB/s eta 0:00:01
    96% |##############################  | 925kB 27.7MB/s eta 0:00:01
    96% |##############################  | 929kB 27.7MB/s eta 0:00:01
    97% |############################### | 933kB 26.9MB/s eta 0:00:01
    97% |############################### | 937kB 26.8MB/s eta 0:00:01
    98% |############################### | 942kB 27.9MB/s eta 0:00:01
    98% |############################### | 946kB 28.1MB/s eta 0:00:01
    98% |############################### | 950kB 27.4MB/s eta 0:00:01
    99% |############################### | 954kB 27.1MB/s eta 0:00:01
    99% |############################### | 958kB 27.9MB/s eta 0:00:01
    100% |################################| 962kB 400kB/s 
Collecting twitter.common.collections<0.4,>=0.3.1 (from pantsbuild.pants)
Collecting six<2,>=1.9.0 (from pantsbuild.pants)
  Using cached six-1.10.0-py2.py3-none-any.whl
Collecting pathspec==0.3.4 (from pantsbuild.pants)
Collecting twitter.common.dirutil<0.4,>=0.3.1 (from pantsbuild.pants)
Collecting ansicolors==1.0.2 (from pantsbuild.pants)
Collecting requests<2.6,>=2.5.0 (from pantsbuild.pants)
  Using cached requests-2.5.3-py2.py3-none-any.whl
Collecting pystache==0.5.3 (from pantsbuild.pants)
Collecting psutil==3.1.1 (from pantsbuild.pants)
Collecting pex==1.1.2 (from pantsbuild.pants)
  Downloading pex-1.1.2-py2.py3-none-any.whl (96kB)

    4% |#                               | 4.1kB 11.2MB/s eta 0:00:01
    8% |##                              | 8.2kB 11.3MB/s eta 0:00:01
    12% |####                            | 12kB 12.2MB/s eta 0:00:01
    16% |#####                           | 16kB 12.5MB/s eta 0:00:01
    21% |######                          | 20kB 12.8MB/s eta 0:00:01
    25% |########                        | 24kB 13.2MB/s eta 0:00:01
    29% |#########                       | 28kB 13.5MB/s eta 0:00:01
    33% |##########                      | 32kB 13.5MB/s eta 0:00:01
    38% |############                    | 36kB 14.2MB/s eta 0:00:01
    42% |#############                   | 40kB 15.0MB/s eta 0:00:01
    46% |##############                  | 45kB 16.2MB/s eta 0:00:01
    50% |################                | 49kB 17.3MB/s eta 0:00:01
    54% |#################               | 53kB 18.0MB/s eta 0:00:01
    59% |##################              | 57kB 19.4MB/s eta 0:00:01
    63% |####################            | 61kB 20.5MB/s eta 0:00:01
    67% |#####################           | 65kB 21.3MB/s eta 0:00:01
    71% |######################          | 69kB 22.6MB/s eta 0:00:01
    76% |########################        | 73kB 24.6MB/s eta 0:00:01
    80% |#########################       | 77kB 23.7MB/s eta 0:00:01
    84% |###########################     | 81kB 23.0MB/s eta 0:00:01
    88% |############################    | 86kB 23.0MB/s eta 0:00:01
    92% |#############################   | 90kB 23.7MB/s eta 0:00:01
    97% |############################### | 94kB 23.9MB/s eta 0:00:01
    100% |################################| 98kB 3.5MB/s 
Collecting setuptools==5.4.1 (from pantsbuild.pants)
  Using cached setuptools-5.4.1-py2.py3-none-any.whl
Collecting Markdown==2.1.1 (from pantsbuild.pants)
Collecting Pygments==1.4 (from pantsbuild.pants)
Collecting docutils<0.13,>=0.12 (from pantsbuild.pants)
Collecting twitter.common.confluence<0.4,>=0.3.1 (from pantsbuild.pants)
Collecting fasteners==0.14.1 (from pantsbuild.pants)
  Using cached fasteners-0.14.1-py2.py3-none-any.whl
Collecting coverage<3.8,>=3.7 (from pantsbuild.pants)
Collecting pytest<2.7,>=2.6 (from pantsbuild.pants)
Collecting pytest-cov<1.9,>=1.8 (from pantsbuild.pants)
Collecting setproctitle==1.1.9 (from pantsbuild.pants)
Collecting pywatchman==1.3.0 (from pantsbuild.pants)
  Downloading pywatchman-1.3.0.tar.gz
Collecting futures==3.0.5 (from pantsbuild.pants)
  Using cached futures-3.0.5-py2-none-any.whl
Collecting twitter.common.lang==0.3.4 (from twitter.common.collections<0.4,>=0.3.1->pantsbuild.pants)
Collecting twitter.common.log==0.3.4 (from twitter.common.confluence<0.4,>=0.3.1->pantsbuild.pants)
Collecting monotonic>=0.1 (from fasteners==0.14.1->pantsbuild.pants)
  Using cached monotonic-1.1-py2.py3-none-any.whl
Collecting py>=1.4.25 (from pytest<2.7,>=2.6->pantsbuild.pants)
  Using cached py-1.4.31-py2.py3-none-any.whl
Collecting cov-core>=1.14.0 (from pytest-cov<1.9,>=1.8->pantsbuild.pants)
Collecting twitter.common.options==0.3.4 (from twitter.common.log==0.3.4->twitter.common.confluence<0.4,>=0.3.1->pantsbuild.pants)
Building wheels for collected packages: pantsbuild.pants, pywatchman
  Running setup.py bdist_wheel for pantsbuild.pants
  Stored in directory: /aurora/.cache/pip/wheels/57/0b/fd/440438c8a48a329d38900f36155cae22a794a9fa2d65d30382
  Running setup.py bdist_wheel for pywatchman
  Stored in directory: /aurora/.cache/pip/wheels/72/10/43/28655ed4bb6bd65cfee7d3e377b05c1218ba5ccfc52da4e1c4
Successfully built pantsbuild.pants pywatchman
Installing collected packages: twitter.common.lang, twitter.common.collections, six, pathspec,
twitter.common.dirutil, ansicolors, requests, pystache, psutil, setuptools, pex, Markdown,
Pygments, docutils, twitter.common.options, twitter.common.log, twitter.common.confluence,
monotonic, fasteners, coverage, py, pytest, cov-core, pytest-cov, setproctitle, pywatchman,
futures, pantsbuild.pants
  Found existing installation: setuptools 18.0.1
    Uninstalling setuptools-18.0.1:
      Successfully uninstalled setuptools-18.0.1
Successfully installed Markdown-2.1.1 Pygments-1.4 ansicolors-1.0.2 cov-core-1.15.0 coverage-3.7.1
docutils-0.12 fasteners-0.14.1 futures-3.0.5 monotonic-1.1 pantsbuild.pants-1.0.0 pathspec-0.3.4
pex-1.1.2 psutil-3.1.1 py-1.4.31 pystache-0.5.3 pytest-2.6.4 pytest-cov-1.8.1 pywatchman-1.3.0
requests-2.5.3 setproctitle-1.1.9 setuptools-5.4.1 six-1.10.0 twitter.common.collections-0.3.4
twitter.common.confluence-0.3.4 twitter.common.dirutil-0.3.4 twitter.common.lang-0.3.4 twitter.common.log-0.3.4
twitter.common.options-0.3.4
Exception caught: (<class 'pants.base.exceptions.BuildConfigurationError'>)
  File "/aurora/.cache/pants/setup/bootstrap-Linux-x86_64/unspecified/bin/pants", line 11,
in <module>
    sys.exit(main())
  File "/aurora/.cache/pants/setup/bootstrap-Linux-x86_64/pants.SgKPKo/install/local/lib/python2.7/site-packages/pants/bin/pants_exe.py",
line 44, in main
    PantsRunner(exiter).run()
  File "/aurora/.cache/pants/setup/bootstrap-Linux-x86_64/pants.SgKPKo/install/local/lib/python2.7/site-packages/pants/bin/pants_runner.py",
line 53, in run
    options_bootstrapper=options_bootstrapper)
  File "/aurora/.cache/pants/setup/bootstrap-Linux-x86_64/pants.SgKPKo/install/local/lib/python2.7/site-packages/pants/bin/pants_runner.py",
line 43, in _run
    return LocalPantsRunner(exiter, args, env, options_bootstrapper=options_bootstrapper).run()
  File "/aurora/.cache/pants/setup/bootstrap-Linux-x86_64/pants.SgKPKo/install/local/lib/python2.7/site-packages/pants/bin/local_pants_runner.py",
line 49, in run
    self._maybe_profiled(self._run)
  File "/aurora/.cache/pants/setup/bootstrap-Linux-x86_64/pants.SgKPKo/install/local/lib/python2.7/site-packages/pants/bin/local_pants_runner.py",
line 46, in _maybe_profiled
    runner()
  File "/aurora/.cache/pants/setup/bootstrap-Linux-x86_64/pants.SgKPKo/install/local/lib/python2.7/site-packages/pants/bin/local_pants_runner.py",
line 55, in _run
    options, build_config = OptionsInitializer(options_bootstrapper, exiter=self._exiter).setup()
  File "/aurora/.cache/pants/setup/bootstrap-Linux-x86_64/pants.SgKPKo/install/local/lib/python2.7/site-packages/pants/bin/goal_runner.py",
line 129, in setup
    return self._setup_options(self._options_bootstrapper, self._working_set)
  File "/aurora/.cache/pants/setup/bootstrap-Linux-x86_64/pants.SgKPKo/install/local/lib/python2.7/site-packages/pants/bin/goal_runner.py",
line 88, in _setup_options
    global_bootstrap_options.pants_version, pants_version()

Exception message: Version mismatch: Requested version was 0.0.80, our version is 1.0.0.

make[1]: *** [__pants_build] Error 1
make[1]: Leaving directory `/scratch'
make: *** [build] Error 2
dpkg-buildpackage: error: debian/rules build gave error exit status 2
Build step 'Execute shell' marked build as failure
Skipped archiving because build is not successful

Mime
View raw message