aurora-dev mailing list archives

Site index · List index
Message view « Date » · « Thread »
Top « Date » · « Thread »
From Apache Jenkins Server <jenk...@builds.apache.org>
Subject Build failed in Jenkins: Aurora #1487
Date Mon, 18 Apr 2016 16:23:25 GMT
See <https://builds.apache.org/job/Aurora/1487/changes>

Changes:

[jcohen] Add an explicit box version to Vagrantfile.

------------------------------------------
[...truncated 2325 lines...]
Building PHP Library ......... : no
Building Erlang Library ...... : no
Building Go Library .......... : no
Building D Library ........... : no

If something is missing that you think should be present,
please skim the output of configure to find the missing
component.  Details are present in config.log.
make[1]: Entering directory `<https://builds.apache.org/job/Aurora/ws/build-support/thrift/thrift-0.9.1'>
make  all-recursive
make[2]: Entering directory `<https://builds.apache.org/job/Aurora/ws/build-support/thrift/thrift-0.9.1'>
Making all in compiler/cpp
make[3]: Entering directory `<https://builds.apache.org/job/Aurora/ws/build-support/thrift/thrift-0.9.1/compiler/cpp'>
make  all-am
make[4]: Entering directory `<https://builds.apache.org/job/Aurora/ws/build-support/thrift/thrift-0.9.1/compiler/cpp'>
g++ -DHAVE_CONFIG_H -I. -I../.. -I../../lib/cpp/src/thrift  -I./src  -Wall -Wno-sign-compare
-Wno-unused -g -O2 -c -o libparse_a-thrifty.o `test -f 'thrifty.cc' || echo './'`thrifty.cc
g++ -DHAVE_CONFIG_H -I. -I../.. -I../../lib/cpp/src/thrift  -I./src  -Wall -Wno-sign-compare
-Wno-unused -g -O2 -c -o libparse_a-thriftl.o `test -f 'thriftl.cc' || echo './'`thriftl.cc
g++ -DHAVE_CONFIG_H -I. -I../.. -I../../lib/cpp/src/thrift  -I./src  -Wall -g -O2 -c -o thrift-main.o
`test -f 'src/main.cc' || echo './'`src/main.cc
gcc -DHAVE_CONFIG_H -I. -I../.. -I../../lib/cpp/src/thrift  -I./src   -g -O2 -c -o thrift-md5.o
`test -f 'src/md5.c' || echo './'`src/md5.c
g++ -DHAVE_CONFIG_H -I. -I../.. -I../../lib/cpp/src/thrift  -I./src  -Wall -g -O2 -c -o thrift-t_generator.o
`test -f 'src/generate/t_generator.cc' || echo './'`src/generate/t_generator.cc
g++ -DHAVE_CONFIG_H -I. -I../.. -I../../lib/cpp/src/thrift  -I./src  -Wall -g -O2 -c -o thrift-parse.o
`test -f 'src/parse/parse.cc' || echo './'`src/parse/parse.cc
g++ -DHAVE_CONFIG_H -I. -I../.. -I../../lib/cpp/src/thrift  -I./src  -Wall -g -O2 -c -o thrift-t_c_glib_generator.o
`test -f 'src/generate/t_c_glib_generator.cc' || echo './'`src/generate/t_c_glib_generator.cc
g++ -DHAVE_CONFIG_H -I. -I../.. -I../../lib/cpp/src/thrift  -I./src  -Wall -g -O2 -c -o thrift-t_cpp_generator.o
`test -f 'src/generate/t_cpp_generator.cc' || echo './'`src/generate/t_cpp_generator.cc
g++ -DHAVE_CONFIG_H -I. -I../.. -I../../lib/cpp/src/thrift  -I./src  -Wall -g -O2 -c -o thrift-t_java_generator.o
`test -f 'src/generate/t_java_generator.cc' || echo './'`src/generate/t_java_generator.cc
g++ -DHAVE_CONFIG_H -I. -I../.. -I../../lib/cpp/src/thrift  -I./src  -Wall -g -O2 -c -o thrift-t_as3_generator.o
`test -f 'src/generate/t_as3_generator.cc' || echo './'`src/generate/t_as3_generator.cc
g++ -DHAVE_CONFIG_H -I. -I../.. -I../../lib/cpp/src/thrift  -I./src  -Wall -g -O2 -c -o thrift-t_csharp_generator.o
`test -f 'src/generate/t_csharp_generator.cc' || echo './'`src/generate/t_csharp_generator.cc
g++ -DHAVE_CONFIG_H -I. -I../.. -I../../lib/cpp/src/thrift  -I./src  -Wall -g -O2 -c -o thrift-t_py_generator.o
`test -f 'src/generate/t_py_generator.cc' || echo './'`src/generate/t_py_generator.cc
g++ -DHAVE_CONFIG_H -I. -I../.. -I../../lib/cpp/src/thrift  -I./src  -Wall -g -O2 -c -o thrift-t_rb_generator.o
`test -f 'src/generate/t_rb_generator.cc' || echo './'`src/generate/t_rb_generator.cc
g++ -DHAVE_CONFIG_H -I. -I../.. -I../../lib/cpp/src/thrift  -I./src  -Wall -g -O2 -c -o thrift-t_perl_generator.o
`test -f 'src/generate/t_perl_generator.cc' || echo './'`src/generate/t_perl_generator.cc
g++ -DHAVE_CONFIG_H -I. -I../.. -I../../lib/cpp/src/thrift  -I./src  -Wall -g -O2 -c -o thrift-t_php_generator.o
`test -f 'src/generate/t_php_generator.cc' || echo './'`src/generate/t_php_generator.cc
g++ -DHAVE_CONFIG_H -I. -I../.. -I../../lib/cpp/src/thrift  -I./src  -Wall -g -O2 -c -o thrift-t_erl_generator.o
`test -f 'src/generate/t_erl_generator.cc' || echo './'`src/generate/t_erl_generator.cc
g++ -DHAVE_CONFIG_H -I. -I../.. -I../../lib/cpp/src/thrift  -I./src  -Wall -g -O2 -c -o thrift-t_cocoa_generator.o
`test -f 'src/generate/t_cocoa_generator.cc' || echo './'`src/generate/t_cocoa_generator.cc
g++ -DHAVE_CONFIG_H -I. -I../.. -I../../lib/cpp/src/thrift  -I./src  -Wall -g -O2 -c -o thrift-t_st_generator.o
`test -f 'src/generate/t_st_generator.cc' || echo './'`src/generate/t_st_generator.cc
g++ -DHAVE_CONFIG_H -I. -I../.. -I../../lib/cpp/src/thrift  -I./src  -Wall -g -O2 -c -o thrift-t_ocaml_generator.o
`test -f 'src/generate/t_ocaml_generator.cc' || echo './'`src/generate/t_ocaml_generator.cc
g++ -DHAVE_CONFIG_H -I. -I../.. -I../../lib/cpp/src/thrift  -I./src  -Wall -g -O2 -c -o thrift-t_hs_generator.o
`test -f 'src/generate/t_hs_generator.cc' || echo './'`src/generate/t_hs_generator.cc
g++ -DHAVE_CONFIG_H -I. -I../.. -I../../lib/cpp/src/thrift  -I./src  -Wall -g -O2 -c -o thrift-t_xsd_generator.o
`test -f 'src/generate/t_xsd_generator.cc' || echo './'`src/generate/t_xsd_generator.cc
g++ -DHAVE_CONFIG_H -I. -I../.. -I../../lib/cpp/src/thrift  -I./src  -Wall -g -O2 -c -o thrift-t_html_generator.o
`test -f 'src/generate/t_html_generator.cc' || echo './'`src/generate/t_html_generator.cc
g++ -DHAVE_CONFIG_H -I. -I../.. -I../../lib/cpp/src/thrift  -I./src  -Wall -g -O2 -c -o thrift-t_js_generator.o
`test -f 'src/generate/t_js_generator.cc' || echo './'`src/generate/t_js_generator.cc
g++ -DHAVE_CONFIG_H -I. -I../.. -I../../lib/cpp/src/thrift  -I./src  -Wall -g -O2 -c -o thrift-t_javame_generator.o
`test -f 'src/generate/t_javame_generator.cc' || echo './'`src/generate/t_javame_generator.cc
g++ -DHAVE_CONFIG_H -I. -I../.. -I../../lib/cpp/src/thrift  -I./src  -Wall -g -O2 -c -o thrift-t_delphi_generator.o
`test -f 'src/generate/t_delphi_generator.cc' || echo './'`src/generate/t_delphi_generator.cc
g++ -DHAVE_CONFIG_H -I. -I../.. -I../../lib/cpp/src/thrift  -I./src  -Wall -g -O2 -c -o thrift-t_go_generator.o
`test -f 'src/generate/t_go_generator.cc' || echo './'`src/generate/t_go_generator.cc
g++ -DHAVE_CONFIG_H -I. -I../.. -I../../lib/cpp/src/thrift  -I./src  -Wall -g -O2 -c -o thrift-t_gv_generator.o
`test -f 'src/generate/t_gv_generator.cc' || echo './'`src/generate/t_gv_generator.cc
g++ -DHAVE_CONFIG_H -I. -I../.. -I../../lib/cpp/src/thrift  -I./src  -Wall -g -O2 -c -o thrift-t_d_generator.o
`test -f 'src/generate/t_d_generator.cc' || echo './'`src/generate/t_d_generator.cc
rm -f libparse.a
ar cru libparse.a libparse_a-thrifty.o libparse_a-thriftl.o 
ranlib libparse.a
/bin/bash ../../libtool --tag=CXX   --mode=link g++ -Wall -g -O2   -o thrift thrift-main.o
thrift-md5.o thrift-t_generator.o thrift-parse.o thrift-t_c_glib_generator.o thrift-t_cpp_generator.o
thrift-t_java_generator.o thrift-t_as3_generator.o thrift-t_csharp_generator.o thrift-t_py_generator.o
thrift-t_rb_generator.o thrift-t_perl_generator.o thrift-t_php_generator.o thrift-t_erl_generator.o
thrift-t_cocoa_generator.o thrift-t_st_generator.o thrift-t_ocaml_generator.o thrift-t_hs_generator.o
thrift-t_xsd_generator.o thrift-t_html_generator.o thrift-t_js_generator.o thrift-t_javame_generator.o
thrift-t_delphi_generator.o thrift-t_go_generator.o thrift-t_gv_generator.o thrift-t_d_generator.o
-lfl libparse.a 
libtool: link: g++ -Wall -g -O2 -o thrift thrift-main.o thrift-md5.o thrift-t_generator.o
thrift-parse.o thrift-t_c_glib_generator.o thrift-t_cpp_generator.o thrift-t_java_generator.o
thrift-t_as3_generator.o thrift-t_csharp_generator.o thrift-t_py_generator.o thrift-t_rb_generator.o
thrift-t_perl_generator.o thrift-t_php_generator.o thrift-t_erl_generator.o thrift-t_cocoa_generator.o
thrift-t_st_generator.o thrift-t_ocaml_generator.o thrift-t_hs_generator.o thrift-t_xsd_generator.o
thrift-t_html_generator.o thrift-t_js_generator.o thrift-t_javame_generator.o thrift-t_delphi_generator.o
thrift-t_go_generator.o thrift-t_gv_generator.o thrift-t_d_generator.o  -lfl libparse.a
make[4]: Leaving directory `<https://builds.apache.org/job/Aurora/ws/build-support/thrift/thrift-0.9.1/compiler/cpp'>
make[3]: Leaving directory `<https://builds.apache.org/job/Aurora/ws/build-support/thrift/thrift-0.9.1/compiler/cpp'>
Making all in lib
make[3]: Entering directory `<https://builds.apache.org/job/Aurora/ws/build-support/thrift/thrift-0.9.1/lib'>
make[4]: Entering directory `<https://builds.apache.org/job/Aurora/ws/build-support/thrift/thrift-0.9.1/lib'>
make[4]: Nothing to be done for `all-am'.
make[4]: Leaving directory `<https://builds.apache.org/job/Aurora/ws/build-support/thrift/thrift-0.9.1/lib'>
make[3]: Leaving directory `<https://builds.apache.org/job/Aurora/ws/build-support/thrift/thrift-0.9.1/lib'>
Making all in tutorial
make[3]: Entering directory `<https://builds.apache.org/job/Aurora/ws/build-support/thrift/thrift-0.9.1/tutorial'>
make[4]: Entering directory `<https://builds.apache.org/job/Aurora/ws/build-support/thrift/thrift-0.9.1/tutorial'>
../compiler/cpp/thrift --gen html -r ../tutorial/tutorial.thrift
make[4]: Leaving directory `<https://builds.apache.org/job/Aurora/ws/build-support/thrift/thrift-0.9.1/tutorial'>
make[3]: Leaving directory `<https://builds.apache.org/job/Aurora/ws/build-support/thrift/thrift-0.9.1/tutorial'>
Making all in tutorial
make[3]: Entering directory `<https://builds.apache.org/job/Aurora/ws/build-support/thrift/thrift-0.9.1/tutorial'>
make[4]: Entering directory `<https://builds.apache.org/job/Aurora/ws/build-support/thrift/thrift-0.9.1/tutorial'>
../compiler/cpp/thrift --gen html -r ../tutorial/tutorial.thrift
make[4]: Leaving directory `<https://builds.apache.org/job/Aurora/ws/build-support/thrift/thrift-0.9.1/tutorial'>
make[3]: Leaving directory `<https://builds.apache.org/job/Aurora/ws/build-support/thrift/thrift-0.9.1/tutorial'>
make[3]: Entering directory `<https://builds.apache.org/job/Aurora/ws/build-support/thrift/thrift-0.9.1'>
make[3]: Leaving directory `<https://builds.apache.org/job/Aurora/ws/build-support/thrift/thrift-0.9.1'>
make[2]: Leaving directory `<https://builds.apache.org/job/Aurora/ws/build-support/thrift/thrift-0.9.1'>
make[1]: Leaving directory `<https://builds.apache.org/job/Aurora/ws/build-support/thrift/thrift-0.9.1'>
make: Leaving directory `<https://builds.apache.org/job/Aurora/ws/build-support/thrift'>
:api:classesThriftNote: Some input files use unchecked or unsafe operations.
Note: Recompile with -Xlint:unchecked for details.

:api:checkPython
:api:generateThriftEntitiesJava
:api:classesThriftEntities
:api:compileJava UP-TO-DATE
:api:generateThriftResources
:api:processResources UP-TO-DATE
:api:classes
:api:jar
:commons:generateThriftJava
:commons:classesThriftNote: Some input files use unchecked or unsafe operations.
Note: Recompile with -Xlint:unchecked for details.

:commons-args:compileJava
:commons-args:processResources
:commons-args:classes
:commons-args:jar
:commons:compileJavaNote: Writing <https://builds.apache.org/job/Aurora/ws/commons/dist/classes/main/org/apache/aurora/common/args/apt/cmdline.arg.info.txt.1>
Note: Writing <https://builds.apache.org/job/Aurora/ws/commons/dist/classes/main/META-INF/compiler/resource-mappings/org.apache.aurora.common.args.apt.CmdLineProcessor>
Note: <https://builds.apache.org/job/Aurora/ws/commons/src/main/java/org/apache/aurora/common/testing/easymock/EasyMockTest.java>
uses or overrides a deprecated API.
Note: Recompile with -Xlint:deprecation for details.
Note: Some input files use unchecked or unsafe operations.
Note: Recompile with -Xlint:unchecked for details.

:commons:generateThriftResources
:commons:processResources
:commons:classes
:commons:jar
:compileJava<https://builds.apache.org/job/Aurora/ws/src/main/java/org/apache/aurora/scheduler/storage/log/WriteAheadStorage.java>:74:
Note: Wrote forwarder org.apache.aurora.scheduler.storage.log.WriteAheadStorageForwarder
@Forward({
^
Note: Writing <https://builds.apache.org/job/Aurora/ws/dist/classes/main/org/apache/aurora/common/args/apt/cmdline.arg.info.txt.2>
Note: Writing <https://builds.apache.org/job/Aurora/ws/dist/classes/main/META-INF/compiler/resource-mappings/org.apache.aurora.common.args.apt.CmdLineProcessor>

:generateBuildPropertieswarning: tag '0.3.0' is really 'rel/0.3.0' here

:processResources
:classes
:jar
:startScripts
:distTar
:distZip
:assemble
:compileJmhJavaNote: <https://builds.apache.org/job/Aurora/ws/src/jmh/java/org/apache/aurora/benchmark/fakes/FakeSchedulerDriver.java>
uses or overrides a deprecated API.
Note: Recompile with -Xlint:deprecation for details.

:processJmhResources UP-TO-DATE
:jmhClasses
:checkstyleJmh
:jsHint
:checkstyleMain
:compileTestJava<https://builds.apache.org/job/Aurora/ws/src/test/java/org/apache/aurora/scheduler/thrift/aop/MockDecoratedThrift.java>:38:
Note: Wrote forwarder org.apache.aurora.scheduler.thrift.aop.MockDecoratedThriftForwarder
@Forward(AnnotatedAuroraAdmin.class)
^
Note: Some input files use or override a deprecated API.
Note: Recompile with -Xlint:deprecation for details.

:processTestResources
:testClasses
:checkstyleTest
:findbugsJmh
:findbugsMain
:findbugsTest
:licenseJmh UP-TO-DATE
:licenseMain UP-TO-DATE
:licenseTest UP-TO-DATE
:license UP-TO-DATE
:pmdJmh
:pmdMain
:pmdTest
:testUnexpected exception thrown.
org.gradle.messaging.remote.internal.MessageIOException: Could not read message from '/127.0.0.1:46635'.
	at org.gradle.messaging.remote.internal.inet.SocketConnection.receive(SocketConnection.java:84)
	at org.gradle.messaging.remote.internal.hub.MessageHub$ConnectionReceive.run(MessageHub.java:235)
	at org.gradle.internal.concurrent.ExecutorPolicy$CatchAndRecordFailures.onExecute(ExecutorPolicy.java:54)
	at org.gradle.internal.concurrent.StoppableExecutorImpl$1.run(StoppableExecutorImpl.java:40)
	at java.util.concurrent.ThreadPoolExecutor.runWorker(ThreadPoolExecutor.java:1142)
	at java.util.concurrent.ThreadPoolExecutor$Worker.run(ThreadPoolExecutor.java:617)
	at java.lang.Thread.run(Thread.java:745)
Caused by: java.lang.IllegalArgumentException
	at org.gradle.messaging.remote.internal.hub.InterHubMessageSerializer$MessageReader.read(InterHubMessageSerializer.java:71)
	at org.gradle.messaging.remote.internal.hub.InterHubMessageSerializer$MessageReader.read(InterHubMessageSerializer.java:52)
	at org.gradle.messaging.remote.internal.inet.SocketConnection.receive(SocketConnection.java:77)
	... 6 more
Unexpected exception thrown.
org.gradle.messaging.remote.internal.MessageIOException: Could not write message [ChannelMessage
channel: org.gradle.api.internal.tasks.testing.worker.RemoteTestClassProcessor, payload: [MethodInvocation
method: processTestClass(org.gradle.api.internal.tasks.testing.DefaultTestClassRunInfo@f4fb155)]]
to '/127.0.0.1:46635'.
	at org.gradle.messaging.remote.internal.inet.SocketConnection.dispatch(SocketConnection.java:111)
	at org.gradle.messaging.remote.internal.hub.MessageHub$ConnectionDispatch.run(MessageHub.java:284)
	at org.gradle.internal.concurrent.ExecutorPolicy$CatchAndRecordFailures.onExecute(ExecutorPolicy.java:54)
	at org.gradle.internal.concurrent.StoppableExecutorImpl$1.run(StoppableExecutorImpl.java:40)
	at java.util.concurrent.ThreadPoolExecutor.runWorker(ThreadPoolExecutor.java:1142)
	at java.util.concurrent.ThreadPoolExecutor$Worker.run(ThreadPoolExecutor.java:617)
	at java.lang.Thread.run(Thread.java:745)
Caused by: java.io.IOException: Broken pipe
	at sun.nio.ch.FileDispatcherImpl.write0(Native Method)
	at sun.nio.ch.SocketDispatcher.write(SocketDispatcher.java:47)
	at sun.nio.ch.IOUtil.writeFromNativeBuffer(IOUtil.java:93)
	at sun.nio.ch.IOUtil.write(IOUtil.java:51)
	at sun.nio.ch.SocketChannelImpl.write(SocketChannelImpl.java:471)
	at org.gradle.messaging.remote.internal.inet.SocketConnection$SocketOutputStream.writeWithNonBlockingRetry(SocketConnection.java:248)
	at org.gradle.messaging.remote.internal.inet.SocketConnection$SocketOutputStream.writeBufferToChannel(SocketConnection.java:236)
	at org.gradle.messaging.remote.internal.inet.SocketConnection$SocketOutputStream.flush(SocketConnection.java:230)
	at org.gradle.messaging.remote.internal.inet.SocketConnection.dispatch(SocketConnection.java:109)
	... 6 more
org.gradle.messaging.remote.internal.ConnectException: Could not connect to server [59f12e3b-b075-4e7d-a309-56f75004e8de
port:41607, addresses:[/0:0:0:0:0:0:0:1%lo, /127.0.0.1]]. Tried addresses: [/0:0:0:0:0:0:0:1%lo,
/127.0.0.1].
	at org.gradle.messaging.remote.internal.inet.TcpOutgoingConnector.connect(TcpOutgoingConnector.java:68)
	at org.gradle.messaging.remote.internal.hub.MessageHubBackedClient.getConnection(MessageHubBackedClient.java:35)
	at org.gradle.process.internal.child.ActionExecutionWorker.execute(ActionExecutionWorker.java:58)
	at org.gradle.process.internal.child.ActionExecutionWorker.execute(ActionExecutionWorker.java:37)
	at org.gradle.process.internal.child.ImplementationClassLoaderWorker.execute(ImplementationClassLoaderWorker.java:87)
	at org.gradle.process.internal.child.ImplementationClassLoaderWorker.execute(ImplementationClassLoaderWorker.java:41)
	at org.gradle.process.internal.child.SystemApplicationClassLoaderWorker.call(SystemApplicationClassLoaderWorker.java:49)
	at org.gradle.process.internal.child.SystemApplicationClassLoaderWorker.call(SystemApplicationClassLoaderWorker.java:33)
	at jarjar.org.gradle.process.internal.launcher.GradleWorkerMain.run(GradleWorkerMain.java:69)
	at jarjar.org.gradle.process.internal.launcher.GradleWorkerMain.main(GradleWorkerMain.java:74)
Caused by: java.net.ConnectException: Connection refused
	at sun.nio.ch.SocketChannelImpl.checkConnect(Native Method)
	at sun.nio.ch.SocketChannelImpl.finishConnect(SocketChannelImpl.java:717)
	at sun.nio.ch.SocketAdaptor.connect(SocketAdaptor.java:111)
	at org.gradle.messaging.remote.internal.inet.TcpOutgoingConnector.tryConnect(TcpOutgoingConnector.java:82)
	at org.gradle.messaging.remote.internal.inet.TcpOutgoingConnector.connect(TcpOutgoingConnector.java:55)
	... 9 more
E0418 16:21:14.877 [TaskStatusHandlerImpl, TaskStatusHandlerImpl:175] Failed to process status
update batch [task_id {
  value: "task_id_a"
}
state: TASK_RUNNING
message: "fake message"
] org.apache.aurora.scheduler.storage.Storage$StorageException: Injected error
	at org.apache.aurora.scheduler.TaskStatusHandlerImplTest.lambda$testFailedStatusUpdate$141(TaskStatusHandlerImplTest.java:129)
~[test/:na]
	at org.easymock.internal.Result.answer(Result.java:106) ~[easymock-3.4.jar:3.4]
	at org.easymock.internal.ReplayState.invokeInner(ReplayState.java:60) ~[easymock-3.4.jar:3.4]
	at org.easymock.internal.ReplayState.invoke(ReplayState.java:46) ~[easymock-3.4.jar:3.4]
	at org.easymock.internal.MockInvocationHandler.invoke(MockInvocationHandler.java:40) ~[easymock-3.4.jar:3.4]
	at org.easymock.internal.ObjectMethodsFilter.invoke(ObjectMethodsFilter.java:94) ~[easymock-3.4.jar:3.4]
	at com.sun.proxy.$Proxy62.changeState(Unknown Source) ~[na:na]
	at org.apache.aurora.scheduler.TaskStatusHandlerImpl.lambda$run$194(TaskStatusHandlerImpl.java:158)
~[main/:na]
	at org.apache.aurora.scheduler.storage.Storage$MutateWork$NoResult.apply(Storage.java:152)
~[main/:na]
	at org.apache.aurora.scheduler.storage.Storage$MutateWork$NoResult.apply(Storage.java:147)
~[main/:na]
	at org.apache.aurora.scheduler.storage.testing.StorageTestUtil.lambda$expectWrite$5(StorageTestUtil.java:85)
~[test/:na]
	at org.easymock.internal.Result.answer(Result.java:106) ~[easymock-3.4.jar:3.4]
	at org.easymock.internal.ReplayState.invokeInner(ReplayState.java:60) ~[easymock-3.4.jar:3.4]
	at org.easymock.internal.ReplayState.invoke(ReplayState.java:46) ~[easymock-3.4.jar:3.4]
	at org.easymock.internal.MockInvocationHandler.invoke(MockInvocationHandler.java:40) ~[easymock-3.4.jar:3.4]
	at org.easymock.internal.ObjectMethodsFilter.invoke(ObjectMethodsFilter.java:94) ~[easymock-3.4.jar:3.4]
	at com.sun.proxy.$Proxy57.write(Unknown Source) ~[na:na]
	at org.apache.aurora.scheduler.TaskStatusHandlerImpl.run(TaskStatusHandlerImpl.java:154)
~[main/:na]
	at com.google.common.util.concurrent.AbstractExecutionThreadService$1$2.run(AbstractExecutionThreadService.java:60)
[guava-19.0.jar:na]
	at com.google.common.util.concurrent.Callables$3.run(Callables.java:100) [guava-19.0.jar:na]
	at java.lang.Thread.run(Thread.java:745) [na:1.8.0_66]

I0418 16:21:51.299 [ShutdownHook, SchedulerMain:99] Stopping scheduler services. 
 FAILED
:jacocoTestReport
Coverage report generated: file://<https://builds.apache.org/job/Aurora/ws/dist/reports/jacoco/test/html/index.html>
:analyzeReport
Instruction coverage is 0.8791915160234841, but must be greater than 0.89
Branch coverage is 0.7855731225296443, but must be greater than 0.835

FAILURE: Build failed with an exception.

* What went wrong:
Execution failed for task ':test'.
> Process 'Gradle Test Executor 18' finished with non-zero exit value 1

* Try:
Run with --stacktrace option to get the stack trace. Run with --info or --debug option to
get more log output.

BUILD FAILED

Total time: 30 mins 8.17 secs
Build step 'Execute shell' marked build as failure
Recording test results
ERROR: Step ?Publish JUnit test result report? failed: No test report files were found. Configuration
error?


Mime
View raw message