aurora-dev mailing list archives

Site index · List index
Message view « Date » · « Thread »
Top « Date » · « Thread »
From Apache Jenkins Server <jenk...@builds.apache.org>
Subject Build failed in Jenkins: Aurora #1406
Date Thu, 03 Mar 2016 17:13:57 GMT
See <https://builds.apache.org/job/Aurora/1406/changes>

Changes:

[wfarner] Update configuration-reference.md documentation on supporting private

------------------------------------------
[...truncated 3418 lines...]
                     src/test/python/apache/aurora/client/api/test_instance_watcher.py::InstanceWatcherTest::test_restart_threshold
PASSED
                     src/test/python/apache/aurora/client/api/test_instance_watcher.py::InstanceWatcherTest::test_restart_threshold_fail_fast
PASSED
                     src/test/python/apache/aurora/client/api/test_instance_watcher.py::InstanceWatcherTest::test_single_instance_failure
PASSED
                     src/test/python/apache/aurora/client/api/test_instance_watcher.py::InstanceWatcherTest::test_single_watch_period_failure
PASSED
                     src/test/python/apache/aurora/client/api/test_instance_watcher.py::InstanceWatcherTest::test_successful_watch
PASSED
                     src/test/python/apache/aurora/client/api/test_instance_watcher.py::InstanceWatcherTest::test_terminated_exits_immediately
PASSED
                     src/test/python/apache/aurora/client/api/test_instance_watcher.py::InstanceWatcherTest::test_watch_period_failure
PASSED
                     src/test/python/apache/aurora/client/api/test_scheduler_client.py::test_coverage
PASSED
                     src/test/python/apache/aurora/client/api/test_scheduler_client.py::TestSchedulerProxyInjection::test_abortJobUpdate
PASSED
                     src/test/python/apache/aurora/client/api/test_scheduler_client.py::TestSchedulerProxyInjection::test_acquireLock
PASSED
                     src/test/python/apache/aurora/client/api/test_scheduler_client.py::TestSchedulerProxyInjection::test_addInstances
PASSED
                     src/test/python/apache/aurora/client/api/test_scheduler_client.py::TestSchedulerProxyInjection::test_createJob
PASSED
                     src/test/python/apache/aurora/client/api/test_scheduler_client.py::TestSchedulerProxyInjection::test_descheduleCronJob
PASSED
                     src/test/python/apache/aurora/client/api/test_scheduler_client.py::TestSchedulerProxyInjection::test_getJobUpdateDetails
PASSED
                     src/test/python/apache/aurora/client/api/test_scheduler_client.py::TestSchedulerProxyInjection::test_getJobUpdateSummaries
PASSED
                     src/test/python/apache/aurora/client/api/test_scheduler_client.py::TestSchedulerProxyInjection::test_getJobs
PASSED
                     src/test/python/apache/aurora/client/api/test_scheduler_client.py::TestSchedulerProxyInjection::test_getQuota
PASSED
                     src/test/python/apache/aurora/client/api/test_scheduler_client.py::TestSchedulerProxyInjection::test_getTasksStatus
PASSED
                     src/test/python/apache/aurora/client/api/test_scheduler_client.py::TestSchedulerProxyInjection::test_killTasks
PASSED
                     src/test/python/apache/aurora/client/api/test_scheduler_client.py::TestSchedulerProxyInjection::test_pauseJobUpdate
PASSED
                     src/test/python/apache/aurora/client/api/test_scheduler_client.py::TestSchedulerProxyInjection::test_populateJobConfig
PASSED
                     src/test/python/apache/aurora/client/api/test_scheduler_client.py::TestSchedulerProxyInjection::test_pulseJobUpdate
PASSED
                     src/test/python/apache/aurora/client/api/test_scheduler_client.py::TestSchedulerProxyInjection::test_raise_auth_error
PASSED
                     src/test/python/apache/aurora/client/api/test_scheduler_client.py::TestSchedulerProxyInjection::test_releaseLock
PASSED
                     src/test/python/apache/aurora/client/api/test_scheduler_client.py::TestSchedulerProxyInjection::test_replaceCronTemplate
PASSED
                     src/test/python/apache/aurora/client/api/test_scheduler_client.py::TestSchedulerProxyInjection::test_restartShards
PASSED
                     src/test/python/apache/aurora/client/api/test_scheduler_client.py::TestSchedulerProxyInjection::test_resumeJobUpdate
PASSED
                     src/test/python/apache/aurora/client/api/test_scheduler_client.py::TestSchedulerProxyInjection::test_scheduleCronJob
PASSED
                     src/test/python/apache/aurora/client/api/test_scheduler_client.py::TestSchedulerProxyInjection::test_startCronJob
PASSED
                     src/test/python/apache/aurora/client/api/test_scheduler_client.py::TestSchedulerProxyInjection::test_startJobUpdate
PASSED
                     src/test/python/apache/aurora/client/api/test_scheduler_client.py::TestSchedulerProxyAdminInjection::test_abortJobUpdate
PASSED
                     src/test/python/apache/aurora/client/api/test_scheduler_client.py::TestSchedulerProxyAdminInjection::test_acquireLock
PASSED
                     src/test/python/apache/aurora/client/api/test_scheduler_client.py::TestSchedulerProxyAdminInjection::test_addInstances
PASSED
                     src/test/python/apache/aurora/client/api/test_scheduler_client.py::TestSchedulerProxyAdminInjection::test_commitRecovery
PASSED
                     src/test/python/apache/aurora/client/api/test_scheduler_client.py::TestSchedulerProxyAdminInjection::test_createJob
PASSED
                     src/test/python/apache/aurora/client/api/test_scheduler_client.py::TestSchedulerProxyAdminInjection::test_deleteRecoveryTasks
PASSED
                     src/test/python/apache/aurora/client/api/test_scheduler_client.py::TestSchedulerProxyAdminInjection::test_descheduleCronJob
PASSED
                     src/test/python/apache/aurora/client/api/test_scheduler_client.py::TestSchedulerProxyAdminInjection::test_drainHosts
PASSED
                     src/test/python/apache/aurora/client/api/test_scheduler_client.py::TestSchedulerProxyAdminInjection::test_endMaintenance
PASSED
                     src/test/python/apache/aurora/client/api/test_scheduler_client.py::TestSchedulerProxyAdminInjection::test_forceTaskState
PASSED
                     src/test/python/apache/aurora/client/api/test_scheduler_client.py::TestSchedulerProxyAdminInjection::test_getJobUpdateDetails
PASSED
                     src/test/python/apache/aurora/client/api/test_scheduler_client.py::TestSchedulerProxyAdminInjection::test_getJobUpdateSummaries
PASSED
                     src/test/python/apache/aurora/client/api/test_scheduler_client.py::TestSchedulerProxyAdminInjection::test_getJobs
PASSED
                     src/test/python/apache/aurora/client/api/test_scheduler_client.py::TestSchedulerProxyAdminInjection::test_getQuota
PASSED
                     src/test/python/apache/aurora/client/api/test_scheduler_client.py::TestSchedulerProxyAdminInjection::test_getTasksStatus
PASSED
                     src/test/python/apache/aurora/client/api/test_scheduler_client.py::TestSchedulerProxyAdminInjection::test_killTasks
PASSED
                     src/test/python/apache/aurora/client/api/test_scheduler_client.py::TestSchedulerProxyAdminInjection::test_listBackups
PASSED
                     src/test/python/apache/aurora/client/api/test_scheduler_client.py::TestSchedulerProxyAdminInjection::test_maintenanceStatus
PASSED
                     src/test/python/apache/aurora/client/api/test_scheduler_client.py::TestSchedulerProxyAdminInjection::test_pauseJobUpdate
PASSED
                     src/test/python/apache/aurora/client/api/test_scheduler_client.py::TestSchedulerProxyAdminInjection::test_performBackup
PASSED
                     src/test/python/apache/aurora/client/api/test_scheduler_client.py::TestSchedulerProxyAdminInjection::test_populateJobConfig
PASSED
                     src/test/python/apache/aurora/client/api/test_scheduler_client.py::TestSchedulerProxyAdminInjection::test_pulseJobUpdate
PASSED
                     src/test/python/apache/aurora/client/api/test_scheduler_client.py::TestSchedulerProxyAdminInjection::test_queryRecovery
PASSED
                     src/test/python/apache/aurora/client/api/test_scheduler_client.py::TestSchedulerProxyAdminInjection::test_raise_auth_error
PASSED
                     src/test/python/apache/aurora/client/api/test_scheduler_client.py::TestSchedulerProxyAdminInjection::test_releaseLock
PASSED
                     src/test/python/apache/aurora/client/api/test_scheduler_client.py::TestSchedulerProxyAdminInjection::test_replaceCronTemplate
PASSED
                     src/test/python/apache/aurora/client/api/test_scheduler_client.py::TestSchedulerProxyAdminInjection::test_restartShards
PASSED
                     src/test/python/apache/aurora/client/api/test_scheduler_client.py::TestSchedulerProxyAdminInjection::test_resumeJobUpdate
PASSED
                     src/test/python/apache/aurora/client/api/test_scheduler_client.py::TestSchedulerProxyAdminInjection::test_rewriteConfigs
PASSED
                     src/test/python/apache/aurora/client/api/test_scheduler_client.py::TestSchedulerProxyAdminInjection::test_scheduleCronJob
PASSED
                     src/test/python/apache/aurora/client/api/test_scheduler_client.py::TestSchedulerProxyAdminInjection::test_setQuota
PASSED
                     src/test/python/apache/aurora/client/api/test_scheduler_client.py::TestSchedulerProxyAdminInjection::test_snapshot
PASSED
                     src/test/python/apache/aurora/client/api/test_scheduler_client.py::TestSchedulerProxyAdminInjection::test_stageRecovery
PASSED
                     src/test/python/apache/aurora/client/api/test_scheduler_client.py::TestSchedulerProxyAdminInjection::test_startCronJob
PASSED
                     src/test/python/apache/aurora/client/api/test_scheduler_client.py::TestSchedulerProxyAdminInjection::test_startJobUpdate
PASSED
                     src/test/python/apache/aurora/client/api/test_scheduler_client.py::TestSchedulerProxyAdminInjection::test_startMaintenance
PASSED
                     src/test/python/apache/aurora/client/api/test_scheduler_client.py::TestSchedulerProxyAdminInjection::test_unloadRecovery
PASSED
                     src/test/python/apache/aurora/client/api/test_scheduler_client.py::test_url_when_not_connected_and_cluster_has_no_proxy_url[http]
PASSED
                     src/test/python/apache/aurora/client/api/test_scheduler_client.py::test_url_when_not_connected_and_cluster_has_no_proxy_url[https]
PASSED
                     src/test/python/apache/aurora/client/api/test_scheduler_client.py::TestSchedulerClient::test__internal_connect
PASSED
                     src/test/python/apache/aurora/client/api/test_scheduler_client.py::TestSchedulerClient::test_connect_direct_client_with_auth
PASSED
                     src/test/python/apache/aurora/client/api/test_scheduler_client.py::TestSchedulerClient::test_connect_direct_scheduler_with_user_agent
PASSED
                     src/test/python/apache/aurora/client/api/test_scheduler_client.py::TestSchedulerClient::test_connect_scheduler
PASSED
                     src/test/python/apache/aurora/client/api/test_scheduler_client.py::TestSchedulerClient::test_connect_scheduler_with_bypass_leader_redirect
PASSED
                     src/test/python/apache/aurora/client/api/test_scheduler_client.py::TestSchedulerClient::test_connect_scheduler_with_user_agent
PASSED
                     src/test/python/apache/aurora/client/api/test_scheduler_client.py::TestSchedulerClient::test_connect_scheduler_without_bypass_leader_redirect
PASSED
                     src/test/python/apache/aurora/client/api/test_scheduler_client.py::TestSchedulerClient::test_connect_zookeeper_client_with_auth
PASSED
                     src/test/python/apache/aurora/client/api/test_scheduler_client.py::TestSchedulerClient::test_no_zk_or_scheduler_uri
PASSED
                     src/test/python/apache/aurora/client/api/test_scheduler_client.py::TestSchedulerClient::test_transient_error
PASSED
                     src/test/python/apache/aurora/client/api/test_scheduler_client.py::TestSchedulerClient::test_unknown_connection_error
PASSED
                     src/test/python/apache/aurora/client/api/test_quota_check.py <- <https://builds.apache.org/job/Aurora/ws/src/test/python/apache/aurora/client/api/test_quota_check.py>::QuotaCheckTest::test_additional_quota_out
PASSED
                     src/test/python/apache/aurora/client/api/test_quota_check.py <- <https://builds.apache.org/job/Aurora/ws/src/test/python/apache/aurora/client/api/test_quota_check.py>::QuotaCheckTest::test_fail
PASSED
                     src/test/python/apache/aurora/client/api/test_quota_check.py <- <https://builds.apache.org/job/Aurora/ws/src/test/python/apache/aurora/client/api/test_quota_check.py>::QuotaCheckTest::test_fail_scheduler_call
PASSED
                     src/test/python/apache/aurora/client/api/test_quota_check.py <- <https://builds.apache.org/job/Aurora/ws/src/test/python/apache/aurora/client/api/test_quota_check.py>::QuotaCheckTest::test_op_not_cap_request
PASSED
                     src/test/python/apache/aurora/client/api/test_quota_check.py <- <https://builds.apache.org/job/Aurora/ws/src/test/python/apache/aurora/client/api/test_quota_check.py>::QuotaCheckTest::test_pass
PASSED
                     src/test/python/apache/aurora/client/api/test_quota_check.py <- <https://builds.apache.org/job/Aurora/ws/src/test/python/apache/aurora/client/api/test_quota_check.py>::QuotaCheckTest::test_pass_due_to_released
PASSED
                     src/test/python/apache/aurora/client/api/test_quota_check.py <- <https://builds.apache.org/job/Aurora/ws/src/test/python/apache/aurora/client/api/test_quota_check.py>::QuotaCheckTest::test_pass_with_no_consumed
PASSED
                     src/test/python/apache/aurora/client/api/test_quota_check.py <- <https://builds.apache.org/job/Aurora/ws/src/test/python/apache/aurora/client/api/test_quota_check.py>::QuotaCheckTest::test_right_add
PASSED
                     src/test/python/apache/aurora/client/api/test_quota_check.py <- <https://builds.apache.org/job/Aurora/ws/src/test/python/apache/aurora/client/api/test_quota_check.py>::QuotaCheckTest::test_skipped
PASSED
                     src/test/python/apache/aurora/client/api/test_sla.py::SlaTest::test_count_0
PASSED
                     src/test/python/apache/aurora/client/api/test_sla.py::SlaTest::test_count_100
PASSED
                     src/test/python/apache/aurora/client/api/test_sla.py::SlaTest::test_count_50
PASSED
                     src/test/python/apache/aurora/client/api/test_sla.py::SlaTest::test_domain_uptime
PASSED
                     src/test/python/apache/aurora/client/api/test_sla.py::SlaTest::test_domain_uptime_no_result
PASSED
                     src/test/python/apache/aurora/client/api/test_sla.py::SlaTest::test_domain_uptime_no_result_min_count_filtered
PASSED
                     src/test/python/apache/aurora/client/api/test_sla.py::SlaTest::test_domain_uptime_no_tasks
PASSED
                     src/test/python/apache/aurora/client/api/test_sla.py::SlaTest::test_domain_uptime_not_production
PASSED
                     src/test/python/apache/aurora/client/api/test_sla.py::SlaTest::test_domain_uptime_production_not_set
PASSED
                     src/test/python/apache/aurora/client/api/test_sla.py::SlaTest::test_domain_uptime_with_grouping
PASSED
                     src/test/python/apache/aurora/client/api/test_sla.py::SlaTest::test_domain_uptime_with_grouping_not_safe
PASSED
                     src/test/python/apache/aurora/client/api/test_sla.py::SlaTest::test_domain_uptime_with_override
PASSED
                     src/test/python/apache/aurora/client/api/test_sla.py::SlaTest::test_get_domain_uptime_vector_with_hosts
PASSED
                     src/test/python/apache/aurora/client/api/test_sla.py::SlaTest::test_get_domain_uptime_vector_with_hosts_no_job_tasks
PASSED
                     src/test/python/apache/aurora/client/api/test_sla.py::SlaTest::test_probe_hosts_no_hosts
PASSED
                     src/test/python/apache/aurora/client/api/test_sla.py::SlaTest::test_probe_hosts_no_result
PASSED
                     src/test/python/apache/aurora/client/api/test_sla.py::SlaTest::test_probe_hosts_no_result_min_count_filtered
PASSED
                     src/test/python/apache/aurora/client/api/test_sla.py::SlaTest::test_probe_hosts_no_tasks
PASSED
                     src/test/python/apache/aurora/client/api/test_sla.py::SlaTest::test_probe_hosts_non_prod_ignored
PASSED
                     src/test/python/apache/aurora/client/api/test_sla.py::SlaTest::test_probe_hosts_not_safe
PASSED
                     src/test/python/apache/aurora/client/api/test_sla.py::SlaTest::test_probe_hosts_not_safe_infeasible
PASSED
                     src/test/python/apache/aurora/client/api/test_sla.py::SlaTest::test_probe_hosts_safe
PASSED
                     src/test/python/apache/aurora/client/api/test_sla.py::SlaTest::test_probe_hosts_with_grouping_not_safe
PASSED
                     src/test/python/apache/aurora/client/api/test_sla.py::SlaTest::test_probe_hosts_with_grouping_safe
PASSED
                     src/test/python/apache/aurora/client/api/test_sla.py::SlaTest::test_task_query
PASSED
                     src/test/python/apache/aurora/client/api/test_sla.py::SlaTest::test_uptime_0
PASSED
                     src/test/python/apache/aurora/client/api/test_sla.py::SlaTest::test_uptime_10
PASSED
                     src/test/python/apache/aurora/client/api/test_sla.py::SlaTest::test_uptime_100
PASSED
                     src/test/python/apache/aurora/client/api/test_sla.py::SlaTest::test_uptime_50
PASSED
                     src/test/python/apache/aurora/client/api/test_sla.py::SlaTest::test_uptime_99
PASSED
                     src/test/python/apache/aurora/client/api/test_sla.py::SlaTest::test_uptime_empty
PASSED
                     src/test/python/apache/aurora/client/api/test_sla.py::SlaTest::test_wait_time_0
PASSED
                     src/test/python/apache/aurora/client/api/test_sla.py::SlaTest::test_wait_time_empty
PASSED
                     src/test/python/apache/aurora/client/api/test_sla.py::SlaTest::test_wait_time_infeasible
PASSED
                     src/test/python/apache/aurora/client/api/test_sla.py::SlaTest::test_wait_time_lower
PASSED
                     src/test/python/apache/aurora/client/api/test_sla.py::SlaTest::test_wait_time_mid
PASSED
                     src/test/python/apache/aurora/client/api/test_sla.py::SlaTest::test_wait_time_upper
PASSED
                     src/test/python/apache/aurora/client/api/test_sla.py::SlaTest::test_wait_time_with_total
PASSED
                     src/test/python/apache/aurora/client/api/test_health_check.py::HealthCheckTest::test_changed_task_id
PASSED
                     src/test/python/apache/aurora/client/api/test_health_check.py::HealthCheckTest::test_failed_status_health_check
PASSED
                     src/test/python/apache/aurora/client/api/test_health_check.py::HealthCheckTest::test_health_statuses
PASSED
                     src/test/python/apache/aurora/client/api/test_health_check.py::HealthCheckTest::test_simple_status_health_check
PASSED
                     src/test/python/apache/aurora/common/test_aurora_job_key.py::AuroraJobKeyTest::test_basic
PASSED
                     src/test/python/apache/aurora/common/test_aurora_job_key.py::AuroraJobKeyTest::test_equality
PASSED
                     src/test/python/apache/aurora/common/test_aurora_job_key.py::AuroraJobKeyTest::test_inequality
PASSED
                     src/test/python/apache/aurora/common/test_pex_version.py::test_old_pants_output
PASSED
                     src/test/python/apache/aurora/common/test_pex_version.py::test_new_pants_output
PASSED
                     src/test/python/apache/aurora/common/test_pex_version.py::test_attribute_error
PASSED
                     src/test/python/apache/aurora/common/test_pex_version.py::test_no_pants
PASSED
                     src/test/python/apache/aurora/common/test_pex_version.py::test_io_error
PASSED
                     src/test/python/apache/aurora/common/test_pex_version.py::test_os_error
PASSED
                     src/test/python/apache/aurora/common/test_transport.py::test_request_transport_integration
PASSED
                     src/test/python/apache/aurora/common/test_transport.py::test_request_transport_timeout
PASSED
                     src/test/python/apache/aurora/common/test_transport.py::test_raise_for_status_causes_exception
PASSED
                     src/test/python/apache/aurora/common/test_transport.py::test_raises_auth_error
PASSED
                     src/test/python/apache/aurora/common/test_transport.py::test_request_any_other_exception
PASSED
                     src/test/python/apache/aurora/common/test_transport.py::test_requests_transports_lowers_logging_level
PASSED
                     src/test/python/apache/aurora/common/test_transport.py::test_transport_applies_user_agent_from_factory
PASSED
                     src/test/python/apache/aurora/common/test_transport.py::test_transport_applies_default_user_agent_if_no_factory_provided
PASSED
                     src/test/python/apache/aurora/common/test_transport.py::test_auth_type_valid
PASSED
                     src/test/python/apache/aurora/common/test_transport.py::test_auth_type_invalid
PASSED
                     src/test/python/apache/aurora/common/test_clusters.py::test_load PASSED
                     src/test/python/apache/aurora/common/test_clusters.py::test_load_invalid_syntax
PASSED
                     src/test/python/apache/aurora/common/test_clusters.py::test_patch_cleanup_on_error
PASSED
                     src/test/python/apache/aurora/common/test_cluster_option.py::test_constructors
PASSED
                     src/test/python/apache/aurora/common/test_cluster_option.py::test_parsable
PASSED
                     src/test/python/apache/aurora/common/test_cluster_option.py::test_not_parsable
PASSED
                     src/test/python/apache/aurora/common/test_cluster.py::test_simple PASSED
                     src/test/python/apache/aurora/common/test_shellify.py::test_shellify
PASSED
                     src/test/python/apache/thermos/common/test_task_planner.py::test_task_construction
PASSED
                     src/test/python/apache/thermos/common/test_task_planner.py::test_task_finish_with_ephemerals
PASSED
                     src/test/python/apache/thermos/common/test_task_planner.py::test_task_finish_with_daemons
PASSED
                     src/test/python/apache/thermos/common/test_task_planner.py::test_task_finish_with_daemon_ephemerals
PASSED
                     src/test/python/apache/thermos/common/test_task_planner.py::test_task_process_cannot_depend_upon_daemon
PASSED
                     src/test/python/apache/thermos/common/test_task_planner.py::test_task_non_ephemeral_process_cannot_depend_on_ephemeral_process
PASSED
                     src/test/python/apache/thermos/common/test_task_planner.py::test_task_failed_predecessor_does_not_make_process_runnable
PASSED
                     src/test/python/apache/thermos/common/test_task_planner.py::test_task_daemon_duration
PASSED
                     src/test/python/apache/thermos/common/test_task_planner.py::test_task_waits
PASSED
                     src/test/python/apache/thermos/common/test_task_planner.py::test_task_fails
PASSED
                     src/test/python/apache/thermos/common/test_task_planner.py::test_task_lost
PASSED
                     src/test/python/apache/thermos/common/test_task_planner.py::test_task_filters
PASSED
                     src/test/python/apache/thermos/common/test_task_planner.py::test_task_max_runs
PASSED
                     src/test/python/apache/thermos/common/test_pathspec.py::test_legacy_task_roots
PASSED
                     src/test/python/apache/thermos/common/test_pathspec.py::test_legacy_log_dirs
PASSED
                     src/test/python/apache/thermos/common/test_pathspec.py::test_exception_on_none_keys
PASSED
                     src/test/python/apache/thermos/common/test_planner.py::test_planner_empty
PASSED
                     src/test/python/apache/thermos/common/test_planner.py::test_planner_unordered
PASSED
                     src/test/python/apache/thermos/common/test_planner.py::test_planner_ordered
PASSED
                     src/test/python/apache/thermos/common/test_planner.py::test_planner_mixed
PASSED
                     src/test/python/apache/thermos/common/test_planner.py::test_planner_unsatisfiables
PASSED
                     
                     ==================== FAILURES ====================
                     _ TestHealthChecker.test_health_checker_metrics __
                     
                     self = <common.test_health_checker.TestHealthChecker testMethod=test_health_checker_metrics>
                     
                         def test_health_checker_metrics(self):
                           def slow_check():
                             self._clock.sleep(0.5)
                             return (True, None)
                           hct = HealthChecker(slow_check, interval_secs=1, initial_interval_secs=1,
clock=self._clock)
                           hct.start()
                           self._clock.converge(threads=[hct.threaded_health_checker])
                           self._clock.assert_waiting(hct.threaded_health_checker, amount=1)
                         
                           assert hct._total_latency == 0
                           assert hct.metrics.sample()['total_latency_secs'] == 0
                         
                           # start the health check (during health check it is still 0)
                           epsilon = 0.001
                           self._clock.tick(1.0 + epsilon)
                           self._clock.converge(threads=[hct.threaded_health_checker])
                           self._clock.assert_waiting(hct.threaded_health_checker, amount=0.5)
                           assert hct._total_latency == 0
                           assert hct.metrics.sample()['total_latency_secs'] == 0
                           assert hct.metrics.sample()['checks'] == 0
                         
                           # finish the health check
                           self._clock.tick(0.5 + epsilon)
                           self._clock.converge(threads=[hct.threaded_health_checker])
                           self._clock.assert_waiting(hct.threaded_health_checker, amount=1)
 # interval_secs
                           assert hct._total_latency == 0.5
                           assert hct.metrics.sample()['total_latency_secs'] == 0.5
                           assert hct.metrics.sample()['checks'] == 1
                         
                           # tick again
                           self._clock.tick(1.0 + epsilon)
                           self._clock.converge(threads=[hct.threaded_health_checker])
                           self._clock.tick(0.5 + epsilon)
                           self._clock.converge(threads=[hct.threaded_health_checker])
                           self._clock.assert_waiting(hct.threaded_health_checker, amount=1)
 # interval_secs
                     >     assert hct._total_latency == 1.0
                     E     AssertionError: assert 1.001 == 1.0
                     E      +  where 1.001 = <apache.aurora.executor.common.health_checker.HealthChecker
object at 0x7fe2089f6210>._total_latency
                     
                     src/test/python/apache/aurora/executor/common/test_health_checker.py:184:
AssertionError
                     -------------- Captured stderr call --------------
                     [<twitter.common.testing.clock.ThreadedClock object at 0x7fe2089f6f10>]
Time now: 0.0
                     [<twitter.common.testing.clock.ThreadedClock object at 0x7fe2089f6f10>]
Time now: 0.0
                     [<twitter.common.testing.clock.ThreadedClock object at 0x7fe2089f6f10>]
Time now: 1.0
                     [<twitter.common.testing.clock.ThreadedClock object at 0x7fe2089f6f10>]
Time now: 1.001
                     [<twitter.common.testing.clock.ThreadedClock object at 0x7fe2089f6f10>]
Time now: 1.001
                     [<twitter.common.testing.clock.ThreadedClock object at 0x7fe2089f6f10>]
Time now: 1.501
                     [<twitter.common.testing.clock.ThreadedClock object at 0x7fe2089f6f10>]
Time now: 1.502
                     [<twitter.common.testing.clock.ThreadedClock object at 0x7fe2089f6f10>]
Time now: 1.502
                     [<twitter.common.testing.clock.ThreadedClock object at 0x7fe2089f6f10>]
Time now: 2.502
                     [<twitter.common.testing.clock.ThreadedClock object at 0x7fe2089f6f10>]
Time now: 2.503
                     [<twitter.common.testing.clock.ThreadedClock object at 0x7fe2089f6f10>]
Time now: 2.503
                     [<twitter.common.testing.clock.ThreadedClock object at 0x7fe2089f6f10>]
Time now: 3.003
                     [<twitter.common.testing.clock.ThreadedClock object at 0x7fe2089f6f10>]
Time now: 3.004
                      generated xml file: <https://builds.apache.org/job/Aurora/ws/dist/test-results/415337499eb72578eab327a6487c1f5c9452b3d6.xml>

                      1 failed, 660 passed, 5 skipped, 1 warnings in 427.22 seconds

                     
FAILURE


17:06:52 08:20   [complete]
               FAILURE
Build step 'Execute shell' marked build as failure
Recording test results

Mime
View raw message