aurora-dev mailing list archives

Site index · List index
Message view « Date » · « Thread »
Top « Date » · « Thread »
From Apache Jenkins Server <jenk...@builds.apache.org>
Subject Build failed in Jenkins: aurora-packaging-nightly #203
Date Mon, 22 Feb 2016 00:44:53 GMT
See <https://builds.apache.org/job/aurora-packaging-nightly/203/>

------------------------------------------
[...truncated 6783 lines...]
    80% |#########################       | 413kB 20.9MB/s eta 0:00:01
    81% |##########################      | 417kB 21.6MB/s eta 0:00:01
    82% |##########################      | 421kB 21.6MB/s eta 0:00:01
    83% |##########################      | 425kB 20.9MB/s eta 0:00:01
    83% |##########################      | 430kB 21.0MB/s eta 0:00:01
    84% |###########################     | 434kB 21.7MB/s eta 0:00:01
    85% |###########################     | 438kB 21.7MB/s eta 0:00:01
    86% |###########################     | 442kB 21.0MB/s eta 0:00:01
    87% |###########################     | 446kB 20.9MB/s eta 0:00:01
    87% |############################    | 450kB 21.7MB/s eta 0:00:01
    88% |############################    | 454kB 21.7MB/s eta 0:00:01
    89% |############################    | 458kB 20.9MB/s eta 0:00:01
    90% |############################    | 462kB 20.9MB/s eta 0:00:01
    91% |#############################   | 466kB 21.7MB/s eta 0:00:01
    91% |#############################   | 471kB 21.7MB/s eta 0:00:01
    92% |#############################   | 475kB 21.0MB/s eta 0:00:01
    93% |#############################   | 479kB 20.9MB/s eta 0:00:01
    94% |##############################  | 483kB 21.6MB/s eta 0:00:01
    95% |##############################  | 487kB 21.7MB/s eta 0:00:01
    95% |##############################  | 491kB 21.1MB/s eta 0:00:01
    96% |##############################  | 495kB 20.9MB/s eta 0:00:01
    97% |############################### | 499kB 21.6MB/s eta 0:00:01
    98% |############################### | 503kB 21.6MB/s eta 0:00:01
    99% |############################### | 507kB 21.2MB/s eta 0:00:01
    99% |############################### | 512kB 21.3MB/s eta 0:00:01
    100% |################################| 516kB 572kB/s 
[?25hCollecting pytest-cov<1.9,>=1.8 (from pantsbuild.pants==0.0.71)
  Downloading pytest-cov-1.8.1.tar.gz
Collecting setproctitle==1.1.9 (from pantsbuild.pants==0.0.71)
  Downloading setproctitle-1.1.9.tar.gz
Collecting twitter.common.lang==0.3.4 (from twitter.common.collections<0.4,>=0.3.1->pantsbuild.pants==0.0.71)
  Downloading twitter.common.lang-0.3.4.tar.gz
Collecting twitter.common.log==0.3.4 (from twitter.common.confluence<0.4,>=0.3.1->pantsbuild.pants==0.0.71)
  Downloading twitter.common.log-0.3.4.tar.gz
Collecting py>=1.4.25 (from pytest<2.7,>=2.6->pantsbuild.pants==0.0.71)
  Downloading py-1.4.31-py2.py3-none-any.whl (81kB)
[?25l
    4% |#                               | 4.1kB 17.1MB/s eta 0:00:01
    9% |###                             | 8.2kB 16.9MB/s eta 0:00:01
    14% |####                            | 12kB 18.1MB/s eta 0:00:01
    19% |######                          | 16kB 16.8MB/s eta 0:00:01
    24% |#######                         | 20kB 17.3MB/s eta 0:00:01
    29% |#########                       | 24kB 18.2MB/s eta 0:00:01
    34% |###########                     | 28kB 18.4MB/s eta 0:00:01
    39% |############                    | 32kB 18.2MB/s eta 0:00:01
    44% |##############                  | 36kB 18.5MB/s eta 0:00:01
    49% |###############                 | 40kB 18.9MB/s eta 0:00:01
    54% |#################               | 45kB 19.4MB/s eta 0:00:01
    59% |###################             | 49kB 19.5MB/s eta 0:00:01
    64% |####################            | 53kB 19.5MB/s eta 0:00:01
    69% |######################          | 57kB 18.6MB/s eta 0:00:01
    74% |#######################         | 61kB 18.7MB/s eta 0:00:01
    79% |#########################       | 65kB 18.2MB/s eta 0:00:01
    84% |###########################     | 69kB 18.3MB/s eta 0:00:01
    89% |############################    | 73kB 19.0MB/s eta 0:00:01
    94% |##############################  | 77kB 18.9MB/s eta 0:00:01
    99% |############################### | 81kB 18.7MB/s eta 0:00:01
    100% |################################| 86kB 2.7MB/s 
[?25hCollecting cov-core>=1.14.0 (from pytest-cov<1.9,>=1.8->pantsbuild.pants==0.0.71)
  Downloading cov-core-1.15.0.tar.gz
Collecting twitter.common.options==0.3.4 (from twitter.common.log==0.3.4->twitter.common.confluence<0.4,>=0.3.1->pantsbuild.pants==0.0.71)
  Downloading twitter.common.options-0.3.4.tar.gz
Building wheels for collected packages: pantsbuild.pants, twitter.common.collections, pathspec,
ansicolors, twitter.common.dirutil, pystache, psutil, Markdown, Pygments, docutils, twitter.common.confluence,
zincutils, coverage, pytest, pytest-cov, setproctitle, twitter.common.lang, twitter.common.log,
cov-core, twitter.common.options
  Running setup.py bdist_wheel for pantsbuild.pants
  Stored in directory: /aurora/.cache/pip/wheels/a1/f2/08/69248917b2a4bde360aff15d461d8773f99319d316b6cbbb26
  Running setup.py bdist_wheel for twitter.common.collections
  Stored in directory: /aurora/.cache/pip/wheels/1c/7b/b6/d955c906ef7129882ef0d43a599f307e9b5e78879fe0cc971a
  Running setup.py bdist_wheel for pathspec
  Stored in directory: /aurora/.cache/pip/wheels/d5/e9/c7/b82e372f0b11a78928f8afb37d15184dfb42ae71324c3a82a8
  Running setup.py bdist_wheel for ansicolors
  Stored in directory: /aurora/.cache/pip/wheels/02/22/b6/203b63cc640b6e41564ba27b69b1d19eca6d2bc7f32fa7d125
  Running setup.py bdist_wheel for twitter.common.dirutil
  Stored in directory: /aurora/.cache/pip/wheels/94/bb/31/630e7a2f1465b39d904dbdc157edff387f90b8e6a01928708d
  Running setup.py bdist_wheel for pystache
  Stored in directory: /aurora/.cache/pip/wheels/e3/cc/c4/e16849667e00e4767cb5dabd48b8835f3481e2b991d483b05b
  Running setup.py bdist_wheel for psutil
  Stored in directory: /aurora/.cache/pip/wheels/97/b8/a0/922e93e2663f8806b5a09a06073222db804099918d47083ea9
  Running setup.py bdist_wheel for Markdown
  Stored in directory: /aurora/.cache/pip/wheels/c9/0f/6e/029925fde6375c7452382fe50922d29691ee1b4a580a153737
  Running setup.py bdist_wheel for Pygments
  Stored in directory: /aurora/.cache/pip/wheels/7d/83/19/b5fe027c45c766e70e733a678b6c3af2a14348215bbe472281
  Running setup.py bdist_wheel for docutils
  Stored in directory: /aurora/.cache/pip/wheels/d5/32/4f/1347e8ac67071e8150a5dc69354a51a04ac065d0b48334f608
  Running setup.py bdist_wheel for twitter.common.confluence
  Stored in directory: /aurora/.cache/pip/wheels/18/3c/0c/81a21bf539301ad999eb1ee541f878b066919b99bc21aa9154
  Running setup.py bdist_wheel for zincutils
  Stored in directory: /aurora/.cache/pip/wheels/29/12/cd/c0dec9ce4b37e4511c0bce736904a594cd939181fb7c693730
  Running setup.py bdist_wheel for coverage
  Stored in directory: /aurora/.cache/pip/wheels/1c/2d/55/470890618558cacad65599407445c2a1636222bd896c9023f3
  Running setup.py bdist_wheel for pytest
  Stored in directory: /aurora/.cache/pip/wheels/a6/ca/cd/51ddd7ebba0f7cb7fadec9762c0cfa236112421c974e58c551
  Running setup.py bdist_wheel for pytest-cov
  Stored in directory: /aurora/.cache/pip/wheels/03/27/cd/16ccdb175609bb5d57c7cdf5f2f3c5760652d667a9f769770e
  Running setup.py bdist_wheel for setproctitle
  Stored in directory: /aurora/.cache/pip/wheels/54/ea/32/ee4cbabe702c3cbe7a7ba08ff576d45efbab14b07767cb5ed5
  Running setup.py bdist_wheel for twitter.common.lang
  Stored in directory: /aurora/.cache/pip/wheels/4e/f4/c4/879a425804a36094219989ef191b3031c55e356f7e5e8bc602
  Running setup.py bdist_wheel for twitter.common.log
  Stored in directory: /aurora/.cache/pip/wheels/11/f2/61/9fbdc82267fcc08f3db28c935145cc62aa615fafd0aef410da
  Running setup.py bdist_wheel for cov-core
  Stored in directory: /aurora/.cache/pip/wheels/b2/26/b1/27d3fd0941d03d502f3669209122a254c0afe18131ad903021
  Running setup.py bdist_wheel for twitter.common.options
  Stored in directory: /aurora/.cache/pip/wheels/1e/57/56/42f9d3d119bc19e66d7b0b8ad95b9b6d44f3c1085ff8923e1e
Successfully built pantsbuild.pants twitter.common.collections pathspec ansicolors twitter.common.dirutil
pystache psutil Markdown Pygments docutils twitter.common.confluence zincutils coverage pytest
pytest-cov setproctitle twitter.common.lang twitter.common.log cov-core twitter.common.options
Installing collected packages: twitter.common.lang, twitter.common.collections, six, pathspec,
ansicolors, twitter.common.dirutil, requests, pystache, psutil, setuptools, pex, Markdown,
Pygments, docutils, twitter.common.options, twitter.common.log, twitter.common.confluence,
lockfile, zincutils, coverage, py, pytest, cov-core, pytest-cov, setproctitle, pantsbuild.pants
  Found existing installation: setuptools 18.0.1
    Uninstalling setuptools-18.0.1:
      Successfully uninstalled setuptools-18.0.1
Successfully installed Markdown-2.1.1 Pygments-1.4 ansicolors-1.0.2 cov-core-1.15.0 coverage-3.7.1
docutils-0.12 lockfile-0.10.2 pantsbuild.pants-0.0.71 pathspec-0.3.4 pex-1.1.2 psutil-3.1.1
py-1.4.31 pystache-0.5.3 pytest-2.6.4 pytest-cov-1.8.1 requests-2.5.3 setproctitle-1.1.9 setuptools-5.4.1
six-1.10.0 twitter.common.collections-0.3.4 twitter.common.confluence-0.3.4 twitter.common.dirutil-0.3.4
twitter.common.lang-0.3.4 twitter.common.log-0.3.4 twitter.common.options-0.3.4 zincutils-0.3.1
fatal: Not a git repository (or any of the parent directories): .git

00:44:33 00:00 [main]
               (To run a reporting server: ./pants server)
00:44:33 00:00   [setup]
00:44:33 00:00     [parse]fatal: Not a git repository (or any of the parent directories):
.git

               Executing tasks in goals: bootstrap -> imports -> unpack-jars -> deferred-sources
-> jvm-platform-validate -> gen -> resolve -> compile -> resources -> binary
00:44:33 00:00   [bootstrap]
00:44:33 00:00     [jar-dependency-management]
00:44:33 00:00     [bootstrap-jvm-tools]
00:44:33 00:00   [imports]
00:44:33 00:00     [ivy-imports]
00:44:33 00:00   [unpack-jars]
00:44:33 00:00     [unpack-jars]
00:44:33 00:00   [deferred-sources]
00:44:33 00:00     [deferred-sources]
00:44:33 00:00   [jvm-platform-validate]
00:44:33 00:00     [jvm-platform-validate]
00:44:33 00:00   [gen]
00:44:33 00:00     [thrift]
00:44:33 00:00     [protoc]
00:44:33 00:00     [antlr]
00:44:33 00:00     [ragel]
00:44:33 00:00     [jaxb]
00:44:33 00:00     [wire]
00:44:33 00:00   [resolve]
00:44:33 00:00     [ivy]INFO] 
Downloading https://repo1.maven.org/maven2/org/apache/ivy/ivy/2.4.0/ivy-2.4.0.jar

  0% .                                                    30 KB
  0% ..                                                   60 KB
  0% ...                                                  80 KB
  0% ....                                                110 KB
  0% .....                                               130 KB
  0% ......                                              160 KB
  0% .......                                             180 KB
  0% ........                                            210 KB
  0% .........                                           230 KB
  0% ..........                                          260 KB
  0% ...........                                         280 KB
  0% ............                                        310 KB
  0% .............                                       330 KB
  0% ..............                                      360 KB
  0% ...............                                     380 KB
  0% ................                                    410 KB
  0% .................                                   430 KB
  0% ..................                                  460 KB
  0% ...................                                 480 KB
  0% ....................                                510 KB
  0% .....................                               530 KB
  0% ......................                              560 KB
  0% .......................                             580 KB
  0% ........................                            610 KB
  0% .........................                           630 KB
  0% ..........................                          660 KB
  0% ...........................                         680 KB
  0% ............................                        710 KB
  0% .............................                       730 KB
  0% ..............................                      760 KB
  0% ...............................                     780 KB
  0% ................................                    810 KB
  0% .................................                   830 KB
  0% ..................................                  860 KB
  0% ...................................                 880 KB
  0% ....................................                910 KB
  0% .....................................               930 KB
  0% ......................................              960 KB
  0% .......................................             980 KB
  0% ........................................           1010 KB
  0% .........................................          1030 KB
  0% ..........................................         1060 KB
  0% ...........................................        1080 KB
  0% ............................................       1110 KB
  0% .............................................      1130 KB
  0% ..............................................     1160 KB
  0% ...............................................    1180 KB
  0% ................................................   1210 KB
  0% .................................................  1230 KB
100% .................................................. 1252 KB 0.400s
INFO] sha1: 5abe4c24bbe992a9ac07ca563d5bd3e8d569e9ed

00:44:34 00:01       [ivy-bootstrap]
00:44:36 00:03       [bootstrap-nailgun-server]
00:44:39 00:06   [compile]
00:44:39 00:06     [compile-jvm-prep-command]
00:44:39 00:06       [jvm_prep_command]
00:44:39 00:06     [python-eval]
00:44:39 00:06     [pythonstyle]
00:44:39 00:06       [cache]       
                   No cached artifacts for 7 targets.
                   Invalidated 7 targets.
00:44:44 00:11     [compile]
00:44:44 00:11     [zinc]
00:44:44 00:11     [jvm-dep-check]
00:44:44 00:11   [resources]
00:44:44 00:11     [prepare]
00:44:44 00:11     [services]
00:44:44 00:11   [binary]
00:44:45 00:12     [binary-jvm-prep-command]
00:44:45 00:12       [jvm_prep_command]
00:44:45 00:12     [python-binary-create]
00:44:48 00:15       [chroot]INFO] Attempting to fetch thrift binary from: https://dl.bintray.com/pantsbuild/bin/build-support/bin/thrift/linux/x86_64/0.9.1/thrift
...

  0% .                                                    610 KB
  0% ..                                                  1220 KB
  0% ...                                                 1830 KB
  0% ....                                                2440 KB
  0% .....                                               3050 KB
  0% ......                                              3660 KB
  0% .......                                             4260 KB
  0% ........                                            4870 KB
  0% .........                                           5480 KB
  0% ..........                                          6090 KB
  0% ...........                                         6700 KB
  0% ............                                        7310 KB
  0% .............                                       7920 KB
  0% ..............                                      8520 KB
  0% ...............                                     9130 KB
  0% ................                                    9740 KB
  0% .................                                  10350 KB
  0% ..................                                 10960 KB
  0% ...................                                11570 KB
  0% ....................                               12170 KB
  0% .....................                              12780 KB
  0% ......................                             13390 KB
  0% .......................                            14000 KB
FAILURE: Failed to fetch binary bin/thrift/linux/x86_64/0.9.1/thrift from any source: (Failed
to fetch binary from https://dl.bintray.com/pantsbuild/bin/build-support/bin/thrift/linux/x86_64/0.9.1/thrift:
Problem GETing data from https://dl.bintray.com/pantsbuild/bin/build-support/bin/thrift/linux/x86_64/0.9.1/thrift:
HTTPSConnectionPool(host='akamai.bintray.com', port=443): Read timed out.)


00:44:52 00:19   [complete]
               FAILURE
debian/rules:33: recipe for target '__pants_build' failed
make[1]: *** [__pants_build] Error 1
make[1]: Leaving directory '/scratch'
debian/rules:20: recipe for target 'build' failed
make: *** [build] Error 2
dpkg-buildpackage: error: debian/rules build gave error exit status 2
Build step 'Execute shell' marked build as failure
Skipped archiving because build is not successful

Mime
View raw message