aurora-dev mailing list archives

Site index · List index
Message view « Date » · « Thread »
Top « Date » · « Thread »
From Apache Jenkins Server <jenk...@builds.apache.org>
Subject Build failed in Jenkins: Aurora #1404
Date Wed, 24 Feb 2016 01:49:03 GMT
See <https://builds.apache.org/job/Aurora/1404/changes>

Changes:

[maxim] AURORA-1616: [part 1] refactor tier management initialization to make it

------------------------------------------
[...truncated 4165 lines...]
                     ImportError: No module named pants.bin.pants_exe
                      TestThermosExecutor.test_failing_runner_initialize 
                     
                     self = <test_thermos_executor.TestThermosExecutor object at 0x7fe8bcaad390>
                     
                         def test_failing_runner_initialize(self):
                           proxy_driver = ProxyDriver()
                         
                           with temporary_dir() as td:
                             te = FastThermosExecutor(
                     >           runner_provider=make_provider(td),
                                 sandbox_provider=FailingSandboxProvider())
                     
                     src/test/python/apache/aurora/executor/test_thermos_executor.py:480:

                     _ _ _ _ _ _ _ _ _ _ _ _ _ _ _ _ _ _ _ _ _ _ _ _ _ 
                     src/test/python/apache/aurora/executor/test_thermos_executor.py:193:
in make_provider
                         pex_location=thermos_runner_path(),
                     _ _ _ _ _ _ _ _ _ _ _ _ _ _ _ _ _ _ _ _ _ _ _ _ _ 
                     
                     build = True
                     
                         def thermos_runner_path(build=True):
                           if not build:
                             return getattr(thermos_runner_path, 'value', None)
                         
                           if not hasattr(thermos_runner_path, 'value'):
                             pex_dir = safe_mkdtemp()
                     >       assert subprocess.call(["./pants", "--pants-distdir=%s"
% pex_dir, "binary",
                               "src/main/python/apache/thermos/runner:thermos_runner"])
== 0
                     E       assert 1 == 0
                     E        +  where 1 = <function call at 0x7fe8d16a5938>(['./pants',
'--pants-distdir=/tmp/user/10021/tmpzBil0I', 'binary', 'src/main/python/apache/thermos/runner:thermos_runner'])
                     E        +    where <function call at 0x7fe8d16a5938>
= subprocess.call
                     
                     src/test/python/apache/aurora/executor/test_thermos_executor.py:185:
AssertionError
                     -------------- Captured stderr call --------------
                     Traceback (most recent call last):
                       File "/home/jenkins/.cache/pants/setup/bootstrap-Linux-x86_64/0.0.71/bin/pants",
line 7, in <module>
                         from pants.bin.pants_exe import main
                     ImportError: No module named pants.bin.pants_exe
                      TestThermosExecutor.test_failing_runner_initialize_unknown_exception

                     
                     self = <test_thermos_executor.TestThermosExecutor object at 0x7fe8bc3e9150>
                     
                         def test_failing_runner_initialize_unknown_exception(self):
                           proxy_driver = ProxyDriver()
                         
                           with temporary_dir() as td:
                             te = FastThermosExecutor(
                     >               runner_provider=make_provider(td),
                                     sandbox_provider=FailingSandboxProvider(exception_type=Exception))
                     
                     src/test/python/apache/aurora/executor/test_thermos_executor.py:493:

                     _ _ _ _ _ _ _ _ _ _ _ _ _ _ _ _ _ _ _ _ _ _ _ _ _ 
                     src/test/python/apache/aurora/executor/test_thermos_executor.py:193:
in make_provider
                         pex_location=thermos_runner_path(),
                     _ _ _ _ _ _ _ _ _ _ _ _ _ _ _ _ _ _ _ _ _ _ _ _ _ 
                     
                     build = True
                     
                         def thermos_runner_path(build=True):
                           if not build:
                             return getattr(thermos_runner_path, 'value', None)
                         
                           if not hasattr(thermos_runner_path, 'value'):
                             pex_dir = safe_mkdtemp()
                     >       assert subprocess.call(["./pants", "--pants-distdir=%s"
% pex_dir, "binary",
                               "src/main/python/apache/thermos/runner:thermos_runner"])
== 0
                     E       assert 1 == 0
                     E        +  where 1 = <function call at 0x7fe8d16a5938>(['./pants',
'--pants-distdir=/tmp/user/10021/tmpPVUmhI', 'binary', 'src/main/python/apache/thermos/runner:thermos_runner'])
                     E        +    where <function call at 0x7fe8d16a5938>
= subprocess.call
                     
                     src/test/python/apache/aurora/executor/test_thermos_executor.py:185:
AssertionError
                     -------------- Captured stderr call --------------
                     Traceback (most recent call last):
                       File "/home/jenkins/.cache/pants/setup/bootstrap-Linux-x86_64/0.0.71/bin/pants",
line 7, in <module>
                         from pants.bin.pants_exe import main
                     ImportError: No module named pants.bin.pants_exe
                      TestThermosExecutor.test_slow_runner_initialize _
                     
                     self = <test_thermos_executor.TestThermosExecutor object at 0x7fe8bc84c250>
                     
                         def test_slow_runner_initialize(self):
                           proxy_driver = ProxyDriver()
                         
                           task = make_task(HELLO_WORLD_MTI)
                         
                           with temporary_dir() as td:
                             te = FastThermosExecutor(
                     >           runner_provider=make_provider(td),
                                 sandbox_provider=SlowSandboxProvider())
                     
                     src/test/python/apache/aurora/executor/test_thermos_executor.py:508:

                     _ _ _ _ _ _ _ _ _ _ _ _ _ _ _ _ _ _ _ _ _ _ _ _ _ 
                     src/test/python/apache/aurora/executor/test_thermos_executor.py:193:
in make_provider
                         pex_location=thermos_runner_path(),
                     _ _ _ _ _ _ _ _ _ _ _ _ _ _ _ _ _ _ _ _ _ _ _ _ _ 
                     
                     build = True
                     
                         def thermos_runner_path(build=True):
                           if not build:
                             return getattr(thermos_runner_path, 'value', None)
                         
                           if not hasattr(thermos_runner_path, 'value'):
                             pex_dir = safe_mkdtemp()
                     >       assert subprocess.call(["./pants", "--pants-distdir=%s"
% pex_dir, "binary",
                               "src/main/python/apache/thermos/runner:thermos_runner"])
== 0
                     E       assert 1 == 0
                     E        +  where 1 = <function call at 0x7fe8d16a5938>(['./pants',
'--pants-distdir=/tmp/user/10021/tmpEzc0hQ', 'binary', 'src/main/python/apache/thermos/runner:thermos_runner'])
                     E        +    where <function call at 0x7fe8d16a5938>
= subprocess.call
                     
                     src/test/python/apache/aurora/executor/test_thermos_executor.py:185:
AssertionError
                     -------------- Captured stderr call --------------
                     Traceback (most recent call last):
                       File "/home/jenkins/.cache/pants/setup/bootstrap-Linux-x86_64/0.0.71/bin/pants",
line 7, in <module>
                         from pants.bin.pants_exe import main
                     ImportError: No module named pants.bin.pants_exe
                      TestThermosExecutor.test_killTask_during_runner_initialize 
                     
                     self = <test_thermos_executor.TestThermosExecutor object at 0x7fe8bd0dab90>
                     
                         def test_killTask_during_runner_initialize(self):  # noqa
                           proxy_driver = ProxyDriver()
                         
                           task = make_task(HELLO_WORLD_MTI)
                         
                           with temporary_dir() as td:
                             te = FastThermosExecutor(
                     >           runner_provider=make_provider(td),
                                 sandbox_provider=SlowSandboxProvider())
                     
                     src/test/python/apache/aurora/executor/test_thermos_executor.py:527:

                     _ _ _ _ _ _ _ _ _ _ _ _ _ _ _ _ _ _ _ _ _ _ _ _ _ 
                     src/test/python/apache/aurora/executor/test_thermos_executor.py:193:
in make_provider
                         pex_location=thermos_runner_path(),
                     _ _ _ _ _ _ _ _ _ _ _ _ _ _ _ _ _ _ _ _ _ _ _ _ _ 
                     
                     build = True
                     
                         def thermos_runner_path(build=True):
                           if not build:
                             return getattr(thermos_runner_path, 'value', None)
                         
                           if not hasattr(thermos_runner_path, 'value'):
                             pex_dir = safe_mkdtemp()
                     >       assert subprocess.call(["./pants", "--pants-distdir=%s"
% pex_dir, "binary",
                               "src/main/python/apache/thermos/runner:thermos_runner"])
== 0
                     E       assert 1 == 0
                     E        +  where 1 = <function call at 0x7fe8d16a5938>(['./pants',
'--pants-distdir=/tmp/user/10021/tmp_azgA0', 'binary', 'src/main/python/apache/thermos/runner:thermos_runner'])
                     E        +    where <function call at 0x7fe8d16a5938>
= subprocess.call
                     
                     src/test/python/apache/aurora/executor/test_thermos_executor.py:185:
AssertionError
                     -------------- Captured stderr call --------------
                     Traceback (most recent call last):
                       File "/home/jenkins/.cache/pants/setup/bootstrap-Linux-x86_64/0.0.71/bin/pants",
line 7, in <module>
                         from pants.bin.pants_exe import main
                     ImportError: No module named pants.bin.pants_exe
                      TestThermosExecutor.test_launchTask_deserialization_fail 
                     
                     self = <test_thermos_executor.TestThermosExecutor object at 0x7fe8bd0daa90>
                     
                         def test_launchTask_deserialization_fail(self):  # noqa
                           proxy_driver = ProxyDriver()
                         
                           role = getpass.getuser()
                           task_info = mesos_pb2.TaskInfo()
                           task_info.name = task_info.task_id.value = 'broken'
                           task_info.data = serialize(
                               AssignedTask(
                                   task=TaskConfig(
                                       job=JobKey(role=role, environment='env', name='name'),
                                       executorConfig=ExecutorConfig(name=AURORA_EXECUTOR_NAME,
data='garbage'))))
                         
                           te = FastThermosExecutor(
                     >         runner_provider=make_provider(safe_mkdtemp()),
                               sandbox_provider=DefaultTestSandboxProvider())
                     
                     src/test/python/apache/aurora/executor/test_thermos_executor.py:565:

                     _ _ _ _ _ _ _ _ _ _ _ _ _ _ _ _ _ _ _ _ _ _ _ _ _ 
                     src/test/python/apache/aurora/executor/test_thermos_executor.py:193:
in make_provider
                         pex_location=thermos_runner_path(),
                     _ _ _ _ _ _ _ _ _ _ _ _ _ _ _ _ _ _ _ _ _ _ _ _ _ 
                     
                     build = True
                     
                         def thermos_runner_path(build=True):
                           if not build:
                             return getattr(thermos_runner_path, 'value', None)
                         
                           if not hasattr(thermos_runner_path, 'value'):
                             pex_dir = safe_mkdtemp()
                     >       assert subprocess.call(["./pants", "--pants-distdir=%s"
% pex_dir, "binary",
                               "src/main/python/apache/thermos/runner:thermos_runner"])
== 0
                     E       assert 1 == 0
                     E        +  where 1 = <function call at 0x7fe8d16a5938>(['./pants',
'--pants-distdir=/tmp/user/10021/tmpkL3NNh', 'binary', 'src/main/python/apache/thermos/runner:thermos_runner'])
                     E        +    where <function call at 0x7fe8d16a5938>
= subprocess.call
                     
                     src/test/python/apache/aurora/executor/test_thermos_executor.py:185:
AssertionError
                     -------------- Captured stderr call --------------
                     Traceback (most recent call last):
                       File "/home/jenkins/.cache/pants/setup/bootstrap-Linux-x86_64/0.0.71/bin/pants",
line 7, in <module>
                         from pants.bin.pants_exe import main
                     ImportError: No module named pants.bin.pants_exe
                     _____________ test_waiting_executor ______________
                     
                         def test_waiting_executor():
                           proxy_driver = ProxyDriver()
                           with temporary_dir() as checkpoint_root:
                             te = AuroraExecutor(
                     >           runner_provider=make_provider(checkpoint_root),
                                 sandbox_provider=DefaultTestSandboxProvider())
                     
                     src/test/python/apache/aurora/executor/test_thermos_executor.py:580:

                     _ _ _ _ _ _ _ _ _ _ _ _ _ _ _ _ _ _ _ _ _ _ _ _ _ 
                     src/test/python/apache/aurora/executor/test_thermos_executor.py:193:
in make_provider
                         pex_location=thermos_runner_path(),
                     _ _ _ _ _ _ _ _ _ _ _ _ _ _ _ _ _ _ _ _ _ _ _ _ _ 
                     
                     build = True
                     
                         def thermos_runner_path(build=True):
                           if not build:
                             return getattr(thermos_runner_path, 'value', None)
                         
                           if not hasattr(thermos_runner_path, 'value'):
                             pex_dir = safe_mkdtemp()
                     >       assert subprocess.call(["./pants", "--pants-distdir=%s"
% pex_dir, "binary",
                               "src/main/python/apache/thermos/runner:thermos_runner"])
== 0
                     E       assert 1 == 0
                     E        +  where 1 = <function call at 0x7fe8d16a5938>(['./pants',
'--pants-distdir=/tmp/user/10021/tmpxl5WfZ', 'binary', 'src/main/python/apache/thermos/runner:thermos_runner'])
                     E        +    where <function call at 0x7fe8d16a5938>
= subprocess.call
                     
                     src/test/python/apache/aurora/executor/test_thermos_executor.py:185:
AssertionError
                     -------------- Captured stderr call --------------
                     Traceback (most recent call last):
                       File "/home/jenkins/.cache/pants/setup/bootstrap-Linux-x86_64/0.0.71/bin/pants",
line 7, in <module>
                         from pants.bin.pants_exe import main
                     ImportError: No module named pants.bin.pants_exe
                      generated xml file: <https://builds.apache.org/job/Aurora/ws/dist/test-results/415337499eb72578eab327a6487c1f5c9452b3d6.xml>

                      16 failed, 637 passed, 5 skipped, 1 warnings, 8 error in 310.33
seconds 
                     
FAILURE


01:48:57 06:56   [complete]
               FAILURE
Build step 'Execute shell' marked build as failure
Recording test results
Updating AURORA-1616

Mime
View raw message