aurora-dev mailing list archives

Site index · List index
Message view « Date » · « Thread »
Top « Date » · « Thread »
From Apache Jenkins Server <jenk...@builds.apache.org>
Subject Build failed in Jenkins: Aurora #1308
Date Sun, 03 Jan 2016 18:01:58 GMT
See <https://builds.apache.org/job/Aurora/1308/changes>

Changes:

[wfarner] Remove several scheduler command line arguments.

[wfarner] Add recent Aurora-related talks

------------------------------------------
[...truncated 3304 lines...]
                     src/test/python/apache/aurora/client/cli/test_supdate.py::TestStartUpdate::test_start_update_with_lock
PASSED
                     src/test/python/apache/aurora/client/cli/test_supdate.py::TestStartUpdate::test_update_cron_job_fails
PASSED
                     src/test/python/apache/aurora/client/cli/test_supdate.py::TestStartUpdate::test_update_no_active_instance_check
PASSED
                     src/test/python/apache/aurora/client/cli/test_supdate.py::TestStartUpdate::test_update_pulse_interval_too_small
PASSED
                     src/test/python/apache/aurora/client/cli/test_supdate.py::TestListUpdates::test_list_updates_by_env
PASSED
                     src/test/python/apache/aurora/client/cli/test_supdate.py::TestListUpdates::test_list_updates_by_status
PASSED
                     src/test/python/apache/aurora/client/cli/test_supdate.py::TestListUpdates::test_list_updates_command
PASSED
                     src/test/python/apache/aurora/client/cli/test_supdate.py::TestListUpdates::test_list_updates_command_json
PASSED
                     src/test/python/apache/aurora/client/cli/test_supdate.py::TestUpdateStatus::test_status_fails_no_updates
PASSED
                     src/test/python/apache/aurora/client/cli/test_supdate.py::TestPauseUpdate::test_pause_update_command_line_error
PASSED
                     src/test/python/apache/aurora/client/cli/test_supdate.py::TestPauseUpdate::test_pause_update_command_line_succeeds
PASSED
                     src/test/python/apache/aurora/client/cli/test_supdate.py::TestAbortUpdate::test_abort_invalid_api_response
PASSED
                     src/test/python/apache/aurora/client/cli/test_supdate.py::TestAbortUpdate::test_abort_update_command_line_error
PASSED
                     src/test/python/apache/aurora/client/cli/test_supdate.py::TestAbortUpdate::test_abort_update_command_line_succeeds
PASSED
                     src/test/python/apache/aurora/client/cli/test_supdate.py::TestResumeUpdate::test_resume_update_command_line_error
PASSED
                     src/test/python/apache/aurora/client/cli/test_supdate.py::TestResumeUpdate::test_resume_update_command_line_succeeds
PASSED
                     src/test/python/apache/aurora/client/cli/test_supdate.py::TestUpdateInfo::test_active_update_info
PASSED
                     src/test/python/apache/aurora/client/cli/test_supdate.py::TestUpdateInfo::test_update_info
PASSED
                     src/test/python/apache/aurora/client/cli/test_supdate.py::TestUpdateInfo::test_update_info_json
PASSED
                     src/test/python/apache/aurora/client/cli/test_supdate.py::TestUpdateWait::test_update_wait_not_found
PASSED
                     src/test/python/apache/aurora/client/cli/test_supdate.py::TestUpdateWait::test_wait_non_ok_response
PASSED
                     src/test/python/apache/aurora/client/cli/test_supdate.py::TestUpdateWait::test_wait_rolled_back
PASSED
                     src/test/python/apache/aurora/client/cli/test_supdate.py::TestUpdateWait::test_wait_scheduler_returns_multiple_summaries
PASSED
                     src/test/python/apache/aurora/client/cli/test_supdate.py::TestUpdateWait::test_wait_success
PASSED
                     src/test/python/apache/aurora/client/cli/test_restart.py::TestRestartJobCommand::test_restart_inactive_instance_spec
PASSED
                     src/test/python/apache/aurora/client/cli/test_restart.py::TestRestartJobCommand::test_restart_opens_url
PASSED
                     src/test/python/apache/aurora/client/cli/test_restart.py::TestRestartJobCommand::test_restart_with_lock
PASSED
                     src/test/python/apache/aurora/client/cli/test_restart.py::TestRestartCommand::test_restart_failed_restart
PASSED
                     src/test/python/apache/aurora/client/cli/test_restart.py::TestRestartCommand::test_restart_failed_restart_output
PASSED
                     src/test/python/apache/aurora/client/cli/test_restart.py::TestRestartCommand::test_restart_failed_status
PASSED
                     src/test/python/apache/aurora/client/cli/test_restart.py::TestRestartCommand::test_restart_invalid_shards
PASSED
                     src/test/python/apache/aurora/client/cli/test_restart.py::TestRestartCommand::test_restart_no_such_job_with_instances
PASSED
                     src/test/python/apache/aurora/client/cli/test_restart.py::TestRestartCommand::test_restart_simple
PASSED
                     src/test/python/apache/aurora/client/cli/test_restart.py::TestRestartCommand::test_restart_simple_no_config
PASSED
                     src/test/python/apache/aurora/client/cli/test_restart.py::TestRestartCommand::test_restart_simple_output
PASSED
                     src/test/python/apache/aurora/client/cli/test_status.py::TestJobStatus::test_no_jobs_found_status_shallow
PASSED
                     src/test/python/apache/aurora/client/cli/test_status.py::TestJobStatus::test_status_job_not_found
PASSED
                     src/test/python/apache/aurora/client/cli/test_status.py::TestJobStatus::test_status_wildcard
PASSED
                     src/test/python/apache/aurora/client/cli/test_status.py::TestJobStatus::test_status_wildcard_two
PASSED
                     src/test/python/apache/aurora/client/cli/test_status.py::TestJobStatus::test_successful_status_deep
PASSED
                     src/test/python/apache/aurora/client/cli/test_status.py::TestJobStatus::test_successful_status_deep_null_metadata
PASSED
                     src/test/python/apache/aurora/client/cli/test_status.py::TestJobStatus::test_successful_status_json_output_no_metadata
PASSED
                     src/test/python/apache/aurora/client/cli/test_status.py::TestJobStatus::test_successful_status_output_no_metadata
PASSED
                     src/test/python/apache/aurora/client/cli/test_status.py::TestJobStatus::test_successful_status_output_with_inactives
PASSED
                     src/test/python/apache/aurora/client/cli/test_status.py::TestJobStatus::test_successful_status_output_with_metadata
PASSED
                     src/test/python/apache/aurora/client/cli/test_status.py::TestJobStatus::test_successful_status_shallow
PASSED
                     src/test/python/apache/aurora/client/cli/test_status.py::TestJobStatus::test_successful_status_shallow_nometadata
PASSED
                     src/test/python/apache/aurora/client/cli/test_status.py::TestJobStatus::test_unsuccessful_status_shallow
PASSED
                     src/test/python/apache/aurora/client/cli/test_diff.py::TestDiffCommand::test_cron_diff
PASSED
                     src/test/python/apache/aurora/client/cli/test_diff.py::TestDiffCommand::test_service_diff
PASSED
                     src/test/python/apache/aurora/client/cli/test_diff.py::TestDiffCommand::test_service_diff_old_api
PASSED
                     src/test/python/apache/aurora/client/cli/test_cron.py::TestCronNoun::test_cron_status
PASSED
                     src/test/python/apache/aurora/client/cli/test_cron.py::TestCronNoun::test_cron_status_multiple_jobs
PASSED
                     src/test/python/apache/aurora/client/cli/test_cron.py::TestCronNoun::test_deschedule_cron_deep_api
PASSED
                     src/test/python/apache/aurora/client/cli/test_cron.py::TestCronNoun::test_schedule_cron_deep_api
PASSED
                     src/test/python/apache/aurora/client/cli/test_cron.py::TestCronNoun::test_schedule_cron_failed_invalid_config
PASSED
                     src/test/python/apache/aurora/client/cli/test_cron.py::TestCronNoun::test_schedule_failed
PASSED
                     src/test/python/apache/aurora/client/cli/test_cron.py::TestCronNoun::test_schedule_failed_non_cron
PASSED
                     src/test/python/apache/aurora/client/cli/test_cron.py::TestCronNoun::test_start_cron
PASSED
                     src/test/python/apache/aurora/client/cli/test_cron.py::TestCronNoun::test_start_cron_open_browser
PASSED
                     src/test/python/apache/aurora/client/cli/test_cron.py::TestCronNoun::test_successful_schedule
PASSED
                     src/test/python/apache/aurora/client/cli/test_command_hooks.py::TestClientCreateCommand::test_create_job_with_failed_hook
PASSED
                     src/test/python/apache/aurora/client/cli/test_command_hooks.py::TestClientCreateCommand::test_create_job_with_successful_hook
PASSED
                     src/test/python/apache/aurora/client/cli/test_options.py::TestParseInstances::test_parse_instances_invalid_ranges
PASSED
                     src/test/python/apache/aurora/client/cli/test_options.py::TestParseInstances::test_parse_instances_mixed
PASSED
                     src/test/python/apache/aurora/client/cli/test_options.py::TestParseInstances::test_parse_instances_with_range
PASSED
                     src/test/python/apache/aurora/client/cli/test_task.py::TestRunCommand::test_successful_run
PASSED
                     src/test/python/apache/aurora/client/cli/test_task.py::TestRunCommand::test_successful_run_with_instances
PASSED
                     src/test/python/apache/aurora/client/cli/test_task.py::TestRunCommand::test_successful_run_with_ssh_options
PASSED
                     src/test/python/apache/aurora/client/cli/test_task.py::TestSshCommand::test_ssh_job_not_found
PASSED
                     src/test/python/apache/aurora/client/cli/test_task.py::TestSshCommand::test_successful_ssh
PASSED
                     src/test/python/apache/aurora/client/cli/test_create.py::TestCreateJobCommand::test_create_with_lock
PASSED
                     src/test/python/apache/aurora/client/cli/test_create.py::TestClientCreateCommand::test_create_cron_job_fails
PASSED
                     src/test/python/apache/aurora/client/cli/test_create.py::TestClientCreateCommand::test_create_job_delayed
PASSED
                     src/test/python/apache/aurora/client/cli/test_create.py::TestClientCreateCommand::test_create_job_failed
PASSED
                     src/test/python/apache/aurora/client/cli/test_create.py::TestClientCreateCommand::test_create_job_failed_invalid_config
PASSED
                     src/test/python/apache/aurora/client/cli/test_create.py::TestClientCreateCommand::test_create_job_failed_output
PASSED
                     src/test/python/apache/aurora/client/cli/test_create.py::TestClientCreateCommand::test_create_job_startup_fails
PASSED
                     src/test/python/apache/aurora/client/cli/test_create.py::TestClientCreateCommand::test_failed_create_job_with_incomplete_bindings
PASSED
                     src/test/python/apache/aurora/client/cli/test_create.py::TestClientCreateCommand::test_interrupt
PASSED
                     src/test/python/apache/aurora/client/cli/test_create.py::TestClientCreateCommand::test_interrupt_error
PASSED
                     src/test/python/apache/aurora/client/cli/test_create.py::TestClientCreateCommand::test_simple_successful_create_job
PASSED
                     src/test/python/apache/aurora/client/cli/test_create.py::TestClientCreateCommand::test_simple_successful_create_job_open_page
PASSED
                     src/test/python/apache/aurora/client/cli/test_create.py::TestClientCreateCommand::test_simple_successful_create_job_output
PASSED
                     src/test/python/apache/aurora/client/cli/test_create.py::TestClientCreateCommand::test_simple_successful_create_job_with_bindings
PASSED
                     src/test/python/apache/aurora/client/cli/test_kill.py::TestInstancesParser::test_parse_instances
PASSED
                     src/test/python/apache/aurora/client/cli/test_kill.py::TestInstancesParser::test_parse_none
PASSED
                     src/test/python/apache/aurora/client/cli/test_kill.py::TestKillCommand::test_kill_batched_passes_config
PASSED
                     src/test/python/apache/aurora/client/cli/test_kill.py::TestKillCommand::test_kill_batched_queries_active_instances
PASSED
                     src/test/python/apache/aurora/client/cli/test_kill.py::TestKillCommand::test_kill_inactive_instance_spec
PASSED
                     src/test/python/apache/aurora/client/cli/test_kill.py::TestKillCommand::test_kill_lock_error_batches
PASSED
                     src/test/python/apache/aurora/client/cli/test_kill.py::TestKillCommand::test_kill_lock_error_nobatch
PASSED
                     src/test/python/apache/aurora/client/cli/test_kill.py::TestKillCommand::test_kill_nobatch_passes_config
PASSED
                     src/test/python/apache/aurora/client/cli/test_kill.py::TestKillCommand::test_kill_opens_url
PASSED
                     src/test/python/apache/aurora/client/cli/test_kill.py::TestKillAllCommand::test_killall_nobatch_passes_config
PASSED
                     src/test/python/apache/aurora/client/cli/test_kill.py::TestClientKillCommand::test_kill_job_with_empty_instances_batched
PASSED
                     src/test/python/apache/aurora/client/cli/test_kill.py::TestClientKillCommand::test_kill_job_with_instances_batched
PASSED
                     src/test/python/apache/aurora/client/cli/test_kill.py::TestClientKillCommand::test_kill_job_with_instances_batched_maxerrors
PASSED
                     src/test/python/apache/aurora/client/cli/test_kill.py::TestClientKillCommand::test_kill_job_with_instances_batched_maxerrors_output
PASSED
                     src/test/python/apache/aurora/client/cli/test_kill.py::TestClientKillCommand::test_kill_job_with_instances_batched_output
PASSED
                     src/test/python/apache/aurora/client/cli/test_kill.py::TestClientKillCommand::test_kill_job_with_instances_nobatching
PASSED
                     src/test/python/apache/aurora/client/cli/test_kill.py::TestClientKillCommand::test_kill_job_with_invalid_instances_nonstrict
PASSED
                     src/test/python/apache/aurora/client/cli/test_kill.py::TestClientKillCommand::test_kill_job_with_invalid_instances_strict
PASSED
                     src/test/python/apache/aurora/client/cli/test_kill.py::TestClientKillCommand::test_killall_job
PASSED
                     src/test/python/apache/aurora/client/cli/test_kill.py::TestClientKillCommand::test_killall_job_batched
PASSED
                     src/test/python/apache/aurora/client/cli/test_kill.py::TestClientKillCommand::test_killall_job_output
PASSED
                     src/test/python/apache/aurora/client/cli/test_inspect.py::TestInspectCommand::test_inspect_job
PASSED
                     src/test/python/apache/aurora/client/cli/test_inspect.py::TestInspectCommand::test_inspect_job_raw
PASSED
                     src/test/python/apache/aurora/client/cli/test_inspect.py::TestInspectCommand::test_inspect_job_raw_success
PASSED
                     src/test/python/apache/aurora/client/cli/test_api_from_cli.py::TestApiFromCLI::test_status_api_failure
PASSED
                     src/test/python/apache/aurora/client/cli/test_api_from_cli.py::TestApiFromCLI::test_successful_status_deep
PASSED
                     
                      generated xml file: <https://builds.apache.org/job/Aurora/ws/dist/test-results/src.test.python.apache.aurora.client.cli.cli.xml>

                     ========== 142 passed in 17.18 seconds ===========
                     
18:01:01 02:46         [chroot]============== test session starts ===============
                     platform linux2 -- Python 2.7.6 -- py-1.4.31 -- pytest-2.6.4 -- /usr/bin/python2.7
                     plugins: timeout, cov
                     
                     collecting 0 items
                     collecting 10 items
                     collecting 10 items
                     collecting 10 items
                     collecting 11 items
                     collecting 11 items
                     collecting 11 items
                     collecting 13 items
                     collecting 27 items
                     collecting 27 items
                     collecting 28 items
                     collecting 36 items
                     collecting 36 items
                     collecting 36 items
                     collecting 39 items
                     collected 39 items 
                     
                     src/test/python/apache/aurora/executor/test_thermos_task_runner.py::TestThermosTaskRunnerIntegration::test_integration_success
PASSED
                     src/test/python/apache/aurora/executor/test_thermos_task_runner.py::TestThermosTaskRunnerIntegration::test_integration_failed
PASSED
                     src/test/python/apache/aurora/executor/test_thermos_task_runner.py::TestThermosTaskRunnerIntegration::test_integration_stop
SKIPPED
                     src/test/python/apache/aurora/executor/test_thermos_task_runner.py::TestThermosTaskRunnerIntegration::test_integration_lose
PASSED
                     src/test/python/apache/aurora/executor/test_thermos_task_runner.py::TestThermosTaskRunnerIntegration::test_integration_ignores_sigterm
SKIPPED
                     src/test/python/apache/aurora/executor/test_thermos_task_runner.py::TestThermosTaskRunnerIntegration::test_integration_http_teardown
PASSED
                     src/test/python/apache/aurora/executor/test_thermos_task_runner.py::TestThermosTaskRunnerIntegration::test_thermos_normal_exit_status
PASSED
                     src/test/python/apache/aurora/executor/test_thermos_task_runner.py::TestThermosTaskRunnerIntegration::test_thermos_abnormal_exit_statuses
PASSED
                     src/test/python/apache/aurora/executor/test_thermos_task_runner.py::TestThermosTaskRunnerIntegration::test_thermos_runner_killed
PASSED
                     src/test/python/apache/aurora/executor/test_thermos_task_runner.py::TestThermosTaskRunnerIntegration::test_thermos_preserve_env
PASSED
                     src/test/python/apache/aurora/executor/test_status_manager.py::TestStatusManager::test_run
PASSED
                     src/test/python/apache/aurora/executor/test_executor_vars.py::test_init
PASSED
                     src/test/python/apache/aurora/executor/test_executor_vars.py::test_sample
PASSED
                     src/test/python/apache/aurora/executor/test_thermos_executor.py::TestThermosExecutor::test_basic
PASSED
                     src/test/python/apache/aurora/executor/test_thermos_executor.py::TestThermosExecutor::test_basic_as_job
PASSED
                     src/test/python/apache/aurora/executor/test_thermos_executor.py::TestThermosExecutor::test_runner_disappears
PASSED
                     src/test/python/apache/aurora/executor/test_thermos_executor.py::TestThermosExecutor::test_task_killed
PASSED
                     src/test/python/apache/aurora/executor/test_thermos_executor.py::TestThermosExecutor::test_killTask
PASSED
                     src/test/python/apache/aurora/executor/test_thermos_executor.py::TestThermosExecutor::test_shutdown
PASSED
                     src/test/python/apache/aurora/executor/test_thermos_executor.py::TestThermosExecutor::test_shutdown_order
PASSED
                     src/test/python/apache/aurora/executor/test_thermos_executor.py::TestThermosExecutor::test_task_health_failed
PASSED
                     src/test/python/apache/aurora/executor/test_thermos_executor.py::TestThermosExecutor::test_task_health_ok
PASSED
                     src/test/python/apache/aurora/executor/test_thermos_executor.py::TestThermosExecutor::test_failing_runner_start
PASSED
                     src/test/python/apache/aurora/executor/test_thermos_executor.py::TestThermosExecutor::test_failing_runner_initialize
PASSED
                     src/test/python/apache/aurora/executor/test_thermos_executor.py::TestThermosExecutor::test_slow_runner_initialize
PASSED
                     src/test/python/apache/aurora/executor/test_thermos_executor.py::TestThermosExecutor::test_killTask_during_runner_initialize
PASSED
                     src/test/python/apache/aurora/executor/test_thermos_executor.py::TestThermosExecutor::test_launchTask_deserialization_fail
PASSED
                     src/test/python/apache/aurora/executor/test_thermos_executor.py::test_waiting_executor
PASSED
                     src/test/python/apache/aurora/executor/test_executor_base.py::TestExecutorBase::test_disconnected
PASSED
                     src/test/python/apache/aurora/executor/test_executor_base.py::TestExecutorBase::test_error
PASSED
                     src/test/python/apache/aurora/executor/test_executor_base.py::TestExecutorBase::test_frameworkMessage
PASSED
                     src/test/python/apache/aurora/executor/test_executor_base.py::TestExecutorBase::test_log
PASSED
                     src/test/python/apache/aurora/executor/test_executor_base.py::TestExecutorBase::test_registered
PASSED
                     src/test/python/apache/aurora/executor/test_executor_base.py::TestExecutorBase::test_reregistered
PASSED
                     src/test/python/apache/aurora/executor/test_executor_base.py::TestExecutorBase::test_send_update
PASSED
                     src/test/python/apache/aurora/executor/test_executor_base.py::TestExecutorBase::test_status_is_terminal
PASSED
                     src/test/python/apache/aurora/executor/test_http_lifecycle.py::test_http_lifecycle_wrapper_without_lifecycle
PASSED
                     src/test/python/apache/aurora/executor/test_http_lifecycle.py::test_http_lifecycle_wrapper_with_lifecycle

18:01:53 03:38         [chroot]PASSED
                     src/test/python/apache/aurora/executor/test_http_lifecycle.py::test_http_lifecycle_wraps_start_and_stop
PASSED
                     
                      generated xml file: <https://builds.apache.org/job/Aurora/ws/dist/test-results/src.test.python.apache.aurora.executor.executor.xml>

                     ===== 37 passed, 2 skipped in 49.67 seconds ======
                     
                     src.test.python.apache.aurora.admin.admin                           
           .....   SUCCESS
                     src.test.python.apache.aurora.client.client                         
           .....   SUCCESS
                     src.test.python.apache.aurora.client.cli.cli                        
           .....   SUCCESS
                     src.test.python.apache.aurora.client.hooks.hooks                    
           .....   SUCCESS
                     src.test.python.apache.aurora.common.health_check.health_check      
           .....   SUCCESS
                     src.test.python.apache.aurora.config.config                         
           .....   SUCCESS
                     src.test.python.apache.aurora.executor.executor                     
           .....   SUCCESS
                     src.test.python.apache.aurora.executor.bin.bin                      
           .....   SUCCESS
                     src.test.python.apache.aurora.executor.common.common                
           .....   SUCCESS
                     src.test.python.apache.aurora.tools.tools                           
           .....   SUCCESS
                     src.test.python.apache.thermos.cli.cli                              
           .....   SUCCESS
                     src.test.python.apache.thermos.cli.commands.commands                
           .....   SUCCESS
                     src.test.python.apache.thermos.config.config                        
           .....   SUCCESS
                     src.test.python.apache.thermos.core.core                            
           .....   SUCCESS
                     src.test.python.apache.thermos.monitoring.monitoring                
           .....   SUCCESS
                     src.test.python.apache.thermos.observer.observer                    
           .....   FAILURE
                     src.test.python.apache.thermos.observer.http.http                   
           .....   SUCCESS============== test session starts ===============
                     platform linux2 -- Python 2.7.6 -- py-1.4.31 -- pytest-2.6.4 -- /usr/bin/python2.7
                     plugins: cov, timeout
                     
                     collecting 0 items
                     collecting 3 items
                     collecting 4 items
                     collecting 4 items
                     collected 4 items 
                     
                     src/test/python/apache/thermos/observer/test_detector.py::test_observer_task_detector_construction
PASSED
                     src/test/python/apache/thermos/observer/test_detector.py::test_observer_task_detector_standard_transitions
PASSED
                     src/test/python/apache/thermos/observer/test_detector.py::test_observer_task_detector_nonstandard_transitions
PASSED
                     src/test/python/apache/thermos/observer/test_task_observer.py::TaskObserverTest::test_run_loop
FAILED
                     
                     ==================== FAILURES ====================
                     _________ TaskObserverTest.test_run_loop _________
                     
                     self = <test_task_observer.TaskObserverTest testMethod=test_run_loop>
                     
                         def test_run_loop(self):
                           """Test observer run loop."""
                           mock_task_detector = create_autospec(spec=ObserverTaskDetector)
                           with patch(
                               "apache.thermos.observer.task_observer.ObserverTaskDetector",
                               return_value=mock_task_detector) as mock_detector:
                             with patch('threading._Event.wait') as mock_wait:
                         
                               run_count = 3
                               interval = 15
                               observer = TaskObserver(mock_detector, interval=Amount(interval,
Time.SECONDS))
                               observer.start()
                               while len(mock_wait.mock_calls) < run_count:
                                 pass
                         
                               observer.stop()
                         
                     >         assert len(mock_task_detector.mock_calls) >= run_count
                     E         AssertionError: assert 1 >= 3
                     E          +  where 1 = len([call.refresh()])
                     E          +    where [call.refresh()] = <MagicMock spec='ObserverTaskDetector'
id='140516401431952'>.mock_calls
                     
                     src/test/python/apache/thermos/observer/test_task_observer.py:42: AssertionError
                      generated xml file: <https://builds.apache.org/job/Aurora/ws/dist/test-results/src.test.python.apache.thermos.observer.observer.xml>

                     ======= 1 failed, 3 passed in 0.27 seconds =======
                     
FAILURE


18:01:55 03:40   [complete]
               FAILURE
Build step 'Execute shell' marked build as failure
Recording test results

Mime
View raw message