aurora-dev mailing list archives

Site index · List index
Message view « Date » · « Thread »
Top « Date » · « Thread »
From John Sirois <j...@conductant.com>
Subject Re: Build failed in Jenkins: aurora-packaging-nightly #142
Date Tue, 29 Dec 2015 00:32:47 GMT
On Mon, Dec 28, 2015 at 5:31 PM, Apache Jenkins Server <
jenkins@builds.apache.org> wrote:

> See <https://builds.apache.org/job/aurora-packaging-nightly/142/>
>
> ------------------------------------------
> [...truncated 3091 lines...]
> +
> PATH=/usr/lib/jvm/java-1.8.0/bin:/usr/local/sbin:/usr/local/bin:/usr/sbin:/usr/bin:/sbin:/bin
> + wget https://services.gradle.org/distributions/gradle-2.7-bin.zip
> --2015-12-29 00:24:34--
> https://services.gradle.org/distributions/gradle-2.7-bin.zip
> Resolving services.gradle.org (services.gradle.org)... 104.25.173.23,
> 104.25.172.23, 2400:cb00:2048:1::6819:ad17, ...
> Connecting to services.gradle.org (services.gradle.org)|104.25.173.23|:443...
> connected.
> HTTP request sent, awaiting response... 301 Moved Permanently
> Location: https://downloads.gradle.org/distributions/gradle-2.7-bin.zip
> [following]
> --2015-12-29 00:24:34--
> https://downloads.gradle.org/distributions/gradle-2.7-bin.zip
> Resolving downloads.gradle.org (downloads.gradle.org)... 54.230.145.94
> Connecting to downloads.gradle.org (downloads.gradle.org)|54.230.145.94|:443...
> connected.
> HTTP request sent, awaiting response... 200 OK
> Length: 44809759 (43M) [application/zip]
> Saving to: 'gradle-2.7-bin.zip'
>
>
>  0% [                                       ] 0           --.-K/s
>  0% [                                       ] 242,984     1.08MB/s
>  1% [                                       ] 849,192     1.88MB/s
>  4% [>                                      ] 2,209,064   3.26MB/s
> 11% [===>                                   ] 5,174,568   5.73MB/s
> 24% [========>                              ] 11,014,966  9.89MB/s
> 46% [=================>                     ] 20,707,854  15.6MB/s
> 64% [========================>              ] 28,861,006  18.8MB/s
> 79% [=============================>         ] 35,535,326  20.4MB/s
> 95% [====================================>  ] 42,998,950  22.0MB/s
> 100%[======================================>] 44,809,759  22.4MB/s   in
> 1.9s
>
> 2015-12-29 00:24:36 (22.4 MB/s) - 'gradle-2.7-bin.zip' saved
> [44809759/44809759]
>
> + unzip gradle-2.7-bin.zip
> Archive:  gradle-2.7-bin.zip
>    creating: gradle-2.7/
>   inflating: gradle-2.7/getting-started.html
>   inflating: gradle-2.7/LICENSE
>   inflating: gradle-2.7/NOTICE
>   inflating: gradle-2.7/changelog.txt
>    creating: gradle-2.7/init.d/
>   inflating: gradle-2.7/init.d/readme.txt
>    creating: gradle-2.7/media/
>   inflating: gradle-2.7/media/gradle-icon-512x512.png
>   inflating: gradle-2.7/media/gradle-icon-16x16.png
>   inflating: gradle-2.7/media/gradle.icns
>   inflating: gradle-2.7/media/gradle-icon-128x128.png
>   inflating: gradle-2.7/media/gradle-icon-256x256.png
>   inflating: gradle-2.7/media/gradle-icon-48x48.png
>   inflating: gradle-2.7/media/gradle-icon-24x24.png
>   inflating: gradle-2.7/media/gradle-icon-64x64.png
>   inflating: gradle-2.7/media/gradle-icon-32x32.png
>    creating: gradle-2.7/bin/
>   inflating: gradle-2.7/bin/gradle.bat
>   inflating: gradle-2.7/bin/gradle
>    creating: gradle-2.7/lib/
>   inflating: gradle-2.7/lib/gradle-launcher-2.7.jar
>   inflating: gradle-2.7/lib/gradle-wrapper-2.7.jar
>   inflating: gradle-2.7/lib/gradle-base-services-2.7.jar
>   inflating: gradle-2.7/lib/gradle-core-2.7.jar
>   inflating: gradle-2.7/lib/gradle-cli-2.7.jar
>   inflating: gradle-2.7/lib/gradle-ui-2.7.jar
>   inflating: gradle-2.7/lib/gradle-tooling-api-2.7.jar
>   inflating: gradle-2.7/lib/gradle-native-2.7.jar
>   inflating: gradle-2.7/lib/slf4j-api-1.7.10.jar
>   inflating: gradle-2.7/lib/guava-jdk5-17.0.jar
>   inflating: gradle-2.7/lib/commons-lang-2.6.jar
>   inflating: gradle-2.7/lib/groovy-all-2.3.10.jar
>   inflating: gradle-2.7/lib/gradle-model-core-2.7.jar
>   inflating: gradle-2.7/lib/gradle-model-groovy-2.7.jar
>   inflating: gradle-2.7/lib/asm-all-5.0.3.jar
>   inflating: gradle-2.7/lib/ant-1.9.3.jar
>   inflating: gradle-2.7/lib/commons-collections-3.2.1.jar
>   inflating: gradle-2.7/lib/commons-io-1.4.jar
>   inflating: gradle-2.7/lib/jcip-annotations-1.0.jar
>   inflating: gradle-2.7/lib/jul-to-slf4j-1.7.10.jar
>   inflating: gradle-2.7/lib/jarjar-1.3.jar
>   inflating: gradle-2.7/lib/javax.inject-1.jar
>   inflating: gradle-2.7/lib/gradle-base-services-groovy-2.7.jar
>   inflating: gradle-2.7/lib/gradle-messaging-2.7.jar
>   inflating: gradle-2.7/lib/gradle-resources-2.7.jar
>   inflating: gradle-2.7/lib/gradle-docs-2.7.jar
>   inflating: gradle-2.7/lib/log4j-over-slf4j-1.7.10.jar
>   inflating: gradle-2.7/lib/jcl-over-slf4j-1.7.10.jar
>   inflating: gradle-2.7/lib/gradle-open-api-2.7.jar
>   inflating: gradle-2.7/lib/dom4j-1.6.1.jar
>   inflating: gradle-2.7/lib/jaxen-1.1.jar
>   inflating: gradle-2.7/lib/jna-3.2.7.jar
>   inflating: gradle-2.7/lib/native-platform-0.10.jar
>   inflating: gradle-2.7/lib/jansi-1.2.1.jar
>   inflating: gradle-2.7/lib/ant-launcher-1.9.3.jar
>   inflating: gradle-2.7/lib/kryo-2.20.jar
>   inflating: gradle-2.7/lib/native-platform-osx-i386-0.10.jar
>   inflating: gradle-2.7/lib/native-platform-osx-amd64-0.10.jar
>   inflating: gradle-2.7/lib/native-platform-linux-amd64-0.10.jar
>   inflating: gradle-2.7/lib/native-platform-linux-i386-0.10.jar
>   inflating: gradle-2.7/lib/native-platform-windows-amd64-0.10.jar
>   inflating: gradle-2.7/lib/native-platform-windows-i386-0.10.jar
>   inflating: gradle-2.7/lib/native-platform-freebsd-i386-0.10.jar
>   inflating: gradle-2.7/lib/native-platform-freebsd-amd64-0.10.jar
>   inflating: gradle-2.7/lib/reflectasm-1.07-shaded.jar
>   inflating: gradle-2.7/lib/minlog-1.2.jar
>   inflating: gradle-2.7/lib/objenesis-1.2.jar
>    creating: gradle-2.7/lib/plugins/
>   inflating: gradle-2.7/lib/plugins/gradle-plugins-2.7.jar
>   inflating: gradle-2.7/lib/plugins/gradle-code-quality-2.7.jar
>   inflating: gradle-2.7/lib/plugins/gradle-jetty-2.7.jar
>   inflating: gradle-2.7/lib/plugins/gradle-antlr-2.7.jar
>   inflating: gradle-2.7/lib/plugins/gradle-osgi-2.7.jar
>   inflating: gradle-2.7/lib/plugins/gradle-maven-2.7.jar
>   inflating: gradle-2.7/lib/plugins/gradle-ide-2.7.jar
>   inflating: gradle-2.7/lib/plugins/gradle-announce-2.7.jar
>   inflating: gradle-2.7/lib/plugins/gradle-scala-2.7.jar
>   inflating: gradle-2.7/lib/plugins/gradle-sonar-2.7.jar
>   inflating: gradle-2.7/lib/plugins/gradle-signing-2.7.jar
>   inflating: gradle-2.7/lib/plugins/gradle-ear-2.7.jar
>   inflating: gradle-2.7/lib/plugins/gradle-javascript-2.7.jar
>   inflating: gradle-2.7/lib/plugins/gradle-build-comparison-2.7.jar
>   inflating: gradle-2.7/lib/plugins/gradle-diagnostics-2.7.jar
>   inflating: gradle-2.7/lib/plugins/gradle-reporting-2.7.jar
>   inflating: gradle-2.7/lib/plugins/gradle-publish-2.7.jar
>   inflating: gradle-2.7/lib/plugins/gradle-ivy-2.7.jar
>   inflating: gradle-2.7/lib/plugins/gradle-jacoco-2.7.jar
>   inflating: gradle-2.7/lib/plugins/gradle-build-init-2.7.jar
>   inflating: gradle-2.7/lib/plugins/gradle-platform-base-2.7.jar
>   inflating: gradle-2.7/lib/plugins/gradle-platform-jvm-2.7.jar
>   inflating: gradle-2.7/lib/plugins/gradle-language-jvm-2.7.jar
>   inflating: gradle-2.7/lib/plugins/gradle-language-java-2.7.jar
>   inflating: gradle-2.7/lib/plugins/gradle-language-groovy-2.7.jar
>   inflating: gradle-2.7/lib/plugins/gradle-language-scala-2.7.jar
>   inflating: gradle-2.7/lib/plugins/gradle-platform-native-2.7.jar
>   inflating: gradle-2.7/lib/plugins/gradle-platform-play-2.7.jar
>   inflating: gradle-2.7/lib/plugins/gradle-language-native-2.7.jar
>   inflating: gradle-2.7/lib/plugins/gradle-ide-native-2.7.jar
>   inflating: gradle-2.7/lib/plugins/gradle-testing-native-2.7.jar
>   inflating: gradle-2.7/lib/plugins/gradle-plugin-development-2.7.jar
>   inflating: gradle-2.7/lib/plugins/gradle-plugin-use-2.7.jar
>   inflating: gradle-2.7/lib/plugins/gradle-resources-http-2.7.jar
>   inflating: gradle-2.7/lib/plugins/gradle-resources-sftp-2.7.jar
>   inflating: gradle-2.7/lib/plugins/gradle-resources-s3-2.7.jar
>   inflating: gradle-2.7/lib/plugins/gradle-tooling-api-builders-2.7.jar
>   inflating: gradle-2.7/lib/plugins/gradle-dependency-management-2.7.jar
>   inflating: gradle-2.7/lib/plugins/gradle-test-kit-2.7.jar
>   inflating: gradle-2.7/lib/plugins/junit-4.12.jar
>   inflating: gradle-2.7/lib/plugins/testng-6.3.1.jar
>   inflating: gradle-2.7/lib/plugins/commons-cli-1.2.jar
>   inflating: gradle-2.7/lib/plugins/jetty-6.1.25.jar
>   inflating: gradle-2.7/lib/plugins/jetty-util-6.1.25.jar
>   inflating: gradle-2.7/lib/plugins/servlet-api-2.5-20081211.jar
>   inflating: gradle-2.7/lib/plugins/jetty-plus-6.1.25.jar
>   inflating: gradle-2.7/lib/plugins/jsp-2.1-6.1.14.jar
>   inflating: gradle-2.7/lib/plugins/jetty-annotations-6.1.25.jar
>   inflating: gradle-2.7/lib/plugins/geronimo-annotation_1.0_spec-1.0.jar
>   inflating: gradle-2.7/lib/plugins/bndlib-2.1.0.jar
>   inflating: gradle-2.7/lib/plugins/maven-core-3.0.4.jar
>   inflating: gradle-2.7/lib/plugins/pmaven-common-0.8-20100325.jar
>   inflating: gradle-2.7/lib/plugins/pmaven-groovy-0.8-20100325.jar
>   inflating: gradle-2.7/lib/plugins/sonar-batch-bootstrapper-2.9.jar
>   inflating: gradle-2.7/lib/plugins/bcpg-jdk15on-1.51.jar
>   inflating: gradle-2.7/lib/plugins/rhino-1.7R3.jar
>   inflating: gradle-2.7/lib/plugins/gson-2.2.4.jar
>   inflating: gradle-2.7/lib/plugins/simple-4.1.21.jar
>   inflating: gradle-2.7/lib/plugins/jatl-0.2.2.jar
>   inflating: gradle-2.7/lib/plugins/httpclient-4.2.2.jar
>   inflating: gradle-2.7/lib/plugins/nekohtml-1.9.14.jar
>   inflating: gradle-2.7/lib/plugins/jsch-0.1.51.jar
>   inflating: gradle-2.7/lib/plugins/aws-java-sdk-s3-1.9.19.jar
>   inflating: gradle-2.7/lib/plugins/aws-java-sdk-kms-1.9.19.jar
>   inflating: gradle-2.7/lib/plugins/aws-java-sdk-core-1.9.19.jar
>   inflating: gradle-2.7/lib/plugins/jackson-core-2.3.2.jar
>   inflating: gradle-2.7/lib/plugins/jackson-annotations-2.3.2.jar
>   inflating: gradle-2.7/lib/plugins/jackson-databind-2.3.2.jar
>   inflating: gradle-2.7/lib/plugins/joda-time-2.8.2.jar
>   inflating: gradle-2.7/lib/plugins/ivy-2.2.0.jar
>   inflating: gradle-2.7/lib/plugins/xbean-reflect-3.4.jar
>   inflating: gradle-2.7/lib/plugins/bcprov-jdk15on-1.51.jar
>   inflating: gradle-2.7/lib/plugins/bsh-2.0b4.jar
>   inflating: gradle-2.7/lib/plugins/jcommander-1.12.jar
>   inflating: gradle-2.7/lib/plugins/snakeyaml-1.6.jar
>   inflating: gradle-2.7/lib/plugins/jetty-naming-6.1.25.jar
>   inflating: gradle-2.7/lib/plugins/core-3.1.1.jar
>   inflating: gradle-2.7/lib/plugins/jsp-api-2.1-6.1.14.jar
>   inflating: gradle-2.7/lib/plugins/plexus-sec-dispatcher-1.3.jar
>   inflating: gradle-2.7/lib/plugins/aether-impl-1.13.1.jar
>   inflating: gradle-2.7/lib/plugins/aether-util-1.13.1.jar
>   inflating: gradle-2.7/lib/plugins/aether-spi-1.13.1.jar
>   inflating: gradle-2.7/lib/plugins/wagon-provider-api-2.4.jar
>   inflating: gradle-2.7/lib/plugins/maven-aether-provider-3.0.4.jar
>   inflating: gradle-2.7/lib/plugins/maven-repository-metadata-3.0.4.jar
>   inflating: gradle-2.7/lib/plugins/plexus-classworlds-2.4.jar
>   inflating: gradle-2.7/lib/plugins/aether-connector-wagon-1.13.1.jar
>   inflating: gradle-2.7/lib/plugins/maven-model-3.0.4.jar
>   inflating: gradle-2.7/lib/plugins/wagon-http-2.4.jar
>   inflating: gradle-2.7/lib/plugins/maven-settings-builder-3.0.4.jar
>   inflating: gradle-2.7/lib/plugins/maven-compat-3.0.4.jar
>   inflating: gradle-2.7/lib/plugins/maven-plugin-api-3.0.4.jar
>   inflating: gradle-2.7/lib/plugins/plexus-container-default-1.5.5.jar
>   inflating: gradle-2.7/lib/plugins/maven-artifact-3.0.4.jar
>   inflating: gradle-2.7/lib/plugins/plexus-interpolation-1.14.jar
>   inflating: gradle-2.7/lib/plugins/maven-settings-3.0.4.jar
>   inflating: gradle-2.7/lib/plugins/aether-api-1.13.1.jar
>   inflating: gradle-2.7/lib/plugins/plexus-cipher-1.7.jar
>   inflating: gradle-2.7/lib/plugins/wagon-file-2.4.jar
>   inflating: gradle-2.7/lib/plugins/maven-model-builder-3.0.4.jar
>   inflating: gradle-2.7/lib/plugins/plexus-utils-2.0.6.jar
>   inflating: gradle-2.7/lib/plugins/wagon-http-shared4-2.4.jar
>   inflating: gradle-2.7/lib/plugins/commons-codec-1.6.jar
>   inflating: gradle-2.7/lib/plugins/httpcore-4.2.2.jar
>   inflating: gradle-2.7/lib/plugins/jcifs-1.3.17.jar
>   inflating: gradle-2.7/lib/plugins/xercesImpl-2.9.1.jar
>   inflating: gradle-2.7/lib/plugins/xml-apis-1.3.04.jar
>   inflating: gradle-2.7/lib/plugins/hamcrest-core-1.3.jar
>   inflating: gradle-2.7/lib/plugins/plexus-component-annotations-1.5.5.jar
>    creating: gradle-2.7/lib/plugins/sonar/
>   inflating: gradle-2.7/lib/plugins/sonar/logback-classic-1.0.13.jar
>   inflating: gradle-2.7/lib/plugins/sonar/logback-core-1.0.13.jar
> + ./gradle-2.7/bin/gradle installDist
>  [0m [1m> Loading [22m [1m > buildSrc [22m [1m > settings [22m [11D [0K
> [1m > Compiling script into cache [22m [30D [0K [1m > Compiling script into
> cache [22m [30D [0K [1m > Compiling script into cache [22m [30D [0K [1m >
> Compiling script into cache [22m [30D [0K [11D [0K [9D [0K
>  [1m> Loading [22m [9D [0K [31mFAILURE:  [39m
>  [1m> Loading [22m [9D [0K [1A [9C [31mBuild failed with an exception. [39m
>  [1m> Loading [22m [9D [0K [1A [40C
>  [1m> Loading [22m [9D [0K
>  [1m> Loading [22m [9D [0K* Where:
>  [1m> Loading [22m [9D [0KBuild file
> '/dist/rpmbuild/BUILD/apache-aurora-0.12.0snapshot.2015.12.29/buildSrc/build.gradle'
> line: 16
>  [1m> Loading [22m [9D [0K
>  [1m> Loading [22m [9D [0K* What went wrong:
>  [1m> Loading [22m [9D [0KA problem occurred evaluating root project
> 'buildSrc'.
>  [1m> Loading [22m [9D [0K [33m>  [39m
>  [1m> Loading [22m [9D [0K [1A [2CBuilding is only supported with gradle
> version: 2.10 .
>

This is an expected race failure - fix is here:
https://reviews.apache.org/r/41756/


>  [1m> Loading [22m [9D [0K
>  [1m> Loading [22m [9D [0K* Try:
>  [1m> Loading [22m [9D [0KRun with
>  [1m> Loading [22m [9D [0K [1A [9C [1m--stacktrace [22m
>  [1m> Loading [22m [9D [0K [1A [21C option to get the stack trace. Run with
>  [1m> Loading [22m [9D [0K [1A [62C [1m--info [22m
>  [1m> Loading [22m [9D [0K [1A [68C or
>  [1m> Loading [22m [9D [0K [1A [72C [1m--debug [22m
>  [1m> Loading [22m [9D [0K [1A [79C option to get more log output.
>  [1m> Loading [22m [9D [0K
>  [1m> Loading [22m [9D [0K [31mBUILD FAILED [39m
>  [1m> Loading [22m [9D [0K [1A [12C
>  [1m> Loading [22m [9D [0K
>  [1m> Loading [22m [9D [0KTotal time: 4.179 secs
>  [1m> Loading [22m [9D [0K [0merror: Bad exit status from
> /var/tmp/rpm-tmp.zyiWa6 (%build)
>
>
> RPM build errors:
>     Macro %MESOS_VERSION has empty body
>     Macro %MESOS_VERSION has empty body
>     Bad exit status from /var/tmp/rpm-tmp.zyiWa6 (%build)
> make: *** [rpm] Error 1
> Build step 'Execute shell' marked build as failure
> Skipped archiving because build is not successful
>



-- 
John Sirois
303-512-3301

Mime
  • Unnamed multipart/alternative (inline, None, 0 bytes)
View raw message