aurora-dev mailing list archives

Site index · List index
Message view « Date » · « Thread »
Top « Date » · « Thread »
From Apache Jenkins Server <jenk...@builds.apache.org>
Subject Build failed in Jenkins: aurora-packaging-nightly #60
Date Thu, 08 Oct 2015 00:30:26 GMT
See <https://builds.apache.org/job/aurora-packaging-nightly/60/changes>

Changes:

[wfarner] Better handling of enums and constructor-only classes in test coverage

[wfarner] Upgrade to gradle 2.7 and checkstyle 6.11.2.

------------------------------------------
[...truncated 2168 lines...]
+ umask 022
+ cd /dist/rpmbuild/BUILD
+ cd apache-aurora-0.10.0snapshot.2015.10.08
+ export PATH=/usr/lib/jvm/java-1.8.0/bin:/usr/local/sbin:/usr/local/bin:/usr/sbin:/usr/bin:/sbin:/bin
+ PATH=/usr/lib/jvm/java-1.8.0/bin:/usr/local/sbin:/usr/local/bin:/usr/sbin:/usr/bin:/sbin:/bin
+ wget https://services.gradle.org/distributions/gradle-2.6-bin.zip
--2015-10-08 00:27:00--  https://services.gradle.org/distributions/gradle-2.6-bin.zip
Resolving services.gradle.org (services.gradle.org)... 141.101.126.248, 141.101.125.248, 2400:cb00:2048:1::8d65:7ef8,
...
Connecting to services.gradle.org (services.gradle.org)|141.101.126.248|:443... connected.
HTTP request sent, awaiting response... 301 Moved Permanently
Location: https://downloads.gradle.org/distributions/gradle-2.6-bin.zip [following]
--2015-10-08 00:27:00--  https://downloads.gradle.org/distributions/gradle-2.6-bin.zip
Resolving downloads.gradle.org (downloads.gradle.org)... 54.192.147.97
Connecting to downloads.gradle.org (downloads.gradle.org)|54.192.147.97|:443... connected.
HTTP request sent, awaiting response... 200 OK
Length: 44743194 (43M) [application/zip]
Saving to: 'gradle-2.6-bin.zip'


 0% [                                       ] 0           --.-K/s              
 0% [                                       ] 292,671     1.33MB/s             
 2% [                                       ] 1,144,639   2.59MB/s             
 6% [=>                                     ] 3,028,799   4.53MB/s             
16% [=====>                                 ] 7,436,095   8.47MB/s             
28% [=========>                             ] 12,611,446  11.6MB/s             
38% [==============>                        ] 17,411,070  13.4MB/s             
55% [====================>                  ] 24,745,190  16.4MB/s             
77% [=============================>         ] 34,888,430  20.3MB/s             
100%[======================================>] 44,743,194  23.5MB/s   in 1.8s   

2015-10-08 00:27:03 (23.5 MB/s) - 'gradle-2.6-bin.zip' saved [44743194/44743194]

+ unzip gradle-2.6-bin.zip
Archive:  gradle-2.6-bin.zip
   creating: gradle-2.6/
  inflating: gradle-2.6/getting-started.html  
  inflating: gradle-2.6/LICENSE      
  inflating: gradle-2.6/NOTICE       
  inflating: gradle-2.6/changelog.txt  
   creating: gradle-2.6/init.d/
  inflating: gradle-2.6/init.d/readme.txt  
   creating: gradle-2.6/media/
  inflating: gradle-2.6/media/gradle-icon-512x512.png  
  inflating: gradle-2.6/media/gradle-icon-16x16.png  
  inflating: gradle-2.6/media/gradle.icns  
  inflating: gradle-2.6/media/gradle-icon-128x128.png  
  inflating: gradle-2.6/media/gradle-icon-256x256.png  
  inflating: gradle-2.6/media/gradle-icon-48x48.png  
  inflating: gradle-2.6/media/gradle-icon-24x24.png  
  inflating: gradle-2.6/media/gradle-icon-64x64.png  
  inflating: gradle-2.6/media/gradle-icon-32x32.png  
   creating: gradle-2.6/bin/
  inflating: gradle-2.6/bin/gradle   
  inflating: gradle-2.6/bin/gradle.bat  
   creating: gradle-2.6/lib/
  inflating: gradle-2.6/lib/gradle-launcher-2.6.jar  
  inflating: gradle-2.6/lib/gradle-wrapper-2.6.jar  
  inflating: gradle-2.6/lib/gradle-base-services-2.6.jar  
  inflating: gradle-2.6/lib/gradle-core-2.6.jar  
  inflating: gradle-2.6/lib/gradle-cli-2.6.jar  
  inflating: gradle-2.6/lib/gradle-tooling-api-2.6.jar  
  inflating: gradle-2.6/lib/gradle-ui-2.6.jar  
  inflating: gradle-2.6/lib/gradle-native-2.6.jar  
  inflating: gradle-2.6/lib/slf4j-api-1.7.10.jar  
  inflating: gradle-2.6/lib/guava-jdk5-17.0.jar  
  inflating: gradle-2.6/lib/commons-lang-2.6.jar  
  inflating: gradle-2.6/lib/groovy-all-2.3.10.jar  
  inflating: gradle-2.6/lib/gradle-model-groovy-2.6.jar  
  inflating: gradle-2.6/lib/gradle-model-core-2.6.jar  
  inflating: gradle-2.6/lib/commons-collections-3.2.1.jar  
  inflating: gradle-2.6/lib/ant-1.9.3.jar  
  inflating: gradle-2.6/lib/asm-all-5.0.3.jar  
  inflating: gradle-2.6/lib/commons-io-1.4.jar  
  inflating: gradle-2.6/lib/jul-to-slf4j-1.7.10.jar  
  inflating: gradle-2.6/lib/jcip-annotations-1.0.jar  
  inflating: gradle-2.6/lib/gradle-messaging-2.6.jar  
  inflating: gradle-2.6/lib/jarjar-1.3.jar  
  inflating: gradle-2.6/lib/javax.inject-1.jar  
  inflating: gradle-2.6/lib/gradle-base-services-groovy-2.6.jar  
  inflating: gradle-2.6/lib/gradle-docs-2.6.jar  
  inflating: gradle-2.6/lib/log4j-over-slf4j-1.7.10.jar  
  inflating: gradle-2.6/lib/jcl-over-slf4j-1.7.10.jar  
  inflating: gradle-2.6/lib/gradle-open-api-2.6.jar  
  inflating: gradle-2.6/lib/gradle-resources-2.6.jar  
  inflating: gradle-2.6/lib/native-platform-0.10.jar  
  inflating: gradle-2.6/lib/jna-3.2.7.jar  
  inflating: gradle-2.6/lib/ant-launcher-1.9.3.jar  
  inflating: gradle-2.6/lib/jansi-1.2.1.jar  
  inflating: gradle-2.6/lib/jaxen-1.1.jar  
  inflating: gradle-2.6/lib/dom4j-1.6.1.jar  
  inflating: gradle-2.6/lib/native-platform-osx-amd64-0.10.jar  
  inflating: gradle-2.6/lib/native-platform-linux-amd64-0.10.jar  
  inflating: gradle-2.6/lib/native-platform-osx-i386-0.10.jar  
  inflating: gradle-2.6/lib/kryo-2.20.jar  
  inflating: gradle-2.6/lib/native-platform-windows-amd64-0.10.jar  
  inflating: gradle-2.6/lib/native-platform-linux-i386-0.10.jar  
  inflating: gradle-2.6/lib/native-platform-freebsd-amd64-0.10.jar  
  inflating: gradle-2.6/lib/native-platform-freebsd-i386-0.10.jar  
  inflating: gradle-2.6/lib/native-platform-windows-i386-0.10.jar  
  inflating: gradle-2.6/lib/objenesis-1.2.jar  
  inflating: gradle-2.6/lib/minlog-1.2.jar  
  inflating: gradle-2.6/lib/reflectasm-1.07-shaded.jar  
   creating: gradle-2.6/lib/plugins/
  inflating: gradle-2.6/lib/plugins/gradle-plugins-2.6.jar  
  inflating: gradle-2.6/lib/plugins/gradle-code-quality-2.6.jar  
  inflating: gradle-2.6/lib/plugins/gradle-antlr-2.6.jar  
  inflating: gradle-2.6/lib/plugins/gradle-jetty-2.6.jar  
  inflating: gradle-2.6/lib/plugins/gradle-osgi-2.6.jar  
  inflating: gradle-2.6/lib/plugins/gradle-maven-2.6.jar  
  inflating: gradle-2.6/lib/plugins/gradle-ide-2.6.jar  
  inflating: gradle-2.6/lib/plugins/gradle-scala-2.6.jar  
  inflating: gradle-2.6/lib/plugins/gradle-announce-2.6.jar  
  inflating: gradle-2.6/lib/plugins/gradle-signing-2.6.jar  
  inflating: gradle-2.6/lib/plugins/gradle-ear-2.6.jar  
  inflating: gradle-2.6/lib/plugins/gradle-sonar-2.6.jar  
  inflating: gradle-2.6/lib/plugins/gradle-javascript-2.6.jar  
  inflating: gradle-2.6/lib/plugins/gradle-build-comparison-2.6.jar  
  inflating: gradle-2.6/lib/plugins/gradle-diagnostics-2.6.jar  
  inflating: gradle-2.6/lib/plugins/gradle-reporting-2.6.jar  
  inflating: gradle-2.6/lib/plugins/gradle-ivy-2.6.jar  
  inflating: gradle-2.6/lib/plugins/gradle-publish-2.6.jar  
  inflating: gradle-2.6/lib/plugins/gradle-platform-base-2.6.jar  
  inflating: gradle-2.6/lib/plugins/gradle-build-init-2.6.jar  
  inflating: gradle-2.6/lib/plugins/gradle-jacoco-2.6.jar  
  inflating: gradle-2.6/lib/plugins/gradle-language-jvm-2.6.jar  
  inflating: gradle-2.6/lib/plugins/gradle-platform-jvm-2.6.jar  
  inflating: gradle-2.6/lib/plugins/gradle-language-java-2.6.jar  
  inflating: gradle-2.6/lib/plugins/gradle-platform-native-2.6.jar  
  inflating: gradle-2.6/lib/plugins/gradle-language-groovy-2.6.jar  
  inflating: gradle-2.6/lib/plugins/gradle-language-scala-2.6.jar  
  inflating: gradle-2.6/lib/plugins/gradle-testing-native-2.6.jar  
  inflating: gradle-2.6/lib/plugins/gradle-ide-native-2.6.jar  
  inflating: gradle-2.6/lib/plugins/gradle-language-native-2.6.jar  
  inflating: gradle-2.6/lib/plugins/gradle-platform-play-2.6.jar  
  inflating: gradle-2.6/lib/plugins/gradle-resources-s3-2.6.jar  
  inflating: gradle-2.6/lib/plugins/gradle-tooling-api-builders-2.6.jar  
  inflating: gradle-2.6/lib/plugins/gradle-resources-sftp-2.6.jar  
  inflating: gradle-2.6/lib/plugins/gradle-resources-http-2.6.jar  
  inflating: gradle-2.6/lib/plugins/gradle-plugin-development-2.6.jar  
  inflating: gradle-2.6/lib/plugins/gradle-plugin-use-2.6.jar  
  inflating: gradle-2.6/lib/plugins/gradle-dependency-management-2.6.jar  
  inflating: gradle-2.6/lib/plugins/gradle-test-kit-2.6.jar  
  inflating: gradle-2.6/lib/plugins/junit-4.12.jar  
  inflating: gradle-2.6/lib/plugins/testng-6.3.1.jar  
  inflating: gradle-2.6/lib/plugins/geronimo-annotation_1.0_spec-1.0.jar  
  inflating: gradle-2.6/lib/plugins/jetty-annotations-6.1.25.jar  
  inflating: gradle-2.6/lib/plugins/jsp-2.1-6.1.14.jar  
  inflating: gradle-2.6/lib/plugins/jetty-plus-6.1.25.jar  
  inflating: gradle-2.6/lib/plugins/servlet-api-2.5-20081211.jar  
  inflating: gradle-2.6/lib/plugins/jetty-util-6.1.25.jar  
  inflating: gradle-2.6/lib/plugins/jetty-6.1.25.jar  
  inflating: gradle-2.6/lib/plugins/commons-cli-1.2.jar  
  inflating: gradle-2.6/lib/plugins/pmaven-common-0.8-20100325.jar  
  inflating: gradle-2.6/lib/plugins/pmaven-groovy-0.8-20100325.jar  
  inflating: gradle-2.6/lib/plugins/maven-core-3.0.4.jar  
  inflating: gradle-2.6/lib/plugins/bndlib-2.1.0.jar  
  inflating: gradle-2.6/lib/plugins/simple-4.1.21.jar  
  inflating: gradle-2.6/lib/plugins/jatl-0.2.2.jar  
  inflating: gradle-2.6/lib/plugins/sonar-batch-bootstrapper-2.9.jar  
  inflating: gradle-2.6/lib/plugins/bcpg-jdk15on-1.51.jar  
  inflating: gradle-2.6/lib/plugins/rhino-1.7R3.jar  
  inflating: gradle-2.6/lib/plugins/gson-2.2.4.jar  
  inflating: gradle-2.6/lib/plugins/xbean-reflect-3.4.jar  
  inflating: gradle-2.6/lib/plugins/ivy-2.2.0.jar  
  inflating: gradle-2.6/lib/plugins/bcprov-jdk15on-1.51.jar  
  inflating: gradle-2.6/lib/plugins/httpclient-4.2.2.jar  
  inflating: gradle-2.6/lib/plugins/nekohtml-1.9.14.jar  
  inflating: gradle-2.6/lib/plugins/jsch-0.1.51.jar  
  inflating: gradle-2.6/lib/plugins/aws-java-sdk-s3-1.9.19.jar  
  inflating: gradle-2.6/lib/plugins/aws-java-sdk-kms-1.9.19.jar  
  inflating: gradle-2.6/lib/plugins/aws-java-sdk-core-1.9.19.jar  
  inflating: gradle-2.6/lib/plugins/jackson-core-2.3.2.jar  
  inflating: gradle-2.6/lib/plugins/jackson-annotations-2.3.2.jar  
  inflating: gradle-2.6/lib/plugins/jackson-databind-2.3.2.jar  
  inflating: gradle-2.6/lib/plugins/joda-time-2.7.jar  
  inflating: gradle-2.6/lib/plugins/jsp-api-2.1-6.1.14.jar  
  inflating: gradle-2.6/lib/plugins/core-3.1.1.jar  
  inflating: gradle-2.6/lib/plugins/jetty-naming-6.1.25.jar  
  inflating: gradle-2.6/lib/plugins/snakeyaml-1.6.jar  
  inflating: gradle-2.6/lib/plugins/jcommander-1.12.jar  
  inflating: gradle-2.6/lib/plugins/plexus-classworlds-2.4.jar  
  inflating: gradle-2.6/lib/plugins/maven-repository-metadata-3.0.4.jar  
  inflating: gradle-2.6/lib/plugins/maven-aether-provider-3.0.4.jar  
  inflating: gradle-2.6/lib/plugins/wagon-provider-api-2.4.jar  
  inflating: gradle-2.6/lib/plugins/aether-spi-1.13.1.jar  
  inflating: gradle-2.6/lib/plugins/aether-util-1.13.1.jar  
  inflating: gradle-2.6/lib/plugins/aether-impl-1.13.1.jar  
  inflating: gradle-2.6/lib/plugins/plexus-sec-dispatcher-1.3.jar  
  inflating: gradle-2.6/lib/plugins/bsh-2.0b4.jar  
  inflating: gradle-2.6/lib/plugins/xercesImpl-2.9.1.jar  
  inflating: gradle-2.6/lib/plugins/commons-codec-1.6.jar  
  inflating: gradle-2.6/lib/plugins/jcifs-1.3.17.jar  
  inflating: gradle-2.6/lib/plugins/httpcore-4.2.2.jar  
  inflating: gradle-2.6/lib/plugins/xml-apis-1.3.04.jar  
  inflating: gradle-2.6/lib/plugins/maven-compat-3.0.4.jar  
  inflating: gradle-2.6/lib/plugins/maven-plugin-api-3.0.4.jar  
  inflating: gradle-2.6/lib/plugins/plexus-container-default-1.5.5.jar  
  inflating: gradle-2.6/lib/plugins/maven-artifact-3.0.4.jar  
  inflating: gradle-2.6/lib/plugins/aether-connector-wagon-1.13.1.jar  
  inflating: gradle-2.6/lib/plugins/maven-model-3.0.4.jar  
  inflating: gradle-2.6/lib/plugins/wagon-http-2.4.jar  
  inflating: gradle-2.6/lib/plugins/maven-settings-builder-3.0.4.jar  
  inflating: gradle-2.6/lib/plugins/wagon-file-2.4.jar  
  inflating: gradle-2.6/lib/plugins/maven-model-builder-3.0.4.jar  
  inflating: gradle-2.6/lib/plugins/plexus-utils-2.0.6.jar  
  inflating: gradle-2.6/lib/plugins/wagon-http-shared4-2.4.jar  
  inflating: gradle-2.6/lib/plugins/plexus-interpolation-1.14.jar  
  inflating: gradle-2.6/lib/plugins/maven-settings-3.0.4.jar  
  inflating: gradle-2.6/lib/plugins/aether-api-1.13.1.jar  
  inflating: gradle-2.6/lib/plugins/plexus-cipher-1.7.jar  
  inflating: gradle-2.6/lib/plugins/hamcrest-core-1.3.jar  
  inflating: gradle-2.6/lib/plugins/plexus-component-annotations-1.5.5.jar  
   creating: gradle-2.6/lib/plugins/sonar/
  inflating: gradle-2.6/lib/plugins/sonar/logback-classic-1.0.13.jar  
  inflating: gradle-2.6/lib/plugins/sonar/logback-core-1.0.13.jar  
+ ./gradle-2.6/bin/gradle installDist
> Loading > buildSrc > settings >
Compiling script into cache > Compiling script into cache
> Compiling script into cache > Compiling script into cache
> LoadingFAILURE: 
> LoadingBuild failed with an exception.
> Loading
> Loading
> Loading* Where:
> LoadingBuild file '/dist/rpmbuild/BUILD/apache-aurora-0.10.0snapshot.2015.10.08/buildSrc/build.gradle'
line: 16
> Loading
> Loading* What went wrong:
> LoadingA problem occurred evaluating root project 'buildSrc'.
> Loading> 
> LoadingBuilding is only supported with gradle version: 2.7 .
> Loading
> Loading* Try:
> LoadingRun with 
> Loading--stacktrace
> Loading option to get the stack trace. Run with 
> Loading--info
> Loading or 
> Loading--debug
> Loading option to get more log output.
> Loading
> LoadingBUILD FAILED
> Loading
> Loading
> LoadingTotal time: 4.927 secs
> Loadingerror: Bad exit status from /var/tmp/rpm-tmp.avrkVR (%build)


RPM build errors:
    Bad exit status from /var/tmp/rpm-tmp.avrkVR (%build)
make: *** [rpm] Error 1
Build step 'Execute shell' marked build as failure

Mime
View raw message