aurora-dev mailing list archives

Site index · List index
Message view « Date » · « Thread »
Top « Date » · « Thread »
From Apache Jenkins Server <jenk...@builds.apache.org>
Subject Build failed in Jenkins: Aurora #1050
Date Wed, 20 May 2015 18:01:10 GMT
See <https://builds.apache.org/job/Aurora/1050/changes>

Changes:

[maxim] Exposing task reconciliation stats.

------------------------------------------
[...truncated 3294 lines...]
                     ============== test session starts ===============
                     platform linux2 -- Python 2.7.6 -- py-1.4.27 -- pytest-2.7.1 -- <https://builds.apache.org/job/Aurora/ws/build-support/pants.venv/bin/python2.7>
                     rootdir: <https://builds.apache.org/job/Aurora/ws/src/test/python/apache/thermos/cli,>
inifile: 
                     plugins: cov, timeout
                     
                     collecting 0 items
                     collecting 2 items
                     collected 2 items 
                     
                     src/test/python/apache/thermos/cli/test_common.py::test_get_task_from_options
PASSED
                     src/test/python/apache/thermos/cli/test_common.py::test_get_task_from_options_invalid
PASSED
                     
                      generated xml file: <https://builds.apache.org/job/Aurora/ws/dist/test-results/src.test.python.apache.thermos.cli.common.xml>

                     ============ 2 passed in 0.28 seconds ============
                     ============== test session starts ===============
                     platform linux2 -- Python 2.7.6 -- py-1.4.27 -- pytest-2.7.1 -- <https://builds.apache.org/job/Aurora/ws/build-support/pants.venv/bin/python2.7>
                     rootdir: <https://builds.apache.org/job/Aurora/ws/src/test/python/apache/thermos/cli,>
inifile: 
                     plugins: cov, timeout
                     
                     collecting 0 items
                     collecting 1 items
                     collected 1 items 
                     
                     src/test/python/apache/thermos/cli/test_main.py::test_noop PASSED
                     
                      generated xml file: <https://builds.apache.org/job/Aurora/ws/dist/test-results/src.test.python.apache.thermos.cli.main.xml>

                     ============ 1 passed in 0.18 seconds ============
                     ============== test session starts ===============
                     platform linux2 -- Python 2.7.6 -- py-1.4.27 -- pytest-2.7.1 -- <https://builds.apache.org/job/Aurora/ws/build-support/pants.venv/bin/python2.7>
                     rootdir: <https://builds.apache.org/job/Aurora/ws/src/test/python/apache/thermos/cli/commands,>
inifile: 
                     plugins: cov, timeout
                     
                     collecting 0 items
                     collecting 1 items
                     collecting 2 items
                     collected 2 items 
                     
                     src/test/python/apache/thermos/cli/commands/test_import.py::test_imports
PASSED
                     src/test/python/apache/thermos/cli/commands/test_simplerun.py::test_simplerun
<- <https://builds.apache.org/job/Aurora/ws/src/test/python/apache/thermos/cli/commands/test_simplerun.py>
PASSED
                     
                      generated xml file: <https://builds.apache.org/job/Aurora/ws/dist/test-results/src.test.python.apache.thermos.cli.commands.commands.xml>

                     ============ 2 passed in 0.23 seconds ============
                     ============== test session starts ===============
                     platform linux2 -- Python 2.7.6 -- py-1.4.27 -- pytest-2.7.1 -- <https://builds.apache.org/job/Aurora/ws/build-support/pants.venv/bin/python2.7>
                     rootdir: <https://builds.apache.org/job/Aurora/ws/src/test/python/apache/thermos/monitoring,>
inifile: 
                     plugins: cov, timeout
                     
                     collecting 0 items
                     collecting 1 items
                     collected 1 items 
                     
                     src/test/python/apache/thermos/monitoring/test_disk.py::test_du_diskcollector
PASSED
                     
                      generated xml file: <https://builds.apache.org/job/Aurora/ws/dist/test-results/src.test.python.apache.thermos.monitoring.test_disk.xml>

                     ============ 1 passed in 0.73 seconds ============
                     ============== test session starts ===============
                     platform linux2 -- Python 2.7.6 -- py-1.4.27 -- pytest-2.7.1 -- <https://builds.apache.org/job/Aurora/ws/build-support/pants.venv/bin/python2.7>
                     rootdir: <https://builds.apache.org/job/Aurora/ws/src/test/python/apache/aurora/executor/common,>
inifile: 
                     plugins: cov, timeout
                     
                     collecting 0 items
                     collecting 1 items
                     collected 1 items 
                     
                     src/test/python/apache/aurora/executor/common/test_path_detector.py::test_path_detector
PASSED
                     
                      generated xml file: <https://builds.apache.org/job/Aurora/ws/dist/test-results/src.test.python.apache.aurora.executor.common.path_detector.xml>

                     ============ 1 passed in 0.04 seconds ============
                     ============== test session starts ===============
                     platform linux2 -- Python 2.7.6 -- py-1.4.27 -- pytest-2.7.1 -- <https://builds.apache.org/job/Aurora/ws/build-support/pants.venv/bin/python2.7>
                     rootdir: <https://builds.apache.org/job/Aurora/ws/src/test/python/apache/aurora/executor/common,>
inifile: 
                     plugins: cov, timeout
                     
                     collecting 0 items
                     collecting 2 items
                     collected 2 items 
                     
                     src/test/python/apache/aurora/executor/common/test_task_info.py::test_deserialize_thermos_task
PASSED
                     src/test/python/apache/aurora/executor/common/test_task_info.py::test_deserialize_thermos_task_unbound_refs
PASSED
                     
                      generated xml file: <https://builds.apache.org/job/Aurora/ws/dist/test-results/src.test.python.apache.aurora.executor.common.task_info.xml>

                     ============ 2 passed in 0.23 seconds ============
                     ============== test session starts ===============
                     platform linux2 -- Python 2.7.6 -- py-1.4.27 -- pytest-2.7.1 -- <https://builds.apache.org/job/Aurora/ws/build-support/pants.venv/bin/python2.7>
                     rootdir: <https://builds.apache.org/job/Aurora/ws/src/test/python/apache/aurora/client/cli,>
inifile: 
                     plugins: cov, timeout
                     
                     collecting 0 items
                     collecting 3 items
                     collecting 3 items
                     collecting 3 items
                     collected 3 items 
                     
                     src/test/python/apache/aurora/client/cli/test_config_noun.py::TestClientCreateCommand::test_list_configs
PASSED
                     src/test/python/apache/aurora/client/cli/test_config_noun.py::TestClientCreateCommand::test_list_configs_invalid
PASSED
                     src/test/python/apache/aurora/client/cli/test_config_noun.py::TestClientCreateCommand::test_list_configs_nojobs
PASSED
                     
                      generated xml file: <https://builds.apache.org/job/Aurora/ws/dist/test-results/src.test.python.apache.aurora.client.cli.config.xml>

                     ============ 3 passed in 0.82 seconds ============
                     ============== test session starts ===============
                     platform linux2 -- Python 2.7.6 -- py-1.4.27 -- pytest-2.7.1 -- <https://builds.apache.org/job/Aurora/ws/build-support/pants.venv/bin/python2.7>
                     rootdir: <https://builds.apache.org/job/Aurora/ws/src/test/python/apache/aurora/common,>
inifile: 
                     plugins: cov, timeout
                     
                     collecting 0 items
                     collecting 3 items
                     collecting 3 items
                     collected 3 items 
                     
                     src/test/python/apache/aurora/common/test_http_signaler.py::TestHttpSignaler::test_all_calls_ok
PASSED
                     src/test/python/apache/aurora/common/test_http_signaler.py::TestHttpSignaler::test_exception
PASSED
                     src/test/python/apache/aurora/common/test_http_signaler.py::TestHttpSignaler::test_health_not_ok
PASSED
                     
                      generated xml file: <https://builds.apache.org/job/Aurora/ws/dist/test-results/src.test.python.apache.aurora.common.test_http_signaler.xml>

                     ============ 3 passed in 0.06 seconds ============
                     ============== test session starts ===============
                     platform linux2 -- Python 2.7.6 -- py-1.4.27 -- pytest-2.7.1 -- <https://builds.apache.org/job/Aurora/ws/build-support/pants.venv/bin/python2.7>
                     rootdir: <https://builds.apache.org/job/Aurora/ws/src/test/python/apache/aurora/client/cli,>
inifile: 
                     plugins: cov, timeout
                     
                     collecting 0 items
                     collecting 10 items
                     collecting 10 items
                     collecting 10 items
                     collected 10 items 
                     
                     src/test/python/apache/aurora/client/cli/test_cron.py::TestCronNoun::test_cron_status
PASSED
                     src/test/python/apache/aurora/client/cli/test_cron.py::TestCronNoun::test_cron_status_multiple_jobs
PASSED
                     src/test/python/apache/aurora/client/cli/test_cron.py::TestCronNoun::test_deschedule_cron_deep_api
PASSED
                     src/test/python/apache/aurora/client/cli/test_cron.py::TestCronNoun::test_schedule_cron_deep_api
PASSED
                     src/test/python/apache/aurora/client/cli/test_cron.py::TestCronNoun::test_schedule_cron_failed_invalid_config
PASSED
                     src/test/python/apache/aurora/client/cli/test_cron.py::TestCronNoun::test_schedule_failed
PASSED
                     src/test/python/apache/aurora/client/cli/test_cron.py::TestCronNoun::test_schedule_failed_non_cron
PASSED
                     src/test/python/apache/aurora/client/cli/test_cron.py::TestCronNoun::test_start_cron
PASSED
                     src/test/python/apache/aurora/client/cli/test_cron.py::TestCronNoun::test_start_cron_open_browser
PASSED
                     src/test/python/apache/aurora/client/cli/test_cron.py::TestCronNoun::test_successful_schedule
PASSED
                     
                      generated xml file: <https://builds.apache.org/job/Aurora/ws/dist/test-results/src.test.python.apache.aurora.client.cli.cron.xml>

                     =========== 10 passed in 1.42 seconds ============
                     ============== test session starts ===============
                     platform linux2 -- Python 2.7.6 -- py-1.4.27 -- pytest-2.7.1 -- <https://builds.apache.org/job/Aurora/ws/build-support/pants.venv/bin/python2.7>
                     rootdir: <https://builds.apache.org/job/Aurora/ws/src/test/python/apache/aurora/client/api,>
inifile: 
                     plugins: cov, timeout
                     
                     collecting 0 items
                     collecting 32 items
                     collecting 32 items
                     collecting 32 items
                     collected 32 items 
                     
                     src/test/python/apache/aurora/client/api/test_updater.py::UpdaterTest::test_diff_unordered_configs
PASSED
                     src/test/python/apache/aurora/client/api/test_updater.py::UpdaterTest::test_failed_update_populates_error_details
PASSED
                     src/test/python/apache/aurora/client/api/test_updater.py::UpdaterTest::test_finish_invalid_response
PASSED
                     src/test/python/apache/aurora/client/api/test_updater.py::UpdaterTest::test_grow
PASSED
                     src/test/python/apache/aurora/client/api/test_updater.py::UpdaterTest::test_grow_fails_quota_check
PASSED
                     src/test/python/apache/aurora/client/api/test_updater.py::UpdaterTest::test_grow_with_instance_option
PASSED
                     src/test/python/apache/aurora/client/api/test_updater.py::UpdaterTest::test_instances_outside_range
PASSED
                     src/test/python/apache/aurora/client/api/test_updater.py::UpdaterTest::test_invalid_batch_size
PASSED
                     src/test/python/apache/aurora/client/api/test_updater.py::UpdaterTest::test_invalid_restart_threshold
PASSED
                     src/test/python/apache/aurora/client/api/test_updater.py::UpdaterTest::test_invalid_watch_secs
PASSED
                     src/test/python/apache/aurora/client/api/test_updater.py::UpdaterTest::test_job_does_not_exist
PASSED
                     src/test/python/apache/aurora/client/api/test_updater.py::UpdaterTest::test_non_to_prod_fails_quota_check
PASSED
                     src/test/python/apache/aurora/client/api/test_updater.py::UpdaterTest::test_noop_update
PASSED
                     src/test/python/apache/aurora/client/api/test_updater.py::UpdaterTest::test_patch_hole_with_instance_option
PASSED
                     src/test/python/apache/aurora/client/api/test_updater.py::UpdaterTest::test_prod_to_non_always_passes_quota_check
PASSED
                     src/test/python/apache/aurora/client/api/test_updater.py::UpdaterTest::test_pulse_interval_not_supported
PASSED
                     src/test/python/apache/aurora/client/api/test_updater.py::UpdaterTest::test_shrink
PASSED
                     src/test/python/apache/aurora/client/api/test_updater.py::UpdaterTest::test_shrink_with_instance_option
PASSED
                     src/test/python/apache/aurora/client/api/test_updater.py::UpdaterTest::test_start_invalid_response
PASSED
                     src/test/python/apache/aurora/client/api/test_updater.py::UpdaterTest::test_update_after_restart
PASSED
                     src/test/python/apache/aurora/client/api/test_updater.py::UpdaterTest::test_update_and_grow
PASSED
                     src/test/python/apache/aurora/client/api/test_updater.py::UpdaterTest::test_update_and_shrink
PASSED
                     src/test/python/apache/aurora/client/api/test_updater.py::UpdaterTest::test_update_cron_job
PASSED
                     src/test/python/apache/aurora/client/api/test_updater.py::UpdaterTest::test_update_instances
PASSED
                     src/test/python/apache/aurora/client/api/test_updater.py::UpdaterTest::test_update_instances_wait_for_batch_completion_filled_batch
PASSED
                     src/test/python/apache/aurora/client/api/test_updater.py::UpdaterTest::test_update_instances_wait_for_batch_completion_partially_filled_batch
FAILED
                     src/test/python/apache/aurora/client/api/test_updater.py::UpdaterTest::test_update_invalid_response
PASSED
                     src/test/python/apache/aurora/client/api/test_updater.py::UpdaterTest::test_update_kill_timeout
PASSED
                     src/test/python/apache/aurora/client/api/test_updater.py::UpdaterTest::test_update_no_rollback
PASSED
                     src/test/python/apache/aurora/client/api/test_updater.py::UpdaterTest::test_update_rollback
PASSED
                     src/test/python/apache/aurora/client/api/test_updater.py::UpdaterTest::test_update_skips_unretryable
PASSED
                     src/test/python/apache/aurora/client/api/test_updater.py::UpdaterTest::test_update_with_instance_option
PASSED
                     
                     ==================== FAILURES ====================
                      UpdaterTest.test_update_instances_wait_for_batch_completion_partially_filled_batch

                     
                     self = <aurora.client.api.test_updater.UpdaterTest testMethod=test_update_instances_wait_for_batch_completion_partially_filled_batch>
                     
                         def test_update_instances_wait_for_batch_completion_partially_filled_batch(self):
                           """Update existing instances with wait_for_batch_completion
flag set."""
                           update_config = self.UPDATE_CONFIG.copy()
                           update_config.update(wait_for_batch_completion=True, batch_size=3)
                           self.init_updater(update_config)
                         
                           old_configs = self.make_task_configs(5)
                           new_config = deepcopy(old_configs[0])
                           new_config.priority = 5
                           job_config = self.make_job_config(new_config, 5)
                           self._config.job_config = job_config
                           self.expect_start()
                           self.expect_get_tasks(old_configs)
                           self.expect_populate(job_config)
                           self.expect_quota_check(5, 5)
                           self.expect_update_instances([0, 1, 2, 3, 4], new_config)
                           self.expect_finish()
                           self.replay_mocks()
                         
                     >     self.update_and_expect_ok()
                     
                     src/test/python/apache/aurora/client/api/test_updater.py:905: 
                     _ _ _ _ _ _ _ _ _ _ _ _ _ _ _ _ _ _ _ _ _ _ _ _ _ 
                     src/test/python/apache/aurora/client/api/test_updater.py:335: in update_and_expect_ok
                         self.update_and_expect_response(ResponseCode.OK, instances)
                     _ _ _ _ _ _ _ _ _ _ _ _ _ _ _ _ _ _ _ _ _ _ _ _ _ 
                     
                     self = <aurora.client.api.test_updater.UpdaterTest testMethod=test_update_instances_wait_for_batch_completion_partially_filled_batch>
                     expected_code = 1, instances = None
                     message = None
                     
                         def update_and_expect_response(self, expected_code, instances=None,
message=None):
                           resp = self._updater.update(instances)
                     >     assert expected_code == resp.responseCode, (
                             'Expected response:%s Actual response:%s' % (expected_code,
resp.responseCode))
                     E     AssertionError: Expected response:1 Actual response:2
                     E     assert 1 == 2
                     E      +  where 2 = Response(details=[ResponseDetail(message='Aborting
update without rollback! Fa...obMonitor.terminate() -> None')], result=None, responseCode=2,
serverInfo=None).responseCode
                     
                     src/test/python/apache/aurora/client/api/test_updater.py:339: AssertionError
                      generated xml file: <https://builds.apache.org/job/Aurora/ws/dist/test-results/src.test.python.apache.aurora.client.api.updater.xml>

                     ====== 1 failed, 31 passed in 1.06 seconds =======
                     src.test.python.apache.aurora.client.api.updater                    
           .....   FAILURE
                     src.test.python.apache.aurora.client.cli.config                     
           .....   SUCCESS
                     src.test.python.apache.aurora.client.cli.cron                       
           .....   SUCCESS
                     src.test.python.apache.aurora.client.hooks.non_hooked_api           
           .....   SUCCESS
                     src.test.python.apache.aurora.common.test_http_signaler             
           .....   SUCCESS
                     src.test.python.apache.aurora.executor.common.path_detector         
           .....   SUCCESS
                     src.test.python.apache.aurora.executor.common.task_info             
           .....   SUCCESS
                     src.test.python.apache.thermos.cli.commands.commands                
           .....   SUCCESS
                     src.test.python.apache.thermos.cli.common                           
           .....   SUCCESS
                     src.test.python.apache.thermos.cli.main                             
           .....   SUCCESS
                     src.test.python.apache.thermos.common.test_pathspec                 
           .....   SUCCESS
                     src.test.python.apache.thermos.monitoring.test_disk                 
           .....   SUCCESS
                     
FAILURE


               FAILURE
Build step 'Execute shell' marked build as failure
Recording test results

Mime
View raw message