aurora-dev mailing list archives

Site index · List index
Message view « Date » · « Thread »
Top « Date » · « Thread »
From Apache Jenkins Server <jenk...@builds.apache.org>
Subject Build failed in Jenkins: Aurora #977
Date Thu, 09 Apr 2015 20:01:24 GMT
See <https://builds.apache.org/job/Aurora/977/changes>

Changes:

[wfarner] Revert "Make health check configurable"

[kevints] Use installDist instead of installApp.

------------------------------------------
[...truncated 4581 lines...]
                     src/test/python/apache/aurora/client/hooks/test_hooked_api.py::test_api_methods_exist[create_job]
PASSED
                     src/test/python/apache/aurora/client/hooks/test_hooked_api.py::test_api_methods_exist[kill_job]
PASSED
                     src/test/python/apache/aurora/client/hooks/test_hooked_api.py::test_api_methods_exist[restart]
PASSED
                     src/test/python/apache/aurora/client/hooks/test_hooked_api.py::test_api_methods_exist[start_cronjob]
PASSED
                     src/test/python/apache/aurora/client/hooks/test_hooked_api.py::test_api_methods_exist[update_job]
PASSED
                     src/test/python/apache/aurora/client/hooks/test_hooked_api.py::test_api_methods_exist[start_job_update]
PASSED
                     src/test/python/apache/aurora/client/hooks/test_hooked_api.py::test_api_methods_params[cancel_update]
PASSED
                     src/test/python/apache/aurora/client/hooks/test_hooked_api.py::test_api_methods_params[create_job]
PASSED
                     src/test/python/apache/aurora/client/hooks/test_hooked_api.py::test_api_methods_params[kill_job]
PASSED
                     src/test/python/apache/aurora/client/hooks/test_hooked_api.py::test_api_methods_params[restart]
PASSED
                     src/test/python/apache/aurora/client/hooks/test_hooked_api.py::test_api_methods_params[start_cronjob]
PASSED
                     src/test/python/apache/aurora/client/hooks/test_hooked_api.py::test_api_methods_params[update_job]
PASSED
                     src/test/python/apache/aurora/client/hooks/test_hooked_api.py::test_api_methods_params[start_job_update]
PASSED
                     
                      generated xml file: <https://builds.apache.org/job/Aurora/ws/dist/test-results/src.test.python.apache.aurora.client.hooks.hooked_api.xml>

                     =========== 14 passed in 0.60 seconds ============
                     ============== test session starts ===============
                     platform linux2 -- Python 2.7.6 -- py-1.4.26 -- pytest-2.7.0 -- <https://builds.apache.org/job/Aurora/ws/build-support/pants.venv/bin/python2.7>
                     rootdir: <https://builds.apache.org/job/Aurora/ws/src/test/python/apache/aurora/config,>
inifile: 
                     plugins: cov, timeout
                     
                     collecting 0 items
                     collecting 7 items
                     collected 7 items 
                     
                     src/test/python/apache/aurora/config/test_base.py::test_all_static PASSED
                     src/test/python/apache/aurora/config/test_base.py::test_binding PASSED
                     src/test/python/apache/aurora/config/test_base.py::test_cycle PASSED
                     src/test/python/apache/aurora/config/test_base.py::test_empty_config
PASSED
                     src/test/python/apache/aurora/config/test_base.py::test_simple_config
PASSED
                     src/test/python/apache/aurora/config/test_base.py::test_ports PASSED
                     src/test/python/apache/aurora/config/test_base.py::test_static_port_aliasing
PASSED
                     
                      generated xml file: <https://builds.apache.org/job/Aurora/ws/dist/test-results/src.test.python.apache.aurora.config.test_base.xml>

                     ============ 7 passed in 1.38 seconds ============
                     ============== test session starts ===============
                     platform linux2 -- Python 2.7.6 -- py-1.4.26 -- pytest-2.7.0 -- <https://builds.apache.org/job/Aurora/ws/build-support/pants.venv/bin/python2.7>
                     rootdir: <https://builds.apache.org/job/Aurora/ws/src/test/python/apache/aurora/config,>
inifile: 
                     plugins: cov, timeout
                     
                     collecting 0 items
                     collecting 1 items
                     collected 1 items 
                     
                     src/test/python/apache/aurora/config/test_constraint_parsing.py::test_parsing_constraints
PASSED
                     
                      generated xml file: <https://builds.apache.org/job/Aurora/ws/dist/test-results/src.test.python.apache.aurora.config.test_constraint_parsing.xml>

                     ============ 1 passed in 0.16 seconds ============
                     ============== test session starts ===============
                     platform linux2 -- Python 2.7.6 -- py-1.4.26 -- pytest-2.7.0 -- <https://builds.apache.org/job/Aurora/ws/build-support/pants.venv/bin/python2.7>
                     rootdir: <https://builds.apache.org/job/Aurora/ws/src/test/python/apache/aurora/config,>
inifile: 
                     plugins: cov, timeout
                     
                     collecting 0 items
                     collecting 6 items
                     collected 6 items 
                     
                     src/test/python/apache/aurora/config/test_loader.py::test_enoent PASSED
                     src/test/python/apache/aurora/config/test_loader.py::test_bad_config
PASSED
                     src/test/python/apache/aurora/config/test_loader.py::test_empty_config
PASSED
                     src/test/python/apache/aurora/config/test_loader.py::test_load_json PASSED
                     src/test/python/apache/aurora/config/test_loader.py::test_load PASSED
                     src/test/python/apache/aurora/config/test_loader.py::test_pick PASSED
                     
                      generated xml file: <https://builds.apache.org/job/Aurora/ws/dist/test-results/src.test.python.apache.aurora.config.test_loader.xml>

                     ============ 6 passed in 0.21 seconds ============
                     ============== test session starts ===============
                     platform linux2 -- Python 2.7.6 -- py-1.4.26 -- pytest-2.7.0 -- <https://builds.apache.org/job/Aurora/ws/build-support/pants.venv/bin/python2.7>
                     rootdir: <https://builds.apache.org/job/Aurora/ws/src/test/python/apache/aurora/config,>
inifile: 
                     plugins: cov, timeout
                     
                     collecting 0 items
                     collecting 10 items
                     collected 10 items 
                     
                     src/test/python/apache/aurora/config/test_thrift.py::test_simple_config
PASSED
                     src/test/python/apache/aurora/config/test_thrift.py::test_config_with_options
PASSED
                     src/test/python/apache/aurora/config/test_thrift.py::test_config_with_ports
PASSED
                     src/test/python/apache/aurora/config/test_thrift.py::test_config_with_bad_resources
PASSED
                     src/test/python/apache/aurora/config/test_thrift.py::test_config_with_task_links
PASSED
                     src/test/python/apache/aurora/config/test_thrift.py::test_unbound_references
PASSED
                     src/test/python/apache/aurora/config/test_thrift.py::test_cron_collision_policy
PASSED
                     src/test/python/apache/aurora/config/test_thrift.py::test_metadata_in_config
PASSED
                     src/test/python/apache/aurora/config/test_thrift.py::test_task_instance_from_job
PASSED
                     src/test/python/apache/aurora/config/test_thrift.py::test_identifier_validation
PASSED
                     
                      generated xml file: <https://builds.apache.org/job/Aurora/ws/dist/test-results/src.test.python.apache.aurora.config.test_thrift.xml>

                     =========== 10 passed in 1.75 seconds ============
                     ============== test session starts ===============
                     platform linux2 -- Python 2.7.6 -- py-1.4.26 -- pytest-2.7.0 -- <https://builds.apache.org/job/Aurora/ws/build-support/pants.venv/bin/python2.7>
                     rootdir: <https://builds.apache.org/job/Aurora/ws/src/test/python/apache/aurora/executor,>
inifile: 
                     plugins: cov, timeout
                     
                     collecting 0 items
                     collecting 8 items
                     collecting 8 items
                     collecting 8 items
                     collected 8 items 
                     
                     src/test/python/apache/aurora/executor/test_executor_base.py::TestExecutorBase::test_disconnected
PASSED
                     src/test/python/apache/aurora/executor/test_executor_base.py::TestExecutorBase::test_error
PASSED
                     src/test/python/apache/aurora/executor/test_executor_base.py::TestExecutorBase::test_frameworkMessage
PASSED
                     src/test/python/apache/aurora/executor/test_executor_base.py::TestExecutorBase::test_log
PASSED
                     src/test/python/apache/aurora/executor/test_executor_base.py::TestExecutorBase::test_registered
PASSED
                     src/test/python/apache/aurora/executor/test_executor_base.py::TestExecutorBase::test_reregistered
PASSED
                     src/test/python/apache/aurora/executor/test_executor_base.py::TestExecutorBase::test_send_update
PASSED
                     src/test/python/apache/aurora/executor/test_executor_base.py::TestExecutorBase::test_status_is_terminal
PASSED
                     
                      generated xml file: <https://builds.apache.org/job/Aurora/ws/dist/test-results/src.test.python.apache.aurora.executor.executor_base.xml>

                     ============ 8 passed in 0.19 seconds ============
                     ============== test session starts ===============
                     platform linux2 -- Python 2.7.6 -- py-1.4.26 -- pytest-2.7.0 -- <https://builds.apache.org/job/Aurora/ws/build-support/pants.venv/bin/python2.7>
                     rootdir: <https://builds.apache.org/job/Aurora/ws/src/test/python/apache/aurora/executor,>
inifile: 
                     plugins: cov, timeout
                     
                     collecting 0 items
                     collecting 2 items
                     collected 2 items 
                     
                     src/test/python/apache/aurora/executor/test_executor_vars.py::test_init
PASSED
                     src/test/python/apache/aurora/executor/test_executor_vars.py::test_sample
PASSED
                     
                      generated xml file: <https://builds.apache.org/job/Aurora/ws/dist/test-results/src.test.python.apache.aurora.executor.executor_vars.xml>

                     ============ 2 passed in 0.11 seconds ============
                     ============== test session starts ===============
                     platform linux2 -- Python 2.7.6 -- py-1.4.26 -- pytest-2.7.0 -- <https://builds.apache.org/job/Aurora/ws/build-support/pants.venv/bin/python2.7>
                     rootdir: <https://builds.apache.org/job/Aurora/ws/src/test/python/apache/aurora/executor,>
inifile: 
                     plugins: cov, timeout
                     
                     collecting 0 items
                     collecting 1 items
                     collecting 1 items
                     collecting 1 items
                     collected 1 items 
                     
                     src/test/python/apache/aurora/executor/test_status_manager.py::TestStatusManager::test_run
PASSED
                     
                      generated xml file: <https://builds.apache.org/job/Aurora/ws/dist/test-results/src.test.python.apache.aurora.executor.status_manager.xml>

                     ============ 1 passed in 0.18 seconds ============
                     ============== test session starts ===============
                     platform linux2 -- Python 2.7.6 -- py-1.4.26 -- pytest-2.7.0 -- <https://builds.apache.org/job/Aurora/ws/build-support/pants.venv/bin/python2.7>
                     rootdir: <https://builds.apache.org/job/Aurora/ws/src/test/python/apache/aurora/executor,>
inifile: 
                     plugins: cov, timeout
                     
                     collecting 0 items
                     collecting 8 items
                     collecting 8 items
                     collecting 8 items
                     collected 8 items 
                     
                     src/test/python/apache/aurora/executor/test_thermos_task_runner.py::TestThermosTaskRunnerIntegration::test_integration_success
PASSED
                     src/test/python/apache/aurora/executor/test_thermos_task_runner.py::TestThermosTaskRunnerIntegration::test_integration_failed
PASSED
                     src/test/python/apache/aurora/executor/test_thermos_task_runner.py::TestThermosTaskRunnerIntegration::test_integration_stop
FAILED
                     src/test/python/apache/aurora/executor/test_thermos_task_runner.py::TestThermosTaskRunnerIntegration::test_integration_lose
PASSED
                     src/test/python/apache/aurora/executor/test_thermos_task_runner.py::TestThermosTaskRunnerIntegration::test_integration_quitquitquit
PASSED
                     src/test/python/apache/aurora/executor/test_thermos_task_runner.py::TestThermosTaskRunnerIntegration::test_thermos_normal_exit_status
PASSED
                     src/test/python/apache/aurora/executor/test_thermos_task_runner.py::TestThermosTaskRunnerIntegration::test_thermos_abnormal_exit_statuses
PASSED
                     src/test/python/apache/aurora/executor/test_thermos_task_runner.py::TestThermosTaskRunnerIntegration::test_thermos_runner_killed
PASSED
                     
                     ==================== FAILURES ====================
                      TestThermosTaskRunnerIntegration.test_integration_stop 
                     
                     self = <test_thermos_task_runner.TestThermosTaskRunnerIntegration
object at 0x7f9cab0a6450>
                     
                         def test_integration_stop(self):
                           with self.yield_sleepy(ThermosTaskRunner, sleep=1000, exit_code=0)
as task_runner:
                             task_runner.start()
                             task_runner.forked.wait()
                         
                             assert task_runner.status is None
                         
                             task_runner.stop()
                         
                     >       assert task_runner.status is not None
                     E       assert None is not None
                     E        +  where None = <apache.aurora.executor.thermos_task_runner.ThermosTaskRunner
object at 0x7f9cab08f550>.status
                     
                     src/test/python/apache/aurora/executor/test_thermos_task_runner.py:175:
AssertionError
                     -------------- Captured stderr call --------------
                     Writing log files to disk in /tmp/user/2396/tmp4nyc8I
                     ERROR] Could not instantiate runner!
                      generated xml file: <https://builds.apache.org/job/Aurora/ws/dist/test-results/src.test.python.apache.aurora.executor.thermos_task_runner.xml>

                     ====== 1 failed, 7 passed in 75.97 seconds =======
                     src.test.python.apache.aurora.admin.admin                           
           .....   SUCCESS
                     src.test.python.apache.aurora.admin.host_maintenance                
           .....   SUCCESS
                     src.test.python.apache.aurora.admin.maintenance                     
           .....   SUCCESS
                     src.test.python.apache.aurora.client.api.api                        
           .....   SUCCESS
                     src.test.python.apache.aurora.client.api.instance_watcher           
           .....   SUCCESS
                     src.test.python.apache.aurora.client.api.job_monitor                
           .....   SUCCESS
                     src.test.python.apache.aurora.client.api.mux                        
           .....   SUCCESS
                     src.test.python.apache.aurora.client.api.quota_check                
           .....   SUCCESS
                     src.test.python.apache.aurora.client.api.restarter                  
           .....   SUCCESS
                     src.test.python.apache.aurora.client.api.scheduler_client           
           .....   SUCCESS
                     src.test.python.apache.aurora.client.api.sla                        
           .....   SUCCESS
                     src.test.python.apache.aurora.client.api.task_util                  
           .....   SUCCESS
                     src.test.python.apache.aurora.client.api.updater                    
           .....   SUCCESS
                     src.test.python.apache.aurora.client.api.updater_util               
           .....   SUCCESS
                     src.test.python.apache.aurora.client.base                           
           .....   SUCCESS
                     src.test.python.apache.aurora.client.binding_helper                 
           .....   SUCCESS
                     src.test.python.apache.aurora.client.cli.api                        
           .....   SUCCESS
                     src.test.python.apache.aurora.client.cli.client                     
           .....   SUCCESS
                     src.test.python.apache.aurora.client.cli.command_hooks              
           .....   SUCCESS
                     src.test.python.apache.aurora.client.cli.config                     
           .....   SUCCESS
                     src.test.python.apache.aurora.client.cli.context                    
           .....   SUCCESS
                     src.test.python.apache.aurora.client.cli.cron                       
           .....   SUCCESS
                     src.test.python.apache.aurora.client.cli.inspect                    
           .....   SUCCESS
                     src.test.python.apache.aurora.client.cli.job                        
           .....   SUCCESS
                     src.test.python.apache.aurora.client.cli.plugins                    
           .....   SUCCESS
                     src.test.python.apache.aurora.client.cli.quota                      
           .....   SUCCESS
                     src.test.python.apache.aurora.client.cli.sla                        
           .....   SUCCESS
                     src.test.python.apache.aurora.client.cli.supdate                    
           .....   SUCCESS
                     src.test.python.apache.aurora.client.cli.task                       
           .....   SUCCESS
                     src.test.python.apache.aurora.client.cli.update                     
           .....   SUCCESS
                     src.test.python.apache.aurora.client.cli.version                    
           .....   SUCCESS
                     src.test.python.apache.aurora.client.config                         
           .....   SUCCESS
                     src.test.python.apache.aurora.client.factory                        
           .....   SUCCESS
                     src.test.python.apache.aurora.client.hooks.hooked_api               
           .....   SUCCESS
                     src.test.python.apache.aurora.client.hooks.non_hooked_api           
           .....   SUCCESS
                     src.test.python.apache.aurora.common.test_aurora_job_key            
           .....   SUCCESS
                     src.test.python.apache.aurora.common.test_cluster                   
           .....   SUCCESS
                     src.test.python.apache.aurora.common.test_cluster_option            
           .....   SUCCESS
                     src.test.python.apache.aurora.common.test_clusters                  
           .....   SUCCESS
                     src.test.python.apache.aurora.common.test_http_signaler             
           .....   SUCCESS
                     src.test.python.apache.aurora.common.test_pex_version               
           .....   SUCCESS
                     src.test.python.apache.aurora.common.test_shellify                  
           .....   SUCCESS
                     src.test.python.apache.aurora.common.test_transport                 
           .....   SUCCESS
                     src.test.python.apache.aurora.config.test_base                      
           .....   SUCCESS
                     src.test.python.apache.aurora.config.test_constraint_parsing        
           .....   SUCCESS
                     src.test.python.apache.aurora.config.test_loader                    
           .....   SUCCESS
                     src.test.python.apache.aurora.config.test_thrift                    
           .....   SUCCESS
                     src.test.python.apache.aurora.executor.common.path_detector         
           .....   SUCCESS
                     src.test.python.apache.aurora.executor.common.task_info             
           .....   SUCCESS
                     src.test.python.apache.aurora.executor.executor_base                
           .....   SUCCESS
                     src.test.python.apache.aurora.executor.executor_vars                
           .....   SUCCESS
                     src.test.python.apache.aurora.executor.status_manager               
           .....   SUCCESS
                     src.test.python.apache.aurora.executor.thermos_task_runner          
           .....   FAILURE
                     src.test.python.apache.thermos.cli.commands.commands                
           .....   SUCCESS
                     src.test.python.apache.thermos.cli.common                           
           .....   SUCCESS
                     src.test.python.apache.thermos.cli.main                             
           .....   SUCCESS
                     src.test.python.apache.thermos.common.test_pathspec                 
           .....   SUCCESS
                     src.test.python.apache.thermos.core.test_runner_integration         
           .....   SUCCESS
                     src.test.python.apache.thermos.monitoring.test_disk                 
           .....   SUCCESS
                     
FAILURE


               FAILURE
Build step 'Execute shell' marked build as failure
Recording test results

Mime
View raw message