aurora-dev mailing list archives

Site index · List index
Message view « Date » · « Thread »
Top « Date » · « Thread »
From Apache Jenkins Server <jenk...@builds.apache.org>
Subject Build failed in Jenkins: Aurora #838
Date Fri, 23 Jan 2015 21:17:43 GMT
See <https://builds.apache.org/job/Aurora/838/changes>

Changes:

[kevints] Stream backups directly to file.

------------------------------------------
[...truncated 4017 lines...]
                     ============ 7 passed in 0.34 seconds ============
                     ============== test session starts ===============
                     platform linux2 -- Python 2.7.6 -- py-1.4.26 -- pytest-2.6.4
                     plugins: cov, timeout
                     
                     collecting 0 items
                     collecting 3 items
                     collecting 3 items
                     collecting 3 items
                     collected 3 items 
                     
                     src/test/python/apache/thermos/core/test_ephemerals.py ...
                     
                      generated xml file: <https://builds.apache.org/job/Aurora/ws/dist/test-results/src.test.python.apache.thermos.core.test_ephemerals.xml>

                     ============ 3 passed in 3.72 seconds ============
                     ============== test session starts ===============
                     platform linux2 -- Python 2.7.6 -- py-1.4.26 -- pytest-2.6.4
                     plugins: cov, timeout
                     
                     collecting 0 items
                     collecting 3 items
                     collecting 3 items
                     collecting 3 items
                     collected 3 items 
                     
                     src/test/python/apache/thermos/core/test_failing_runner.py ...
                     
                      generated xml file: <https://builds.apache.org/job/Aurora/ws/dist/test-results/src.test.python.apache.thermos.core.test_failing_runner.xml>

                     ============ 3 passed in 5.78 seconds ============
                     ============== test session starts ===============
                     platform linux2 -- Python 2.7.6 -- py-1.4.26 -- pytest-2.6.4
                     plugins: cov, timeout
                     
                     collecting 0 items
                     collecting 3 items
                     collecting 3 items
                     collecting 6 items
                     collecting 6 items
                     collecting 6 items
                     collected 6 items 
                     
                     src/test/python/apache/thermos/core/test_failure_limit.py ......
                     
                      generated xml file: <https://builds.apache.org/job/Aurora/ws/dist/test-results/src.test.python.apache.thermos.core.test_failure_limit.xml>

                     ============ 6 passed in 6.54 seconds ============
                     ============== test session starts ===============
                     platform linux2 -- Python 2.7.6 -- py-1.4.26 -- pytest-2.6.4
                     plugins: cov, timeout
                     
                     collecting 0 items
                     collecting 3 items
                     collecting 3 items
                     collecting 6 items
                     collecting 6 items
                     collecting 9 items
                     collecting 9 items
                     collecting 12 items
                     collecting 12 items
                     collecting 15 items
                     collecting 15 items
                     collecting 15 items
                     collected 15 items 
                     
                     src/test/python/apache/thermos/core/test_finalization.py ...............
                     
                      generated xml file: <https://builds.apache.org/job/Aurora/ws/dist/test-results/src.test.python.apache.thermos.core.test_finalization.xml>

                     =========== 15 passed in 18.70 seconds ===========
                     ============== test session starts ===============
                     platform linux2 -- Python 2.7.6 -- py-1.4.26 -- pytest-2.6.4
                     plugins: cov, timeout
                     
                     collecting 0 items
                     collecting 2 items
                     collected 2 items 
                     
                     src/test/python/apache/thermos/core/test_helper.py ..
                     
                      generated xml file: <https://builds.apache.org/job/Aurora/ws/dist/test-results/src.test.python.apache.thermos.core.test_helper.xml>

                     ============ 2 passed in 0.19 seconds ============
                     ============== test session starts ===============
                     platform linux2 -- Python 2.7.6 -- py-1.4.26 -- pytest-2.6.4
                     plugins: cov, timeout
                     
                     collecting 0 items
                     collecting 1 items
                     collected 1 items 
                     
                     src/test/python/apache/thermos/core/test_angry.py .
                     
                      generated xml file: <https://builds.apache.org/job/Aurora/ws/dist/test-results/src.test.python.apache.thermos.core.test_angry.xml>

                     ============ 1 passed in 5.69 seconds ============
                     ============== test session starts ===============
                     platform linux2 -- Python 2.7.6 -- py-1.4.26 -- pytest-2.6.4
                     plugins: cov, timeout
                     
                     collecting 0 items
                     collecting 2 items
                     collecting 2 items
                     collecting 5 items
                     collecting 5 items
                     collecting 6 items
                     collecting 6 items
                     collecting 6 items
                     collected 6 items 
                     
                     src/test/python/apache/thermos/core/test_staged_kill.py ....s.
                     
                      generated xml file: <https://builds.apache.org/job/Aurora/ws/dist/test-results/src.test.python.apache.thermos.core.test_staged_kill.xml>

                     ====== 5 passed, 1 skipped in 49.85 seconds ======
                     ============== test session starts ===============
                     platform linux2 -- Python 2.7.6 -- py-1.4.26 -- pytest-2.6.4
                     plugins: cov, timeout
                     
                     collecting 0 items
                     collecting 1 items
                     collected 1 items 
                     
                     src/test/python/apache/aurora/executor/common/test_resource_manager_integration.py
F
                     
                     ==================== FAILURES ====================
                     _____________ test_resource_manager ______________
                     
                         def test_resource_manager():
                           with temporary_dir() as td:
                             sandbox = os.path.join(td, 'sandbox')
                             root = os.path.join(td, 'thermos')
                         
                             completed_event = threading.Event()
                             completed_event.set()
                             completed_mock = mock.PropertyMock(completed_event)
                             mock_disk_collector = mock.create_autospec(DiskCollector,
spec_set=True)
                             mock_disk_collector.sample.return_value = None
                             value_mock = mock.PropertyMock(return_value=4197)
                             type(mock_disk_collector).value = value_mock
                             type(mock_disk_collector).completed_event = completed_mock
                         
                             rmp = ResourceManagerProvider(
                                 root,
                                 disk_collector=lambda sandbox: mock_disk_collector,
                                 disk_collection_interval=Amount(1, Time.SECONDS))
                             rm = rmp.from_assigned_task(
                                 make_assigned_task(
                                     make_job('some-role', 'some-env', 'some-job', 'http',
portmap={'http': 80})),
                                 DirectorySandbox(sandbox))
                         
                             assert rm.status is None
                         
                             try:
                               rm.start()
                               while rm.status is None:
                                 rm._kill_event.wait(timeout=1)
                               result = rm.status
                               assert result is not None
                               assert result.reason.startswith('Disk limit exceeded')
                               assert result.status == mesos_pb2.TASK_FAILED
                               assert value_mock.call_count == 1
                     >         assert completed_mock.call_count == 1
                     E         assert 0 == 1
                     E          +  where 0 = <PropertyMock spec='_Event' id='140650448378768'>.call_count
                     
                     src/test/python/apache/aurora/executor/common/test_resource_manager_integration.py:100:
AssertionError
                     -------------- Captured stderr call --------------
                     WARNING:root:Could not read from discovered task None.
                     WARNING:root:TaskResourceMonitor not running - sample may be inaccurate
                     WARNING:root:Could not read from discovered task None.
                      generated xml file: <https://builds.apache.org/job/Aurora/ws/dist/test-results/src.test.python.apache.aurora.executor.common.resource_manager_integration.xml>

                     ============ 1 failed in 0.49 seconds ============
                     src.test.python.apache.aurora.admin.admin                           
           .....   SUCCESS
                     src.test.python.apache.aurora.admin.host_maintenance                
           .....   SUCCESS
                     src.test.python.apache.aurora.admin.maintenance                     
           .....   SUCCESS
                     src.test.python.apache.aurora.client.api.api                        
           .....   SUCCESS
                     src.test.python.apache.aurora.client.api.instance_watcher           
           .....   SUCCESS
                     src.test.python.apache.aurora.client.api.job_monitor                
           .....   SUCCESS
                     src.test.python.apache.aurora.client.api.mux                        
           .....   SUCCESS
                     src.test.python.apache.aurora.client.api.quota_check                
           .....   SUCCESS
                     src.test.python.apache.aurora.client.api.restarter                  
           .....   SUCCESS
                     src.test.python.apache.aurora.client.api.scheduler_client           
           .....   SUCCESS
                     src.test.python.apache.aurora.client.api.sla                        
           .....   SUCCESS
                     src.test.python.apache.aurora.client.api.task_util                  
           .....   SUCCESS
                     src.test.python.apache.aurora.client.api.updater                    
           .....   SUCCESS
                     src.test.python.apache.aurora.client.api.updater_util               
           .....   SUCCESS
                     src.test.python.apache.aurora.client.base                           
           .....   SUCCESS
                     src.test.python.apache.aurora.client.binding_helper                 
           .....   SUCCESS
                     src.test.python.apache.aurora.client.cli.api                        
           .....   SUCCESS
                     src.test.python.apache.aurora.client.cli.client                     
           .....   SUCCESS
                     src.test.python.apache.aurora.client.cli.command_hooks              
           .....   SUCCESS
                     src.test.python.apache.aurora.client.cli.config                     
           .....   SUCCESS
                     src.test.python.apache.aurora.client.cli.cron                       
           .....   SUCCESS
                     src.test.python.apache.aurora.client.cli.inspect                    
           .....   SUCCESS
                     src.test.python.apache.aurora.client.cli.job                        
           .....   SUCCESS
                     src.test.python.apache.aurora.client.cli.plugins                    
           .....   SUCCESS
                     src.test.python.apache.aurora.client.cli.quota                      
           .....   SUCCESS
                     src.test.python.apache.aurora.client.cli.sla                        
           .....   SUCCESS
                     src.test.python.apache.aurora.client.cli.supdate                    
           .....   SUCCESS
                     src.test.python.apache.aurora.client.cli.task                       
           .....   SUCCESS
                     src.test.python.apache.aurora.client.cli.update                     
           .....   SUCCESS
                     src.test.python.apache.aurora.client.cli.version                    
           .....   SUCCESS
                     src.test.python.apache.aurora.client.config                         
           .....   SUCCESS
                     src.test.python.apache.aurora.client.hooks.hooked_api               
           .....   SUCCESS
                     src.test.python.apache.aurora.client.hooks.non_hooked_api           
           .....   SUCCESS
                     src.test.python.apache.aurora.common.test_aurora_job_key            
           .....   SUCCESS
                     src.test.python.apache.aurora.common.test_cluster                   
           .....   SUCCESS
                     src.test.python.apache.aurora.common.test_cluster_option            
           .....   SUCCESS
                     src.test.python.apache.aurora.common.test_clusters                  
           .....   SUCCESS
                     src.test.python.apache.aurora.common.test_http_signaler             
           .....   SUCCESS
                     src.test.python.apache.aurora.common.test_pex_version               
           .....   SUCCESS
                     src.test.python.apache.aurora.common.test_shellify                  
           .....   SUCCESS
                     src.test.python.apache.aurora.common.test_transport                 
           .....   SUCCESS
                     src.test.python.apache.aurora.config.test_base                      
           .....   SUCCESS
                     src.test.python.apache.aurora.config.test_constraint_parsing        
           .....   SUCCESS
                     src.test.python.apache.aurora.config.test_loader                    
           .....   SUCCESS
                     src.test.python.apache.aurora.config.test_thrift                    
           .....   SUCCESS
                     src.test.python.apache.aurora.executor.common.announcer             
           .....   SUCCESS
                     src.test.python.apache.aurora.executor.common.directory_sandbox     
           .....   SUCCESS
                     src.test.python.apache.aurora.executor.common.executor_timeout      
           .....   SUCCESS
                     src.test.python.apache.aurora.executor.common.health_checker        
           .....   SUCCESS
                     src.test.python.apache.aurora.executor.common.kill_manager          
           .....   SUCCESS
                     src.test.python.apache.aurora.executor.common.resource_manager_integration
     .....   FAILURE
                     src.test.python.apache.aurora.executor.common.status_checker        
           .....   SUCCESS
                     src.test.python.apache.aurora.executor.common.task_info             
           .....   SUCCESS
                     src.test.python.apache.aurora.executor.executor_base                
           .....   SUCCESS
                     src.test.python.apache.aurora.executor.executor_detector            
           .....   SUCCESS
                     src.test.python.apache.aurora.executor.executor_vars                
           .....   SUCCESS
                     src.test.python.apache.aurora.executor.gc_executor                  
           .....   SUCCESS
                     src.test.python.apache.aurora.executor.status_manager               
           .....   SUCCESS
                     src.test.python.apache.aurora.executor.thermos_executor             
           .....   SUCCESS
                     src.test.python.apache.aurora.executor.thermos_task_runner          
           .....   SUCCESS
                     src.test.python.apache.thermos.bin.test_thermos                     
           .....   SUCCESS
                     src.test.python.apache.thermos.common.test_pathspec                 
           .....   SUCCESS
                     src.test.python.apache.thermos.common.test_planner                  
           .....   SUCCESS
                     src.test.python.apache.thermos.common.test_task_planner             
           .....   SUCCESS
                     src.test.python.apache.thermos.config.test_schema                   
           .....   SUCCESS
                     src.test.python.apache.thermos.core.test_angry                      
           .....   SUCCESS
                     src.test.python.apache.thermos.core.test_ephemerals                 
           .....   SUCCESS
                     src.test.python.apache.thermos.core.test_failing_runner             
           .....   SUCCESS
                     src.test.python.apache.thermos.core.test_failure_limit              
           .....   SUCCESS
                     src.test.python.apache.thermos.core.test_finalization               
           .....   SUCCESS
                     src.test.python.apache.thermos.core.test_helper                     
           .....   SUCCESS
                     src.test.python.apache.thermos.core.test_process                    
           .....   SUCCESS
                     src.test.python.apache.thermos.core.test_runner_integration         
           .....   SUCCESS
                     src.test.python.apache.thermos.core.test_staged_kill                
           .....   SUCCESS
                     src.test.python.apache.thermos.monitoring.test_disk                 
           .....   SUCCESS
                     
FAILURE


               FAILURE
Build step 'Execute shell' marked build as failure
Recording test results

Mime
View raw message