aurora-dev mailing list archives

Site index · List index
Message view « Date » · « Thread »
Top « Date » · « Thread »
From Apache Jenkins Server <jenk...@builds.apache.org>
Subject Build failed in Jenkins: AuroraBot #1046
Date Thu, 22 Jan 2015 21:33:35 GMT
See <https://builds.apache.org/job/AuroraBot/1046/>

------------------------------------------
[...truncated 3934 lines...]
                     
                         def test_integration_stop(self):
                           with self.yield_sleepy(ThermosTaskRunner, sleep=1000, exit_code=0)
as task_runner:
                             task_runner.start()
                             task_runner.forked.wait()
                         
                             assert task_runner.status is None
                         
                             task_runner.stop()
                         
                     >       assert task_runner.status is not None
                     E       assert None is not None
                     E        +  where None = <apache.aurora.executor.thermos_task_runner.ThermosTaskRunner
object at 0x7f4fbaf56490>.status
                     
                     src/test/python/apache/aurora/executor/test_thermos_task_runner.py:175:
AssertionError
                     -------------- Captured stderr call --------------
                     Writing log files to disk in /tmp/user/20000/tmpdrGYH_
                     ERROR] Could not quitquitquit runner: Cannot take control of a task in
terminal state.
                      generated xml file: <https://builds.apache.org/job/AuroraBot/ws/dist/test-results/src.test.python.apache.aurora.executor.thermos_task_runner.xml>

                     ====== 1 failed, 7 passed in 81.27 seconds =======
                     src.test.python.apache.aurora.admin.admin                           
           .....   SUCCESS
                     src.test.python.apache.aurora.admin.host_maintenance                
           .....   SUCCESS
                     src.test.python.apache.aurora.admin.maintenance                     
           .....   SUCCESS
                     src.test.python.apache.aurora.client.api.api                        
           .....   SUCCESS
                     src.test.python.apache.aurora.client.api.instance_watcher           
           .....   SUCCESS
                     src.test.python.apache.aurora.client.api.job_monitor                
           .....   SUCCESS
                     src.test.python.apache.aurora.client.api.mux                        
           .....   SUCCESS
                     src.test.python.apache.aurora.client.api.quota_check                
           .....   SUCCESS
                     src.test.python.apache.aurora.client.api.restarter                  
           .....   SUCCESS
                     src.test.python.apache.aurora.client.api.scheduler_client           
           .....   SUCCESS
                     src.test.python.apache.aurora.client.api.sla                        
           .....   SUCCESS
                     src.test.python.apache.aurora.client.api.task_util                  
           .....   SUCCESS
                     src.test.python.apache.aurora.client.api.updater                    
           .....   SUCCESS
                     src.test.python.apache.aurora.client.api.updater_util               
           .....   SUCCESS
                     src.test.python.apache.aurora.client.base                           
           .....   SUCCESS
                     src.test.python.apache.aurora.client.binding_helper                 
           .....   SUCCESS
                     src.test.python.apache.aurora.client.cli.api                        
           .....   SUCCESS
                     src.test.python.apache.aurora.client.cli.client                     
           .....   SUCCESS
                     src.test.python.apache.aurora.client.cli.command_hooks              
           .....   SUCCESS
                     src.test.python.apache.aurora.client.cli.config                     
           .....   SUCCESS
                     src.test.python.apache.aurora.client.cli.cron                       
           .....   SUCCESS
                     src.test.python.apache.aurora.client.cli.inspect                    
           .....   SUCCESS
                     src.test.python.apache.aurora.client.cli.job                        
           .....   SUCCESS
                     src.test.python.apache.aurora.client.cli.plugins                    
           .....   SUCCESS
                     src.test.python.apache.aurora.client.cli.quota                      
           .....   SUCCESS
                     src.test.python.apache.aurora.client.cli.sla                        
           .....   SUCCESS
                     src.test.python.apache.aurora.client.cli.supdate                    
           .....   SUCCESS
                     src.test.python.apache.aurora.client.cli.task                       
           .....   SUCCESS
                     src.test.python.apache.aurora.client.cli.update                     
           .....   SUCCESS
                     src.test.python.apache.aurora.client.cli.version                    
           .....   SUCCESS
                     src.test.python.apache.aurora.client.config                         
           .....   SUCCESS
                     src.test.python.apache.aurora.client.hooks.hooked_api               
           .....   SUCCESS
                     src.test.python.apache.aurora.client.hooks.non_hooked_api           
           .....   SUCCESS
                     src.test.python.apache.aurora.common.test_aurora_job_key            
           .....   SUCCESS
                     src.test.python.apache.aurora.common.test_cluster                   
           .....   SUCCESS
                     src.test.python.apache.aurora.common.test_cluster_option            
           .....   SUCCESS
                     src.test.python.apache.aurora.common.test_clusters                  
           .....   SUCCESS
                     src.test.python.apache.aurora.common.test_http_signaler             
           .....   SUCCESS
                     src.test.python.apache.aurora.common.test_pex_version               
           .....   SUCCESS
                     src.test.python.apache.aurora.common.test_shellify                  
           .....   SUCCESS
                     src.test.python.apache.aurora.common.test_transport                 
           .....   SUCCESS
                     src.test.python.apache.aurora.config.test_base                      
           .....   SUCCESS
                     src.test.python.apache.aurora.config.test_constraint_parsing        
           .....   SUCCESS
                     src.test.python.apache.aurora.config.test_loader                    
           .....   SUCCESS
                     src.test.python.apache.aurora.config.test_thrift                    
           .....   SUCCESS
                     src.test.python.apache.aurora.executor.common.task_info             
           .....   SUCCESS
                     src.test.python.apache.aurora.executor.executor_base                
           .....   SUCCESS
                     src.test.python.apache.aurora.executor.executor_detector            
           .....   SUCCESS
                     src.test.python.apache.aurora.executor.executor_vars                
           .....   SUCCESS
                     src.test.python.apache.aurora.executor.status_manager               
           .....   SUCCESS
                     src.test.python.apache.aurora.executor.thermos_task_runner          
           .....   FAILURE
                     src.test.python.apache.thermos.common.test_pathspec                 
           .....   SUCCESS
                     src.test.python.apache.thermos.core.test_runner_integration         
           .....   SUCCESS
                     src.test.python.apache.thermos.monitoring.test_disk                 
           .....   SUCCESS
                     
FAILURE


               FAILURE
Request: https://reviews.apache.org/api/repositories/?name=aurora
Request: https://reviews.apache.org/api/review-requests/?status=pending&repository=133
Found 20 review requests to inspect
Inspecting review 30187: Remove support for cluster metadata in YAML format.
Request: https://reviews.apache.org/api/review-requests/30187/reviews/
Request: https://reviews.apache.org/api/review-requests/30187/diffs/
Applying diff 56806
Request: https://reviews.apache.org/api/review-requests/30187/diffs/1/
Running build command.
Replying to review 30187:
Master (116ee2d) is red with this patch.
  ./build-support/jenkins/build.sh

                     src.test.python.apache.aurora.client.cli.config                     
           .....   SUCCESS
                     src.test.python.apache.aurora.client.cli.cron                       
           .....   SUCCESS
                     src.test.python.apache.aurora.client.cli.inspect                    
           .....   SUCCESS
                     src.test.python.apache.aurora.client.cli.job                        
           .....   SUCCESS
                     src.test.python.apache.aurora.client.cli.plugins                    
           .....   SUCCESS
                     src.test.python.apache.aurora.client.cli.quota                      
           .....   SUCCESS
                     src.test.python.apache.aurora.client.cli.sla                        
           .....   SUCCESS
                     src.test.python.apache.aurora.client.cli.supdate                    
           .....   SUCCESS
                     src.test.python.apache.aurora.client.cli.task                       
           .....   SUCCESS
                     src.test.python.apache.aurora.client.cli.update                     
           .....   SUCCESS
                     src.test.python.apache.aurora.client.cli.version                    
           .....   SUCCESS
                     src.test.python.apache.aurora.client.config                         
           .....   SUCCESS
                     src.test.python.apache.aurora.client.hooks.hooked_api               
           .....   SUCCESS
                     src.test.python.apache.aurora.client.hooks.non_hooked_api           
           .....   SUCCESS
                     src.test.python.apache.aurora.common.test_aurora_job_key            
           .....   SUCCESS
                     src.test.python.apache.aurora.common.test_cluster                   
           .....   SUCCESS
                     src.test.python.apache.aurora.common.test_cluster_option            
           .....   SUCCESS
                     src.test.python.apache.aurora.common.test_clusters                  
           .....   SUCCESS
                     src.test.python.apache.aurora.common.test_http_signaler             
           .....   SUCCESS
                     src.test.python.apache.aurora.common.test_pex_version               
           .....   SUCCESS
                     src.test.python.apache.aurora.common.test_shellify                  
           .....   SUCCESS
                     src.test.python.apache.aurora.common.test_transport                 
           .....   SUCCESS
                     src.test.python.apache.aurora.config.test_base                      
           .....   SUCCESS
                     src.test.python.apache.aurora.config.test_constraint_parsing        
           .....   SUCCESS
                     src.test.python.apache.aurora.config.test_loader                    
           .....   SUCCESS
                     src.test.python.apache.aurora.config.test_thrift                    
           .....   SUCCESS
                     src.test.python.apache.aurora.executor.common.task_info             
           .....   SUCCESS
                     src.test.python.apache.aurora.executor.executor_base                
           .....   SUCCESS
                     src.test.python.apache.aurora.executor.executor_detector            
           .....   SUCCESS
                     src.test.python.apache.aurora.executor.executor_vars                
           .....   SUCCESS
                     src.test.python.apache.aurora.executor.status_manager               
           .....   SUCCESS
                     src.test.python.apache.aurora.executor.thermos_task_runner          
           .....   FAILURE
                     src.test.python.apache.thermos.common.test_pathspec                 
           .....   SUCCESS
                     src.test.python.apache.thermos.core.test_runner_integration         
           .....   SUCCESS
                     src.test.python.apache.thermos.monitoring.test_disk                 
           .....   SUCCESS
                     
FAILURE


               FAILURE


I will refresh this build result if you post a review containing "@ReviewBot retry"
Request: https://reviews.apache.org/api/review-requests/30187/reviews/
{u'stat': u'ok', u'review': {u'body_top': u'Master (116ee2d) is red with this patch.\n  ./build-support/jenkins/build.sh\n\n
                    src.test.python.apache.aurora.client.cli.config                      
          .....   SUCCESS\n                     src.test.python.apache.aurora.client.cli.cron
                                  .....   SUCCESS\n                     src.test.python.apache.aurora.client.cli.inspect
                               .....   SUCCESS\n                     src.test.python.apache.aurora.client.cli.job
                                   .....   SUCCESS\n                     src.test.python.apache.aurora.client.cli.plugins
                               .....   SUCCESS\n                     src.test.python.apache.aurora.client.cli.quota
                                 .....   SUCCESS\n                     src.test.python.apache.aurora.client.cli.sla
                                   .....   SUCCESS\n                     src.test.python.apache.aurora.client.cli.supdate
                               .....   SUCCESS\n                     src.test.python.apache.aurora.client.cli.task
                                  .....   SUCCESS\n                     src.test.python.apache.aurora.client.cli.update
                                .....   SUCCESS\n                     src.test.python.apache.aurora.client.cli.version
                               .....   SUCCESS\n                     src.test.python.apache.aurora.client.config
                                    .....   SUCCESS\n                     src.test.python.apache.aurora.client.hooks.hooked_api
                          .....   SUCCESS\n                     src.test.python.apache.aurora.client.hooks.non_hooked_api
                      .....   SUCCESS\n                     src.test.python.apache.aurora.common.test_aurora_job_key
                       .....   SUCCESS\n                     src.test.python.apache.aurora.common.test_cluster
                              .....   SUCCESS\n                     src.test.python.apache.aurora.common.test_cluster_option
                       .....   SUCCESS\n                     src.test.python.apache.aurora.common.test_clusters
                             .....   SUCCESS\n                     src.test.python.apache.aurora.common.test_http_signaler
                        .....   SUCCESS\n                     src.test.python.apache.aurora.common.test_pex_version
                          .....   SUCCESS\n                     src.test.python.apache.aurora.common.test_shellify
                             .....   SUCCESS\n                     src.test.python.apache.aurora.common.test_transport
                            .....   SUCCESS\n                     src.test.python.apache.aurora.config.test_base
                                 .....   SUCCESS\n                     src.test.python.apache.aurora.config.test_constraint_parsing
                   .....   SUCCESS\n                     src.test.python.apache.aurora.config.test_loader
                               .....   SUCCESS\n                     src.test.python.apache.aurora.config.test_thrift
                               .....   SUCCESS\n                     src.test.python.apache.aurora.executor.common.task_info
                        .....   SUCCESS\n                     src.test.python.apache.aurora.executor.executor_base
                           .....   SUCCESS\n                     src.test.python.apache.aurora.executor.executor_detector
                       .....   SUCCESS\n                     src.test.python.apache.aurora.executor.executor_vars
                           .....   SUCCESS\n                     src.test.python.apache.aurora.executor.status_manager
                          .....   SUCCESS\n                     src.test.python.apache.aurora.executor.thermos_task_runner
                     .....   FAILURE\n                     src.test.python.apache.thermos.common.test_pathspec
                            .....   SUCCESS\n                     src.test.python.apache.thermos.core.test_runner_integration
                    .....   SUCCESS\n                     src.test.python.apache.thermos.monitoring.test_disk
                            .....   SUCCESS\n                     \nFAILURE\n\n\x1b[31m\n
              FAILURE\x1b[0m\n\n\nI will refresh this build result if you post a review containing
"@ReviewBot retry"', u'ship_it': False, u'links': {u'diff_comments': {u'href': u'https://reviews.apache.org/api/review-requests/30187/reviews/69270/diff-comments/',
u'method': u'GET'}, u'file_attachment_comments': {u'href': u'https://reviews.apache.org/api/review-requests/30187/reviews/69270/file-attachment-comments/',
u'method': u'GET'}, u'self': {u'href': u'https://reviews.apache.org/api/review-requests/30187/reviews/69270/',
u'method': u'GET'}, u'update': {u'href': u'https://reviews.apache.org/api/review-requests/30187/reviews/69270/',
u'method': u'PUT'}, u'screenshot_comments': {u'href': u'https://reviews.apache.org/api/review-requests/30187/reviews/69270/screenshot-comments/',
u'method': u'GET'}, u'user': {u'href': u'https://reviews.apache.org/api/users/aurorabot/',
u'method': u'GET', u'title': u'aurorabot'}, u'replies': {u'href': u'https://reviews.apache.org/api/review-requests/30187/reviews/69270/replies/',
u'method': u'GET'}, u'delete': {u'href': u'https://reviews.apache.org/api/review-requests/30187/reviews/69270/',
u'method': u'DELETE'}}, u'timestamp': u'2015-01-22T21:31:46Z', u'id': 69270, u'text_type':
u'plain', u'body_bottom': u'', u'extra_data': {}, u'public': True}}
Inspecting review 30178: Avoid performing RPC authentication while holding the write lock.
Request: https://reviews.apache.org/api/review-requests/30178/reviews/
Request: https://reviews.apache.org/api/review-requests/30178/diffs/
Latest feedback was given at        2015-01-22T19:51:52Z
Latest build request from a user at 2015-01-22T19:51:52Z
Latest diff was posted at           2015-01-22T19:21:12Z
Inspecting review 28920: Add support for docker containers to aurora
Request: https://reviews.apache.org/api/review-requests/28920/reviews/
Fetching next page of reviews.
Request: https://reviews.apache.org/api/review-requests/28920/reviews/?start=25&max-results=25
Fetching next page of reviews.
Request: https://reviews.apache.org/api/review-requests/28920/reviews/?start=50&max-results=25
Request: https://reviews.apache.org/api/review-requests/28920/diffs/
Latest feedback was given at        2015-01-16T01:02:20Z
Latest build request from a user at 2015-01-16T01:02:20Z
Latest diff was posted at           2015-01-16T00:04:57Z
Inspecting review 28731: Implemented TaskScheduler benchmarks.
Request: https://reviews.apache.org/api/review-requests/28731/reviews/
Request: https://reviews.apache.org/api/review-requests/28731/diffs/
Latest feedback was given at        2015-01-22T02:29:30Z
Latest build request from a user at 2015-01-22T02:29:30Z
Latest diff was posted at           2015-01-22T01:52:21Z
Inspecting review 29117: Adding thrift API changes document.
Request: https://reviews.apache.org/api/review-requests/29117/reviews/
Request: https://reviews.apache.org/api/review-requests/29117/diffs/
Latest feedback was given at        2015-01-21T23:01:19Z
Latest build request from a user at 2015-01-21T23:01:19Z
Latest diff was posted at           2015-01-21T22:58:56Z
Inspecting review 30010: [AURORA-184] Remove hardcoded 'host' and 'rack' limit constraints
Request: https://reviews.apache.org/api/review-requests/30010/reviews/
Request: https://reviews.apache.org/api/review-requests/30010/diffs/
Latest feedback was given at        2015-01-20T22:14:31Z
Latest build request from a user at 2015-01-20T22:14:31Z
Latest diff was posted at           2015-01-20T21:45:38Z
Inspecting review 29984: Minor clean up to mock usage in resource manager integration tests.
Request: https://reviews.apache.org/api/review-requests/29984/reviews/
Request: https://reviews.apache.org/api/review-requests/29984/diffs/
Latest feedback was given at        2015-01-21T01:24:04Z
Latest build request from a user at 2015-01-21T01:24:04Z
Latest diff was posted at           2015-01-16T21:43:41Z
Inspecting review 29943: Uptime-driven scheduler job updates
Request: https://reviews.apache.org/api/review-requests/29943/reviews/
Request: https://reviews.apache.org/api/review-requests/29943/diffs/
Latest feedback was given at        2015-01-20T19:58:35Z
Latest build request from a user at 2015-01-20T19:58:35Z
Latest diff was posted at           2015-01-17T20:32:14Z
Inspecting review 29464: Add option to override local scheduler address published into ZooKeeper
Request: https://reviews.apache.org/api/review-requests/29464/reviews/
Request: https://reviews.apache.org/api/review-requests/29464/diffs/
Latest feedback was given at        2015-01-08T17:59:06Z
Latest build request from a user at 2015-01-08T17:59:06Z
Latest diff was posted at           2015-01-08T17:24:38Z
Inspecting review 29862: Remove documentation for nonexistent pystachio feature.
Request: https://reviews.apache.org/api/review-requests/29862/reviews/
Request: https://reviews.apache.org/api/review-requests/29862/diffs/
Latest feedback was given at        2015-01-13T20:04:09Z
Latest build request from a user at 2015-01-13T20:04:09Z
Latest diff was posted at           2015-01-13T19:44:45Z
Inspecting review 29827: End to end tests for docker in aurora
Request: https://reviews.apache.org/api/review-requests/29827/reviews/
Request: https://reviews.apache.org/api/review-requests/29827/diffs/
Latest feedback was given at        2015-01-13T01:56:28Z
Latest build request from a user at 2015-01-13T01:56:28Z
Latest diff was posted at           2015-01-13T01:13:00Z
Inspecting review 28617: Implemented offer filtering for tasks with static vetoes.
Request: https://reviews.apache.org/api/review-requests/28617/reviews/
Request: https://reviews.apache.org/api/review-requests/28617/diffs/
Latest feedback was given at        2015-01-07T01:02:31Z
Latest build request from a user at 2015-01-07T01:02:31Z
Latest diff was posted at           2015-01-07T00:25:51Z
Inspecting review 29472: [WIP] Updates documentation markdown to a consistent style.
Request: https://reviews.apache.org/api/review-requests/29472/reviews/
Request: https://reviews.apache.org/api/review-requests/29472/diffs/
Latest feedback was given at        2015-01-06T19:48:35Z
Latest build request from a user at 2015-01-06T19:48:35Z
Latest diff was posted at           2014-12-29T23:21:11Z
Inspecting review 29286: Fix BUILD files in apache.aurora.admin and apache.aurora.client.api.
Request: https://reviews.apache.org/api/review-requests/29286/reviews/
Request: https://reviews.apache.org/api/review-requests/29286/diffs/
Latest feedback was given at        2014-12-20T03:55:30Z
Latest build request from a user at 2014-12-20T03:55:30Z
Latest diff was posted at           2014-12-20T03:04:43Z
Inspecting review 29171: Fix test_executor_vars so that it doesn't attempt to get a real PEX-INFO.
Request: https://reviews.apache.org/api/review-requests/29171/reviews/
Request: https://reviews.apache.org/api/review-requests/29171/diffs/
Traceback (most recent call last):
  File "./build-support/jenkins/review_feedback.py", line 221, in <module>
    main()
  File "./build-support/jenkins/review_feedback.py", line 168, in main
    if not _needs_reply(server, request):
  File "./build-support/jenkins/review_feedback.py", line 101, in _needs_reply
    latest_diff = _get_latest_diff_time(server, request)
  File "./build-support/jenkins/review_feedback.py", line 73, in _get_latest_diff_time
    diffs = server.get_resource(request['links']['diffs']['href'])['diffs']
  File "./build-support/jenkins/review_feedback.py", line 51, in get_resource
    return json.loads(self.get_resource_data(href, args=args, data=data))
  File "./build-support/jenkins/review_feedback.py", line 44, in get_resource_data
    result = urllib2.urlopen(request, data=data)
  File "/usr/lib/python2.7/urllib2.py", line 127, in urlopen
    return _opener.open(url, data, timeout)
  File "/usr/lib/python2.7/urllib2.py", line 404, in open
    response = self._open(req, data)
  File "/usr/lib/python2.7/urllib2.py", line 422, in _open
    '_open', req)
  File "/usr/lib/python2.7/urllib2.py", line 382, in _call_chain
    result = func(*args)
  File "/usr/lib/python2.7/urllib2.py", line 1222, in https_open
    return self.do_open(httplib.HTTPSConnection, req)
  File "/usr/lib/python2.7/urllib2.py", line 1184, in do_open
    raise URLError(err)
urllib2.URLError: <urlopen error [Errno -2] Name or service not known>
Build step 'Execute shell' marked build as failure

Mime
View raw message