aurora-dev mailing list archives

Site index · List index
Message view « Date » · « Thread »
Top « Date » · « Thread »
From Zameer Manji <zma...@twopensource.com>
Subject Re: Build failed in Jenkins: Aurora #747
Date Wed, 19 Nov 2014 20:54:07 GMT
Is this flakey or actually broken?

On Wed, Nov 19, 2014 at 11:46 AM, Apache Jenkins Server <
jenkins@builds.apache.org> wrote:

> See <https://builds.apache.org/job/Aurora/747/changes>
>
> Changes:
>
> [jfarrell] AURORA-933 - python missing license headers
>
> ------------------------------------------
> [...truncated 1840 lines...]
> ============================= test session starts
> ==============================
> platform linux2 -- Python 2.7.6 -- py-1.4.26 -- pytest-2.6.4 -- <
> https://builds.apache.org/job/Aurora/ws/build-support/pants.venv/bin/python2.7
> >
> plugins: cov, timeout
> collecting ... collected 3 items
>
> src/test/python/apache/aurora/common/test_cluster_option.py::test_constructors
> PASSED
> src/test/python/apache/aurora/common/test_cluster_option.py::test_parsable
> PASSED
> src/test/python/apache/aurora/common/test_cluster_option.py::test_not_parsable
> PASSED
>
>  generated xml file: <
> https://builds.apache.org/job/Aurora/ws/dist/test-results/src.test.python.apache.aurora.common.test_cluster_option.xml
> >
> =========================== 3 passed in 0.05 seconds
> ===========================
> ============================= test session starts
> ==============================
> platform linux2 -- Python 2.7.6 -- py-1.4.26 -- pytest-2.6.4 -- <
> https://builds.apache.org/job/Aurora/ws/build-support/pants.venv/bin/python2.7
> >
> plugins: cov, timeout
> collecting ... collected 3 items
>
> src/test/python/apache/aurora/common/test_http_signaler.py::TestHttpSignaler::test_all_calls_ok
> PASSED
> src/test/python/apache/aurora/common/test_http_signaler.py::TestHttpSignaler::test_exception
> PASSED
> src/test/python/apache/aurora/common/test_http_signaler.py::TestHttpSignaler::test_health_not_ok
> WARNING:root:Response differs from expected response (expected "ok", got
> "not ok")
> PASSED
>
>  generated xml file: <
> https://builds.apache.org/job/Aurora/ws/dist/test-results/src.test.python.apache.aurora.common.test_http_signaler.xml
> >
> =========================== 3 passed in 0.06 seconds
> ===========================
> ============================= test session starts
> ==============================
> platform linux2 -- Python 2.7.6 -- py-1.4.26 -- pytest-2.6.4 -- <
> https://builds.apache.org/job/Aurora/ws/build-support/pants.venv/bin/python2.7
> >
> plugins: cov, timeout
> collecting ... collected 1 items
>
> src/test/python/apache/aurora/common/test_shellify.py::test_shellify PASSED
>
>  generated xml file: <
> https://builds.apache.org/job/Aurora/ws/dist/test-results/src.test.python.apache.aurora.common.test_shellify.xml
> >
> =========================== 1 passed in 0.02 seconds
> ===========================
> ============================= test session starts
> ==============================
> platform linux2 -- Python 2.7.6 -- py-1.4.26 -- pytest-2.6.4 -- <
> https://builds.apache.org/job/Aurora/ws/build-support/pants.venv/bin/python2.7
> >
> plugins: cov, timeout
> collecting ... collected 4 items
>
> src/test/python/apache/aurora/common/test_transport.py::test_request_transport_integration
> 127.0.0.1 - - [19/Nov/2014 19:43:54] "POST / HTTP/1.1" 200 -
> PASSED
> src/test/python/apache/aurora/common/test_transport.py::test_request_transport_timeout
> PASSED
> src/test/python/apache/aurora/common/test_transport.py::test_request_any_other_exception
> PASSED
> src/test/python/apache/aurora/common/test_transport.py::test_requests_transports_lowers_logging_level
> PASSED
>
>  generated xml file: <
> https://builds.apache.org/job/Aurora/ws/dist/test-results/src.test.python.apache.aurora.common.test_transport.xml
> >
> =========================== 4 passed in 0.74 seconds
> ===========================
> ============================= test session starts
> ==============================
> platform linux2 -- Python 2.7.6 -- py-1.4.26 -- pytest-2.6.4 -- <
> https://builds.apache.org/job/Aurora/ws/build-support/pants.venv/bin/python2.7
> >
> plugins: cov, timeout
> collecting ... collected 7 items
>
> src/test/python/apache/aurora/config/test_base.py::test_all_static PASSED
> src/test/python/apache/aurora/config/test_base.py::test_binding PASSED
> src/test/python/apache/aurora/config/test_base.py::test_cycle PASSED
> src/test/python/apache/aurora/config/test_base.py::test_empty_config PASSED
> src/test/python/apache/aurora/config/test_base.py::test_simple_config
> PASSED
> src/test/python/apache/aurora/config/test_base.py::test_ports PASSED
> src/test/python/apache/aurora/config/test_base.py::test_static_port_aliasing
> PASSED
>
>  generated xml file: <
> https://builds.apache.org/job/Aurora/ws/dist/test-results/src.test.python.apache.aurora.config.test_base.xml
> >
> =========================== 7 passed in 1.40 seconds
> ===========================
> ============================= test session starts
> ==============================
> platform linux2 -- Python 2.7.6 -- py-1.4.26 -- pytest-2.6.4 -- <
> https://builds.apache.org/job/Aurora/ws/build-support/pants.venv/bin/python2.7
> >
> plugins: cov, timeout
> collecting ... collected 1 items
>
> src/test/python/apache/aurora/config/test_constraint_parsing.py::test_parsing_constraints
> limit:a is not a valid limit value, must be integer
> PASSED
>
>  generated xml file: <
> https://builds.apache.org/job/Aurora/ws/dist/test-results/src.test.python.apache.aurora.config.test_constraint_parsing.xml
> >
> =========================== 1 passed in 0.16 seconds
> ===========================
> ============================= test session starts
> ==============================
> platform linux2 -- Python 2.7.6 -- py-1.4.26 -- pytest-2.6.4 -- <
> https://builds.apache.org/job/Aurora/ws/build-support/pants.venv/bin/python2.7
> >
> plugins: cov, timeout
> collecting ... collected 6 items
>
> src/test/python/apache/aurora/config/test_loader.py::test_enoent PASSED
> src/test/python/apache/aurora/config/test_loader.py::test_bad_config PASSED
> src/test/python/apache/aurora/config/test_loader.py::test_empty_config
> PASSED
> src/test/python/apache/aurora/config/test_loader.py::test_load_json PASSED
> src/test/python/apache/aurora/config/test_loader.py::test_load PASSED
> src/test/python/apache/aurora/config/test_loader.py::test_pick PASSED
>
>  generated xml file: <
> https://builds.apache.org/job/Aurora/ws/dist/test-results/src.test.python.apache.aurora.config.test_loader.xml
> >
> =========================== 6 passed in 0.23 seconds
> ===========================
> ============================= test session starts
> ==============================
> platform linux2 -- Python 2.7.6 -- py-1.4.26 -- pytest-2.6.4 -- <
> https://builds.apache.org/job/Aurora/ws/build-support/pants.venv/bin/python2.7
> >
> plugins: cov, timeout
> collecting ... collected 10 items
>
> src/test/python/apache/aurora/config/test_thrift.py::test_simple_config
> PASSED
> src/test/python/apache/aurora/config/test_thrift.py::test_config_with_options
> PASSED
> src/test/python/apache/aurora/config/test_thrift.py::test_config_with_ports
> PASSED
> src/test/python/apache/aurora/config/test_thrift.py::test_config_with_bad_resources
> PASSED
> src/test/python/apache/aurora/config/test_thrift.py::test_config_with_task_links
> PASSED
> src/test/python/apache/aurora/config/test_thrift.py::test_unbound_references
> PASSED
> src/test/python/apache/aurora/config/test_thrift.py::test_cron_collision_policy
> PASSED
> src/test/python/apache/aurora/config/test_thrift.py::test_metadata_in_config
> PASSED
> src/test/python/apache/aurora/config/test_thrift.py::test_task_instance_from_job
> PASSED
> src/test/python/apache/aurora/config/test_thrift.py::test_identifier_validation
> PASSED
>
>  generated xml file: <
> https://builds.apache.org/job/Aurora/ws/dist/test-results/src.test.python.apache.aurora.config.test_thrift.xml
> >
> ========================== 10 passed in 1.47 seconds
> ===========================
> ============================= test session starts
> ==============================
> platform linux2 -- Python 2.7.6 -- py-1.4.26 -- pytest-2.6.4 -- <
> https://builds.apache.org/job/Aurora/ws/build-support/pants.venv/bin/python2.7
> >
> plugins: cov, timeout
> collecting ... collected 8 items
>
> src/test/python/apache/aurora/executor/test_executor_base.py::TestExecutorBase::test_disconnected
> PASSED
> src/test/python/apache/aurora/executor/test_executor_base.py::TestExecutorBase::test_error
> PASSED
> src/test/python/apache/aurora/executor/test_executor_base.py::TestExecutorBase::test_frameworkMessage
> PASSED
> src/test/python/apache/aurora/executor/test_executor_base.py::TestExecutorBase::test_log
> PASSED
> src/test/python/apache/aurora/executor/test_executor_base.py::TestExecutorBase::test_registered
> PASSED
> src/test/python/apache/aurora/executor/test_executor_base.py::TestExecutorBase::test_reregistered
> PASSED
> src/test/python/apache/aurora/executor/test_executor_base.py::TestExecutorBase::test_send_update
> PASSED
> src/test/python/apache/aurora/executor/test_executor_base.py::TestExecutorBase::test_status_is_terminal
> PASSED
>
>  generated xml file: <
> https://builds.apache.org/job/Aurora/ws/dist/test-results/src.test.python.apache.aurora.executor.executor_base.xml
> >
> =========================== 8 passed in 0.19 seconds
> ===========================
> ============================= test session starts
> ==============================
> platform linux2 -- Python 2.7.6 -- py-1.4.26 -- pytest-2.6.4 -- <
> https://builds.apache.org/job/Aurora/ws/build-support/pants.venv/bin/python2.7
> >
> plugins: cov, timeout
> collecting ... collected 4 items
>
> src/test/python/apache/aurora/executor/test_executor_detector.py::test_find_root
> PASSED
> src/test/python/apache/aurora/executor/test_executor_detector.py::test_match_inverse
> PASSED
> src/test/python/apache/aurora/executor/test_executor_detector.py::test_bad_match
> PASSED
> src/test/python/apache/aurora/executor/test_executor_detector.py::test_integration
> PASSED
>
>  generated xml file: <
> https://builds.apache.org/job/Aurora/ws/dist/test-results/src.test.python.apache.aurora.executor.executor_detector.xml
> >
> =========================== 4 passed in 0.04 seconds
> ===========================
> ============================= test session starts
> ==============================
> platform linux2 -- Python 2.7.6 -- py-1.4.26 -- pytest-2.6.4 -- <
> https://builds.apache.org/job/Aurora/ws/build-support/pants.venv/bin/python2.7
> >
> plugins: cov, timeout
> collecting ... collected 4 items
>
> src/test/python/apache/aurora/executor/test_executor_vars.py::test_release_from_tag
> PASSED
> src/test/python/apache/aurora/executor/test_executor_vars.py::test_extract_pexinfo
> PASSED
> src/test/python/apache/aurora/executor/test_executor_vars.py::test_init
> PASSED
> src/test/python/apache/aurora/executor/test_executor_vars.py::test_sample
> PASSED
>
>  generated xml file: <
> https://builds.apache.org/job/Aurora/ws/dist/test-results/src.test.python.apache.aurora.executor.executor_vars.xml
> >
> =========================== 4 passed in 0.17 seconds
> ===========================
> ============================= test session starts
> ==============================
> platform linux2 -- Python 2.7.6 -- py-1.4.26 -- pytest-2.6.4 -- <
> https://builds.apache.org/job/Aurora/ws/build-support/pants.venv/bin/python2.7
> >
> plugins: cov, timeout
> collecting ... collected 1 items
>
> src/test/python/apache/aurora/executor/test_status_manager.py::TestStatusManager::test_run
> PASSED
>
>  generated xml file: <
> https://builds.apache.org/job/Aurora/ws/dist/test-results/src.test.python.apache.aurora.executor.status_manager.xml
> >
> =========================== 1 passed in 0.18 seconds
> ===========================
> ============================= test session starts
> ==============================
> platform linux2 -- Python 2.7.6 -- py-1.4.26 -- pytest-2.6.4 -- <
> https://builds.apache.org/job/Aurora/ws/build-support/pants.venv/bin/python2.7
> >
> plugins: cov, timeout
> collecting ... collected 8 items
>
> src/test/python/apache/aurora/executor/test_thermos_task_runner.py::TestThermosTaskRunnerIntegration::test_integration_success
> Writing log files to disk in /tmp/user/2396/tmpGkwaGx
> Build operating on top level addresses: set([BuildFileAddress(<
> https://builds.apache.org/job/Aurora/ws/src/main/python/apache/aurora/executor/bin/BUILD,>
> thermos_runner)])
> Building PythonBinary PythonBinary(BuildFileAddress(<
> https://builds.apache.org/job/Aurora/ws/src/main/python/apache/aurora/executor/bin/BUILD,>
> thermos_runner)):
> Wrote <https://builds.apache.org/job/Aurora/ws/dist/thermos_runner.pex>
> Writing log files to disk in /tmp/user/2396/tmpGkwaGx
> PASSED
> src/test/python/apache/aurora/executor/test_thermos_task_runner.py::TestThermosTaskRunnerIntegration::test_integration_failed
> Writing log files to disk in /tmp/user/2396/tmpGkwaGx
> PASSED
> src/test/python/apache/aurora/executor/test_thermos_task_runner.py::TestThermosTaskRunnerIntegration::test_integration_stop
> Writing log files to disk in /tmp/user/2396/tmpGkwaGx
> ERROR] Could not instantiate runner!
> FAILED
>
> =================================== FAILURES
> ===================================
> ____________ TestThermosTaskRunnerIntegration.test_integration_stop
> ____________
>
> self = <test_thermos_task_runner.TestThermosTaskRunnerIntegration object
> at 0x7f17b72be310>
>
>     def test_integration_stop(self):
>       with self.yield_sleepy(ThermosTaskRunner, sleep=1000, exit_code=0)
> as task_runner:
>         task_runner.start()
>         task_runner.forked.wait()
>
>         assert task_runner.status is None
>
>         task_runner.stop()
>
> >       assert task_runner.status is not None
> E       assert None is not None
> E        +  where None =
> <apache.aurora.executor.thermos_task_runner.ThermosTaskRunner object at
> 0x7f17b6359e50>.status
>
> src/test/python/apache/aurora/executor/test_thermos_task_runner.py:175:
> AssertionError
>  generated xml file: <
> https://builds.apache.org/job/Aurora/ws/dist/test-results/src.test.python.apache.aurora.executor.thermos_task_runner.xml
> >
> !!!!!!!!!!!!!!!!!!!! Interrupted: stopping after 1 failures
> !!!!!!!!!!!!!!!!!!!!
> ===================== 1 failed, 2 passed in 65.90 seconds
> ======================
> Build operating on top level addresses: set([BuildFileAddress(<
> https://builds.apache.org/job/Aurora/ws/src/test/python/BUILD,> all)])
> src.test.python.apache.aurora.admin.admin_util
>       .....   SUCCESS
> src.test.python.apache.aurora.admin.host_maintenance
>       .....   SUCCESS
> src.test.python.apache.aurora.client.api.api
>       .....   SUCCESS
> src.test.python.apache.aurora.client.api.disambiguator
>       .....   SUCCESS
> src.test.python.apache.aurora.client.api.instance_watcher
>      .....   SUCCESS
> src.test.python.apache.aurora.client.api.job_monitor
>       .....   SUCCESS
> src.test.python.apache.aurora.client.api.mux
>       .....   SUCCESS
> src.test.python.apache.aurora.client.api.quota_check
>       .....   SUCCESS
> src.test.python.apache.aurora.client.api.restarter
>       .....   SUCCESS
> src.test.python.apache.aurora.client.api.scheduler_client
>      .....   SUCCESS
> src.test.python.apache.aurora.client.api.sla
>       .....   SUCCESS
> src.test.python.apache.aurora.client.api.task_util
>       .....   SUCCESS
> src.test.python.apache.aurora.client.api.updater
>       .....   SUCCESS
> src.test.python.apache.aurora.client.api.updater_util
>      .....   SUCCESS
> src.test.python.apache.aurora.client.binding_helper
>      .....   SUCCESS
> src.test.python.apache.aurora.client.cli.api
>       .....   SUCCESS
> src.test.python.apache.aurora.client.cli.bridge
>      .....   SUCCESS
> src.test.python.apache.aurora.client.cli.command_hooks
>       .....   SUCCESS
> src.test.python.apache.aurora.client.cli.config
>      .....   SUCCESS
> src.test.python.apache.aurora.client.cli.cron
>      .....   SUCCESS
> src.test.python.apache.aurora.client.cli.help
>      .....   SUCCESS
> src.test.python.apache.aurora.client.cli.inspect
>       .....   SUCCESS
> src.test.python.apache.aurora.client.cli.job
>       .....   SUCCESS
> src.test.python.apache.aurora.client.cli.logging
>       .....   SUCCESS
> src.test.python.apache.aurora.client.cli.plugins
>       .....   SUCCESS
> src.test.python.apache.aurora.client.cli.quota
>       .....   SUCCESS
> src.test.python.apache.aurora.client.cli.sla
>       .....   SUCCESS
> src.test.python.apache.aurora.client.cli.supdate
>       .....   SUCCESS
> src.test.python.apache.aurora.client.cli.task
>      .....   SUCCESS
> src.test.python.apache.aurora.client.cli.update
>      .....   SUCCESS
> src.test.python.apache.aurora.client.commands.admin
>      .....   SUCCESS
> src.test.python.apache.aurora.client.commands.core
>       .....   SUCCESS
> src.test.python.apache.aurora.client.commands.hooks
>      .....   SUCCESS
> src.test.python.apache.aurora.client.commands.maintenance
>      .....   SUCCESS
> src.test.python.apache.aurora.client.commands.run
>      .....   SUCCESS
> src.test.python.apache.aurora.client.commands.ssh
>      .....   SUCCESS
> src.test.python.apache.aurora.client.config
>      .....   SUCCESS
> src.test.python.apache.aurora.client.hooks.hooked_api
>      .....   SUCCESS
> src.test.python.apache.aurora.client.hooks.non_hooked_api
>      .....   SUCCESS
> src.test.python.apache.aurora.common.test_aurora_job_key
>       .....   SUCCESS
> src.test.python.apache.aurora.common.test_cluster
>      .....   SUCCESS
> src.test.python.apache.aurora.common.test_cluster_option
>       .....   SUCCESS
> src.test.python.apache.aurora.common.test_clusters
>       .....   SUCCESS
> src.test.python.apache.aurora.common.test_http_signaler
>      .....   SUCCESS
> src.test.python.apache.aurora.common.test_shellify
>       .....   SUCCESS
> src.test.python.apache.aurora.common.test_transport
>      .....   SUCCESS
> src.test.python.apache.aurora.config.test_base
>       .....   SUCCESS
> src.test.python.apache.aurora.config.test_constraint_parsing
>       .....   SUCCESS
> src.test.python.apache.aurora.config.test_loader
>       .....   SUCCESS
> src.test.python.apache.aurora.config.test_thrift
>       .....   SUCCESS
> src.test.python.apache.aurora.executor.executor_base
>       .....   SUCCESS
> src.test.python.apache.aurora.executor.executor_detector
>       .....   SUCCESS
> src.test.python.apache.aurora.executor.executor_vars
>       .....   SUCCESS
> src.test.python.apache.aurora.executor.status_manager
>      .....   SUCCESS
> src.test.python.apache.aurora.executor.thermos_task_runner
>       .....   FAILURE
> Build step 'Execute shell' marked build as failure
> Recording test results
> Updating AURORA-933
>



-- 
Zameer Manji

Mime
  • Unnamed multipart/alternative (inline, None, 0 bytes)
View raw message