aurora-dev mailing list archives

Site index · List index
Message view « Date » · « Thread »
Top « Date » · « Thread »
From Maxim Khutornenko <ma...@apache.org>
Subject Re: Build failed in Jenkins: Aurora #674
Date Wed, 22 Oct 2014 16:29:16 GMT
To make it clear, I suggest softening the coverage check introduced
here:  https://reviews.apache.org/r/26902/.

On Wed, Oct 22, 2014 at 9:24 AM, Maxim Khutornenko <maxim@apache.org> wrote:
>> Instruction coverage must be greater than 0.88
>
> Apparently, there is a difference in how the coverage is calculated
> depending on the environment. I can't build locally unless I bump up
> the min coverage to 0.88 but that trips jenkins build. I suggest we
> either convert this error to message or add some epsilon to the
> comparison.
>
> On Wed, Oct 22, 2014 at 9:12 AM, Apache Jenkins Server
> <jenkins@builds.apache.org> wrote:
>> See <https://builds.apache.org/job/Aurora/674/changes>
>>
>> Changes:
>>
>> [maxim] Adding quota check into scheduleCronJob RPC.
>>
>> [maxim] Re-building Aurora components before running e2e tests.
>>
>> ------------------------------------------
>> Started by an SCM change
>> Building remotely on ubuntu-5 (docker Ubuntu ubuntu5 ubuntu) in workspace <https://builds.apache.org/job/Aurora/ws/>
>> Wiping out workspace first.
>> Cloning the remote Git repository
>> Cloning repository https://git-wip-us.apache.org/repos/asf/incubator-aurora.git
>>  > git init <https://builds.apache.org/job/Aurora/ws/>
>> Fetching upstream changes from https://git-wip-us.apache.org/repos/asf/incubator-aurora.git
>>  > git --version
>>  > git fetch --tags --progress https://git-wip-us.apache.org/repos/asf/incubator-aurora.git
+refs/heads/*:refs/remotes/origin/*
>>  > git config remote.origin.url https://git-wip-us.apache.org/repos/asf/incubator-aurora.git
>>  > git config remote.origin.fetch +refs/heads/*:refs/remotes/origin/*
>>  > git config remote.origin.url https://git-wip-us.apache.org/repos/asf/incubator-aurora.git
>> Fetching upstream changes from https://git-wip-us.apache.org/repos/asf/incubator-aurora.git
>>  > git fetch --tags --progress https://git-wip-us.apache.org/repos/asf/incubator-aurora.git
+refs/heads/*:refs/remotes/origin/*
>>  > git rev-parse origin/master^{commit}
>> Checking out Revision 31820441e7e7f87a37b820ac6ae0d454aae4e9c0 (origin/master)
>>  > git config core.sparsecheckout
>>  > git checkout -f 31820441e7e7f87a37b820ac6ae0d454aae4e9c0
>>  > git rev-list dde0a7267d956b29fd355581c50e599f17341803
>> Cleaning workspace
>>  > git rev-parse --verify HEAD
>> Resetting working tree
>>  > git reset --hard
>>  > git clean -fdx
>> [Aurora] $ /bin/bash -xe /tmp/hudson8724263326521035133.sh
>> + ./build-support/jenkins/build.sh
>> + date
>> Wed Oct 22 16:07:57 UTC 2014
>> + ./gradlew -Pq clean build --stacktrace
>> :buildSrc:clean UP-TO-DATE
>> :buildSrc:compileJava UP-TO-DATE
>> :buildSrc:compileGroovy
>> :buildSrc:processResources UP-TO-DATE
>> :buildSrc:classes
>> :buildSrc:jar
>> :buildSrc:assemble
>> :buildSrc:compileTestJava UP-TO-DATE
>> :buildSrc:compileTestGroovy UP-TO-DATE
>> :buildSrc:processTestResources UP-TO-DATE
>> :buildSrc:testClasses UP-TO-DATE
>> :buildSrc:test UP-TO-DATE
>> :buildSrc:check UP-TO-DATE
>> :buildSrc:build
>> :clean
>> :bootstrapThrift
>> :checkPython
>> :generateSources
>> :compileGeneratedJavaNote: Some input files use unchecked or unsafe operations.
>> Note: Recompile with -Xlint:unchecked for details.
>>
>> :processGeneratedResources UP-TO-DATE
>> :generatedClasses
>> :compileJavaNote: Writing <https://builds.apache.org/job/Aurora/ws/dist/classes/main/com/twitter/common/args/apt/cmdline.arg.info.txt.2>
>>
>> :processResources
>> :classes
>> :jar
>> :assemble
>> :jsHint
>> :checkstyleMain
>> :compileTestJava
>> :processTestResources
>> :testClasses
>> :checkstyleTest
>> :findbugsGenerated
>> :findbugsMain
>> :findbugsTest
>> :licenseGenerated UP-TO-DATE
>> :licenseMain UP-TO-DATE
>> :licenseTest UP-TO-DATE
>> :license UP-TO-DATE
>> :pmdMain
>> :test
>> :jacocoTestReport
>> Coverage report generated: file://<https://builds.apache.org/job/Aurora/ws/dist/reports/jacoco/test/html/index.html>
>> :analyzeReport FAILED
>>
>> FAILURE: Build failed with an exception.
>>
>> * What went wrong:
>> Execution failed for task ':analyzeReport'.
>>> Instruction coverage must be greater than 0.88
>>
>> * Try:
>> Run with --info or --debug option to get more log output.
>>
>> * Exception is:
>> org.gradle.api.tasks.TaskExecutionException: Execution failed for task ':analyzeReport'.
>>         at org.gradle.api.internal.tasks.execution.ExecuteActionsTaskExecuter.executeActions(ExecuteActionsTaskExecuter.java:69)
>>         at org.gradle.api.internal.tasks.execution.ExecuteActionsTaskExecuter.execute(ExecuteActionsTaskExecuter.java:46)
>>         at org.gradle.api.internal.tasks.execution.PostExecutionAnalysisTaskExecuter.execute(PostExecutionAnalysisTaskExecuter.java:35)
>>         at org.gradle.api.internal.tasks.execution.SkipUpToDateTaskExecuter.execute(SkipUpToDateTaskExecuter.java:64)
>>         at org.gradle.api.internal.tasks.execution.ValidatingTaskExecuter.execute(ValidatingTaskExecuter.java:58)
>>         at org.gradle.api.internal.tasks.execution.SkipEmptySourceFilesTaskExecuter.execute(SkipEmptySourceFilesTaskExecuter.java:42)
>>         at org.gradle.api.internal.tasks.execution.SkipTaskWithNoActionsExecuter.execute(SkipTaskWithNoActionsExecuter.java:52)
>>         at org.gradle.api.internal.tasks.execution.SkipOnlyIfTaskExecuter.execute(SkipOnlyIfTaskExecuter.java:53)
>>         at org.gradle.api.internal.tasks.execution.ExecuteAtMostOnceTaskExecuter.execute(ExecuteAtMostOnceTaskExecuter.java:43)
>>         at org.gradle.api.internal.AbstractTask.executeWithoutThrowingTaskFailure(AbstractTask.java:305)
>>         at org.gradle.execution.taskgraph.AbstractTaskPlanExecutor$TaskExecutorWorker.executeTask(AbstractTaskPlanExecutor.java:79)
>>         at org.gradle.execution.taskgraph.AbstractTaskPlanExecutor$TaskExecutorWorker.processTask(AbstractTaskPlanExecutor.java:63)
>>         at org.gradle.execution.taskgraph.AbstractTaskPlanExecutor$TaskExecutorWorker.run(AbstractTaskPlanExecutor.java:51)
>>         at org.gradle.execution.taskgraph.DefaultTaskPlanExecutor.process(DefaultTaskPlanExecutor.java:23)
>>         at org.gradle.execution.taskgraph.DefaultTaskGraphExecuter.execute(DefaultTaskGraphExecuter.java:88)
>>         at org.gradle.execution.SelectedTaskExecutionAction.execute(SelectedTaskExecutionAction.java:29)
>>         at org.gradle.execution.DefaultBuildExecuter.execute(DefaultBuildExecuter.java:62)
>>         at org.gradle.execution.DefaultBuildExecuter.access$200(DefaultBuildExecuter.java:23)
>>         at org.gradle.execution.DefaultBuildExecuter$2.proceed(DefaultBuildExecuter.java:68)
>>         at org.gradle.execution.DryRunBuildExecutionAction.execute(DryRunBuildExecutionAction.java:32)
>>         at org.gradle.execution.DefaultBuildExecuter.execute(DefaultBuildExecuter.java:62)
>>         at org.gradle.execution.DefaultBuildExecuter.execute(DefaultBuildExecuter.java:55)
>>         at org.gradle.initialization.DefaultGradleLauncher.doBuildStages(DefaultGradleLauncher.java:149)
>>         at org.gradle.initialization.DefaultGradleLauncher.doBuild(DefaultGradleLauncher.java:106)
>>         at org.gradle.initialization.DefaultGradleLauncher.run(DefaultGradleLauncher.java:86)
>>         at org.gradle.launcher.exec.InProcessBuildActionExecuter$DefaultBuildController.run(InProcessBuildActionExecuter.java:80)
>>         at org.gradle.launcher.cli.ExecuteBuildAction.run(ExecuteBuildAction.java:33)
>>         at org.gradle.launcher.cli.ExecuteBuildAction.run(ExecuteBuildAction.java:24)
>>         at org.gradle.launcher.exec.InProcessBuildActionExecuter.execute(InProcessBuildActionExecuter.java:36)
>>         at org.gradle.launcher.exec.InProcessBuildActionExecuter.execute(InProcessBuildActionExecuter.java:26)
>>         at org.gradle.launcher.cli.RunBuildAction.run(RunBuildAction.java:51)
>>         at org.gradle.internal.Actions$RunnableActionAdapter.execute(Actions.java:171)
>>         at org.gradle.launcher.cli.CommandLineActionFactory$ParseAndBuildAction.execute(CommandLineActionFactory.java:237)
>>         at org.gradle.launcher.cli.CommandLineActionFactory$ParseAndBuildAction.execute(CommandLineActionFactory.java:210)
>>         at org.gradle.launcher.cli.JavaRuntimeValidationAction.execute(JavaRuntimeValidationAction.java:35)
>>         at org.gradle.launcher.cli.JavaRuntimeValidationAction.execute(JavaRuntimeValidationAction.java:24)
>>         at org.gradle.launcher.cli.CommandLineActionFactory$WithLogging.execute(CommandLineActionFactory.java:206)
>>         at org.gradle.launcher.cli.CommandLineActionFactory$WithLogging.execute(CommandLineActionFactory.java:169)
>>         at org.gradle.launcher.cli.ExceptionReportingAction.execute(ExceptionReportingAction.java:33)
>>         at org.gradle.launcher.cli.ExceptionReportingAction.execute(ExceptionReportingAction.java:22)
>>         at org.gradle.launcher.Main.doAction(Main.java:33)
>>         at org.gradle.launcher.bootstrap.EntryPoint.run(EntryPoint.java:45)
>>         at org.gradle.launcher.bootstrap.ProcessBootstrap.runNoExit(ProcessBootstrap.java:54)
>>         at org.gradle.launcher.bootstrap.ProcessBootstrap.run(ProcessBootstrap.java:35)
>>         at org.gradle.launcher.GradleMain.main(GradleMain.java:23)
>>         at org.gradle.wrapper.BootstrapMainStarter.start(BootstrapMainStarter.java:30)
>>         at org.gradle.wrapper.WrapperExecutor.execute(WrapperExecutor.java:127)
>>         at org.gradle.wrapper.GradleWrapperMain.main(GradleWrapperMain.java:56)
>> Caused by: org.gradle.api.GradleException: Instruction coverage must be greater than
0.88
>>         at CoverageReportCheck.checkGlobalCoverage(CoverageReportCheck.groovy:64)
>>         at CoverageReportCheck$checkGlobalCoverage.callCurrent(Unknown Source)
>>         at CoverageReportCheck.analyze(CoverageReportCheck.groovy:105)
>>         at org.gradle.internal.reflect.JavaMethod.invoke(JavaMethod.java:63)
>>         at org.gradle.api.internal.project.taskfactory.AnnotationProcessingTaskFactory$StandardTaskAction.doExecute(AnnotationProcessingTaskFactory.java:218)
>>         at org.gradle.api.internal.project.taskfactory.AnnotationProcessingTaskFactory$StandardTaskAction.execute(AnnotationProcessingTaskFactory.java:211)
>>         at org.gradle.api.internal.project.taskfactory.AnnotationProcessingTaskFactory$StandardTaskAction.execute(AnnotationProcessingTaskFactory.java:200)
>>         at org.gradle.api.internal.AbstractTask$TaskActionWrapper.execute(AbstractTask.java:579)
>>         at org.gradle.api.internal.AbstractTask$TaskActionWrapper.execute(AbstractTask.java:562)
>>         at org.gradle.api.internal.tasks.execution.ExecuteActionsTaskExecuter.executeAction(ExecuteActionsTaskExecuter.java:80)
>>         at org.gradle.api.internal.tasks.execution.ExecuteActionsTaskExecuter.executeActions(ExecuteActionsTaskExecuter.java:61)
>>         ... 47 more
>>
>>
>> BUILD FAILED
>>
>> Total time: 4 mins 7.423 secs
>> Build step 'Execute shell' marked build as failure
>> Recording test results

Mime
View raw message