aurora-dev mailing list archives

Site index · List index
Message view « Date » · « Thread »
Top « Date » · « Thread »
From Apache Jenkins Server <jenk...@builds.apache.org>
Subject Build failed in Jenkins: Aurora #670
Date Tue, 21 Oct 2014 20:24:22 GMT
See <https://builds.apache.org/job/Aurora/670/changes>

Changes:

[mchucarroll] Make the large-update check in the client update command consider instance parameters.

------------------------------------------
Started by an SCM change
Building remotely on jenkins-ubuntu-1404-4gb-bdb (jenkins-cloud-4GB Ubuntu ubuntu) in workspace
<https://builds.apache.org/job/Aurora/ws/>
Wiping out workspace first.
Cloning the remote Git repository
Cloning repository https://git-wip-us.apache.org/repos/asf/incubator-aurora.git
 > git init <https://builds.apache.org/job/Aurora/ws/>
Fetching upstream changes from https://git-wip-us.apache.org/repos/asf/incubator-aurora.git
 > git --version
 > git fetch --tags --progress https://git-wip-us.apache.org/repos/asf/incubator-aurora.git
+refs/heads/*:refs/remotes/origin/*
 > git config remote.origin.url https://git-wip-us.apache.org/repos/asf/incubator-aurora.git
 > git config remote.origin.fetch +refs/heads/*:refs/remotes/origin/*
 > git config remote.origin.url https://git-wip-us.apache.org/repos/asf/incubator-aurora.git
Fetching upstream changes from https://git-wip-us.apache.org/repos/asf/incubator-aurora.git
 > git fetch --tags --progress https://git-wip-us.apache.org/repos/asf/incubator-aurora.git
+refs/heads/*:refs/remotes/origin/*
 > git rev-parse origin/master^{commit}
Checking out Revision e17306dc1ac9d19909a4718f9f24ad2c5d299e7b (origin/master)
 > git config core.sparsecheckout
 > git checkout -f e17306dc1ac9d19909a4718f9f24ad2c5d299e7b
 > git rev-list 1a7e66174dc08d9bf7316bb353496b1c8eb91af0
Cleaning workspace
 > git rev-parse --verify HEAD
Resetting working tree
 > git reset --hard
 > git clean -fdx
[Aurora] $ /bin/bash -xe /tmp/hudson5825786485075735957.sh
+ ./build-support/jenkins/build.sh
+ date
Tue Oct 21 20:23:10 UTC 2014
+ ./gradlew -Pq clean build --stacktrace
Downloading https://services.gradle.org/distributions/gradle-2.1-bin.zip
.............................................................................................................................................................................................................................................................................................................................................................................................................................................................................................................................................................................................................................................................................................................................................................................................................................................................................................................................................................................................................................................................................................................................................................................................................................................................................................................................................................................................................................................................................................................................................................................................................................................................................................................................................................................................................................................................................................................................................................................................................................................................................................................................................................
Unzipping /home/jenkins/.gradle/wrapper/dists/gradle-2.1-bin/2pk0g2l49n2sbne636fhtlet6a/gradle-2.1-bin.zip
to /home/jenkins/.gradle/wrapper/dists/gradle-2.1-bin/2pk0g2l49n2sbne636fhtlet6a
Set executable permissions for: /home/jenkins/.gradle/wrapper/dists/gradle-2.1-bin/2pk0g2l49n2sbne636fhtlet6a/gradle-2.1/bin/gradle
:buildSrc:clean UP-TO-DATE
:buildSrc:compileJava UP-TO-DATE
:buildSrc:compileGroovy
:buildSrc:processResources UP-TO-DATE
:buildSrc:classes
:buildSrc:jar
:buildSrc:assemble
:buildSrc:compileTestJava UP-TO-DATE
:buildSrc:compileTestGroovy UP-TO-DATE
:buildSrc:processTestResources UP-TO-DATE
:buildSrc:testClasses UP-TO-DATE
:buildSrc:test UP-TO-DATE
:buildSrc:check UP-TO-DATE
:buildSrc:build
Download https://jcenter.bintray.com/com/eriwen/gradle-js-plugin/1.12.1/gradle-js-plugin-1.12.1.pom
Download https://jcenter.bintray.com/com/github/ben-manes/gradle-versions-plugin/0.5/gradle-versions-plugin-0.5.pom
Download https://jcenter.bintray.com/nl/javadude/gradle/plugins/license-gradle-plugin/0.11.0/license-gradle-plugin-0.11.0.pom
Download https://jcenter.bintray.com/com/google/javascript/closure-compiler/v20131014/closure-compiler-v20131014.pom
Download https://jcenter.bintray.com/io/jdev/html2js/html2js/0.1/html2js-0.1.pom
Download https://jcenter.bintray.com/com/thoughtworks/xstream/xstream/1.4.7/xstream-1.4.7.pom
Download https://jcenter.bintray.com/com/thoughtworks/xstream/xstream-parent/1.4.7/xstream-parent-1.4.7.pom
Download https://jcenter.bintray.com/org/codehaus/codehaus-parent/3/codehaus-parent-3.pom
Download https://jcenter.bintray.com/com/mycila/maven-license-plugin/maven-license-plugin/1.10.b1/maven-license-plugin-1.10.b1.pom
Download https://jcenter.bintray.com/com/mycila/parent-pom/5/parent-pom-5.pom
Download https://jcenter.bintray.com/com/google/guava/guava/17.0/guava-17.0.pom
Download https://jcenter.bintray.com/com/google/guava/guava-parent/17.0/guava-parent-17.0.pom
Download https://jcenter.bintray.com/org/sonatype/oss/oss-parent/7/oss-parent-7.pom
Download https://jcenter.bintray.com/args4j/args4j/2.0.16/args4j-2.0.16.pom
Download https://jcenter.bintray.com/args4j/args4j-site/2.0.16/args4j-site-2.0.16.pom
Download https://jcenter.bintray.com/com/google/protobuf/protobuf-java/2.4.1/protobuf-java-2.4.1.pom
Download https://jcenter.bintray.com/com/google/google/1/google-1.pom
Download https://jcenter.bintray.com/org/json/json/20090211/json-20090211.pom
Download https://jcenter.bintray.com/com/google/code/findbugs/jsr305/1.3.9/jsr305-1.3.9.pom
Download https://jcenter.bintray.com/xmlpull/xmlpull/1.1.3.1/xmlpull-1.1.3.1.pom
Download https://jcenter.bintray.com/xpp3/xpp3_min/1.1.4c/xpp3_min-1.1.4c.pom
Download https://jcenter.bintray.com/org/apache/maven/maven-plugin-api/3.0.1/maven-plugin-api-3.0.1.pom
Download https://jcenter.bintray.com/org/apache/maven/maven/3.0.1/maven-3.0.1.pom
Download https://jcenter.bintray.com/org/apache/maven/maven-parent/15/maven-parent-15.pom
Download https://jcenter.bintray.com/org/apache/apache/6/apache-6.pom
Download https://jcenter.bintray.com/com/mycila/xmltool/xmltool/3.3/xmltool-3.3.pom
Download https://jcenter.bintray.com/org/apache/maven/maven-project/3.0-alpha-2/maven-project-3.0-alpha-2.pom
Download https://jcenter.bintray.com/org/apache/maven/maven/3.0-alpha-2/maven-3.0-alpha-2.pom
Download https://jcenter.bintray.com/org/apache/maven/maven-parent/10/maven-parent-10.pom
Download https://jcenter.bintray.com/org/apache/apache/4/apache-4.pom
Download https://jcenter.bintray.com/org/codehaus/plexus/plexus-utils/2.0.5/plexus-utils-2.0.5.pom
Download https://jcenter.bintray.com/org/codehaus/plexus/plexus/2.0.6/plexus-2.0.6.pom
Download https://jcenter.bintray.com/org/apache/maven/maven-model/3.0.1/maven-model-3.0.1.pom
Download https://jcenter.bintray.com/org/apache/maven/maven-artifact/3.0.1/maven-artifact-3.0.1.pom
Download https://jcenter.bintray.com/org/sonatype/sisu/sisu-inject-plexus/1.4.3.1/sisu-inject-plexus-1.4.3.1.pom
Download https://jcenter.bintray.com/org/sonatype/sisu/inject/guice-plexus/1.4.3.1/guice-plexus-1.4.3.1.pom
Download https://jcenter.bintray.com/org/sonatype/sisu/inject/guice-bean/1.4.3.1/guice-bean-1.4.3.1.pom
Download https://jcenter.bintray.com/org/sonatype/sisu/sisu-inject/1.4.3.1/sisu-inject-1.4.3.1.pom
Download https://jcenter.bintray.com/org/sonatype/sisu/sisu-parent/1.4.3.1/sisu-parent-1.4.3.1.pom
Download https://jcenter.bintray.com/org/sonatype/forge/forge-parent/6/forge-parent-6.pom
Download https://jcenter.bintray.com/org/codehaus/plexus/plexus-interpolation/1.1/plexus-interpolation-1.1.pom
Download https://jcenter.bintray.com/org/codehaus/plexus/plexus/1.0.11/plexus-1.0.11.pom
Download https://jcenter.bintray.com/org/apache/maven/maven-compat/3.0-alpha-2/maven-compat-3.0-alpha-2.pom
Download https://jcenter.bintray.com/org/codehaus/plexus/plexus-container-default/1.0-beta-3.0.5/plexus-container-default-1.0-beta-3.0.5.pom
Download https://jcenter.bintray.com/org/codehaus/plexus/plexus-containers/1.0-beta-3.0.5/plexus-containers-1.0-beta-3.0.5.pom
Download https://jcenter.bintray.com/org/codehaus/plexus/plexus/2.0.2/plexus-2.0.2.pom
Download https://jcenter.bintray.com/org/codehaus/woodstox/wstx-asl/3.2.6/wstx-asl-3.2.6.pom
Download https://jcenter.bintray.com/org/sonatype/spice/model-builder/1.3/model-builder-1.3.pom
Download https://jcenter.bintray.com/org/sonatype/spice/spice-parent/10/spice-parent-10.pom
Download https://jcenter.bintray.com/org/sonatype/forge/forge-parent/3/forge-parent-3.pom
Download https://jcenter.bintray.com/org/apache/maven/maven-project-builder/3.0-alpha-2/maven-project-builder-3.0-alpha-2.pom
Download https://jcenter.bintray.com/org/codehaus/plexus/plexus-component-annotations/1.5.5/plexus-component-annotations-1.5.5.pom
Download https://jcenter.bintray.com/org/codehaus/plexus/plexus-containers/1.5.5/plexus-containers-1.5.5.pom
Download https://jcenter.bintray.com/org/codehaus/plexus/plexus/2.0.7/plexus-2.0.7.pom
Download https://jcenter.bintray.com/org/codehaus/plexus/plexus-classworlds/2.2.3/plexus-classworlds-2.2.3.pom
Download https://jcenter.bintray.com/org/sonatype/sisu/sisu-inject-bean/1.4.3.1/sisu-inject-bean-1.4.3.1.pom
Download https://jcenter.bintray.com/org/apache/maven/wagon/wagon-provider-api/1.0-beta-4/wagon-provider-api-1.0-beta-4.pom
Download https://jcenter.bintray.com/org/apache/maven/wagon/wagon/1.0-beta-4/wagon-1.0-beta-4.pom
Download https://jcenter.bintray.com/org/apache/maven/maven-parent/8/maven-parent-8.pom
Download https://jcenter.bintray.com/org/apache/xbean/xbean-reflect/3.4/xbean-reflect-3.4.pom
Download https://jcenter.bintray.com/org/apache/xbean/xbean/3.4/xbean-3.4.pom
Download https://jcenter.bintray.com/com/google/code/google-collections/google-collect/snapshot-20080530/google-collect-snapshot-20080530.pom
Download https://jcenter.bintray.com/stax/stax-api/1.0.1/stax-api-1.0.1.pom
Download https://jcenter.bintray.com/org/sonatype/sisu/sisu-guice/2.9.1/sisu-guice-2.9.1.pom
Download https://jcenter.bintray.com/org/sonatype/sisu/inject/guice-parent/2.9.1/guice-parent-2.9.1.pom
Download https://jcenter.bintray.com/log4j/log4j/1.2.12/log4j-1.2.12.pom
Download https://jcenter.bintray.com/commons-logging/commons-logging-api/1.1/commons-logging-api-1.1.pom
Download https://jcenter.bintray.com/com/eriwen/gradle-js-plugin/1.12.1/gradle-js-plugin-1.12.1.jar
Download https://jcenter.bintray.com/com/github/ben-manes/gradle-versions-plugin/0.5/gradle-versions-plugin-0.5.jar
Download https://jcenter.bintray.com/nl/javadude/gradle/plugins/license-gradle-plugin/0.11.0/license-gradle-plugin-0.11.0.jar
Download https://jcenter.bintray.com/com/google/javascript/closure-compiler/v20131014/closure-compiler-v20131014.jar
Download https://jcenter.bintray.com/io/jdev/html2js/html2js/0.1/html2js-0.1.jar
Download https://jcenter.bintray.com/com/thoughtworks/xstream/xstream/1.4.7/xstream-1.4.7.jar
Download https://jcenter.bintray.com/com/mycila/maven-license-plugin/maven-license-plugin/1.10.b1/maven-license-plugin-1.10.b1.jar
Download https://jcenter.bintray.com/com/google/guava/guava/17.0/guava-17.0.jar
Download https://jcenter.bintray.com/args4j/args4j/2.0.16/args4j-2.0.16.jar
Download https://jcenter.bintray.com/com/google/protobuf/protobuf-java/2.4.1/protobuf-java-2.4.1.jar
Download https://jcenter.bintray.com/org/json/json/20090211/json-20090211.jar
Download https://jcenter.bintray.com/com/google/code/findbugs/jsr305/1.3.9/jsr305-1.3.9.jar
Download https://jcenter.bintray.com/xmlpull/xmlpull/1.1.3.1/xmlpull-1.1.3.1.jar
Download https://jcenter.bintray.com/xpp3/xpp3_min/1.1.4c/xpp3_min-1.1.4c.jar
Download https://jcenter.bintray.com/org/apache/maven/maven-plugin-api/3.0.1/maven-plugin-api-3.0.1.jar
Download https://jcenter.bintray.com/com/mycila/xmltool/xmltool/3.3/xmltool-3.3.jar
Download https://jcenter.bintray.com/org/apache/maven/maven-project/3.0-alpha-2/maven-project-3.0-alpha-2.jar
Download https://jcenter.bintray.com/org/codehaus/plexus/plexus-utils/2.0.5/plexus-utils-2.0.5.jar
Download https://jcenter.bintray.com/org/apache/maven/maven-model/3.0.1/maven-model-3.0.1.jar
Download https://jcenter.bintray.com/org/apache/maven/maven-artifact/3.0.1/maven-artifact-3.0.1.jar
Download https://jcenter.bintray.com/org/sonatype/sisu/sisu-inject-plexus/1.4.3.1/sisu-inject-plexus-1.4.3.1.jar
Download https://jcenter.bintray.com/org/codehaus/plexus/plexus-interpolation/1.1/plexus-interpolation-1.1.jar
Download https://jcenter.bintray.com/org/apache/maven/maven-compat/3.0-alpha-2/maven-compat-3.0-alpha-2.jar
Download https://jcenter.bintray.com/org/codehaus/plexus/plexus-container-default/1.0-beta-3.0.5/plexus-container-default-1.0-beta-3.0.5.jar
Download https://jcenter.bintray.com/org/codehaus/woodstox/wstx-asl/3.2.6/wstx-asl-3.2.6.jar
Download https://jcenter.bintray.com/org/sonatype/spice/model-builder/1.3/model-builder-1.3.jar
Download https://jcenter.bintray.com/org/apache/maven/maven-project-builder/3.0-alpha-2/maven-project-builder-3.0-alpha-2.jar
Download https://jcenter.bintray.com/org/codehaus/plexus/plexus-component-annotations/1.5.5/plexus-component-annotations-1.5.5.jar
Download https://jcenter.bintray.com/org/codehaus/plexus/plexus-classworlds/2.2.3/plexus-classworlds-2.2.3.jar
Download https://jcenter.bintray.com/org/sonatype/sisu/sisu-inject-bean/1.4.3.1/sisu-inject-bean-1.4.3.1.jar
Download https://jcenter.bintray.com/org/apache/maven/wagon/wagon-provider-api/1.0-beta-4/wagon-provider-api-1.0-beta-4.jar
Download https://jcenter.bintray.com/org/apache/xbean/xbean-reflect/3.4/xbean-reflect-3.4.jar
Download https://jcenter.bintray.com/com/google/code/google-collections/google-collect/snapshot-20080530/google-collect-snapshot-20080530.jar
Download https://jcenter.bintray.com/stax/stax-api/1.0.1/stax-api-1.0.1.jar
Download https://jcenter.bintray.com/org/sonatype/sisu/sisu-guice/2.9.1/sisu-guice-2.9.1-noaop.jar
Download https://jcenter.bintray.com/log4j/log4j/1.2.12/log4j-1.2.12.jar
Download https://jcenter.bintray.com/commons-logging/commons-logging-api/1.1/commons-logging-api-1.1.jar
:clean
:bootstrapThrift
gzip: stdin: not in gzip format
tar: Child returned status 1
tar: Error is not recoverable: exiting now
make: *** [thrift-0.9.1/compiler/cpp/thrift] Error 2
 FAILED

FAILURE: Build failed with an exception.

* Where:
Build file '<https://builds.apache.org/job/Aurora/ws/build.gradle'> line: 391

* What went wrong:
Execution failed for task ':bootstrapThrift'.
> Process 'command 'make'' finished with non-zero exit value 2

* Try:
Run with --info or --debug option to get more log output.

* Exception is:
org.gradle.api.tasks.TaskExecutionException: Execution failed for task ':bootstrapThrift'.
	at org.gradle.api.internal.tasks.execution.ExecuteActionsTaskExecuter.executeActions(ExecuteActionsTaskExecuter.java:69)
	at org.gradle.api.internal.tasks.execution.ExecuteActionsTaskExecuter.execute(ExecuteActionsTaskExecuter.java:46)
	at org.gradle.api.internal.tasks.execution.PostExecutionAnalysisTaskExecuter.execute(PostExecutionAnalysisTaskExecuter.java:35)
	at org.gradle.api.internal.tasks.execution.SkipUpToDateTaskExecuter.execute(SkipUpToDateTaskExecuter.java:64)
	at org.gradle.api.internal.tasks.execution.ValidatingTaskExecuter.execute(ValidatingTaskExecuter.java:58)
	at org.gradle.api.internal.tasks.execution.SkipEmptySourceFilesTaskExecuter.execute(SkipEmptySourceFilesTaskExecuter.java:42)
	at org.gradle.api.internal.tasks.execution.SkipTaskWithNoActionsExecuter.execute(SkipTaskWithNoActionsExecuter.java:52)
	at org.gradle.api.internal.tasks.execution.SkipOnlyIfTaskExecuter.execute(SkipOnlyIfTaskExecuter.java:53)
	at org.gradle.api.internal.tasks.execution.ExecuteAtMostOnceTaskExecuter.execute(ExecuteAtMostOnceTaskExecuter.java:43)
	at org.gradle.api.internal.AbstractTask.executeWithoutThrowingTaskFailure(AbstractTask.java:305)
	at org.gradle.execution.taskgraph.AbstractTaskPlanExecutor$TaskExecutorWorker.executeTask(AbstractTaskPlanExecutor.java:79)
	at org.gradle.execution.taskgraph.AbstractTaskPlanExecutor$TaskExecutorWorker.processTask(AbstractTaskPlanExecutor.java:63)
	at org.gradle.execution.taskgraph.AbstractTaskPlanExecutor$TaskExecutorWorker.run(AbstractTaskPlanExecutor.java:51)
	at org.gradle.execution.taskgraph.DefaultTaskPlanExecutor.process(DefaultTaskPlanExecutor.java:23)
	at org.gradle.execution.taskgraph.DefaultTaskGraphExecuter.execute(DefaultTaskGraphExecuter.java:88)
	at org.gradle.execution.SelectedTaskExecutionAction.execute(SelectedTaskExecutionAction.java:29)
	at org.gradle.execution.DefaultBuildExecuter.execute(DefaultBuildExecuter.java:62)
	at org.gradle.execution.DefaultBuildExecuter.access$200(DefaultBuildExecuter.java:23)
	at org.gradle.execution.DefaultBuildExecuter$2.proceed(DefaultBuildExecuter.java:68)
	at org.gradle.execution.DryRunBuildExecutionAction.execute(DryRunBuildExecutionAction.java:32)
	at org.gradle.execution.DefaultBuildExecuter.execute(DefaultBuildExecuter.java:62)
	at org.gradle.execution.DefaultBuildExecuter.execute(DefaultBuildExecuter.java:55)
	at org.gradle.initialization.DefaultGradleLauncher.doBuildStages(DefaultGradleLauncher.java:149)
	at org.gradle.initialization.DefaultGradleLauncher.doBuild(DefaultGradleLauncher.java:106)
	at org.gradle.initialization.DefaultGradleLauncher.run(DefaultGradleLauncher.java:86)
	at org.gradle.launcher.exec.InProcessBuildActionExecuter$DefaultBuildController.run(InProcessBuildActionExecuter.java:80)
	at org.gradle.launcher.cli.ExecuteBuildAction.run(ExecuteBuildAction.java:33)
	at org.gradle.launcher.cli.ExecuteBuildAction.run(ExecuteBuildAction.java:24)
	at org.gradle.launcher.exec.InProcessBuildActionExecuter.execute(InProcessBuildActionExecuter.java:36)
	at org.gradle.launcher.exec.InProcessBuildActionExecuter.execute(InProcessBuildActionExecuter.java:26)
	at org.gradle.launcher.cli.RunBuildAction.run(RunBuildAction.java:51)
	at org.gradle.internal.Actions$RunnableActionAdapter.execute(Actions.java:171)
	at org.gradle.launcher.cli.CommandLineActionFactory$ParseAndBuildAction.execute(CommandLineActionFactory.java:237)
	at org.gradle.launcher.cli.CommandLineActionFactory$ParseAndBuildAction.execute(CommandLineActionFactory.java:210)
	at org.gradle.launcher.cli.JavaRuntimeValidationAction.execute(JavaRuntimeValidationAction.java:35)
	at org.gradle.launcher.cli.JavaRuntimeValidationAction.execute(JavaRuntimeValidationAction.java:24)
	at org.gradle.launcher.cli.CommandLineActionFactory$WithLogging.execute(CommandLineActionFactory.java:206)
	at org.gradle.launcher.cli.CommandLineActionFactory$WithLogging.execute(CommandLineActionFactory.java:169)
	at org.gradle.launcher.cli.ExceptionReportingAction.execute(ExceptionReportingAction.java:33)
	at org.gradle.launcher.cli.ExceptionReportingAction.execute(ExceptionReportingAction.java:22)
	at org.gradle.launcher.Main.doAction(Main.java:33)
	at org.gradle.launcher.bootstrap.EntryPoint.run(EntryPoint.java:45)
	at org.gradle.launcher.bootstrap.ProcessBootstrap.runNoExit(ProcessBootstrap.java:54)
	at org.gradle.launcher.bootstrap.ProcessBootstrap.run(ProcessBootstrap.java:35)
	at org.gradle.launcher.GradleMain.main(GradleMain.java:23)
	at org.gradle.wrapper.BootstrapMainStarter.start(BootstrapMainStarter.java:30)
	at org.gradle.wrapper.WrapperExecutor.execute(WrapperExecutor.java:127)
	at org.gradle.wrapper.GradleWrapperMain.main(GradleWrapperMain.java:56)
Caused by: org.gradle.process.internal.ExecException: Process 'command 'make'' finished with
non-zero exit value 2
	at org.gradle.process.internal.DefaultExecHandle$ExecResultImpl.assertNormalExitValue(DefaultExecHandle.java:365)
	at org.gradle.process.internal.DefaultExecAction.execute(DefaultExecAction.java:31)
	at org.gradle.api.internal.file.DefaultFileOperations.exec(DefaultFileOperations.java:164)
	at org.gradle.api.internal.project.AbstractProject.exec(AbstractProject.java:797)
	at org.gradle.groovy.scripts.DefaultScript.exec(DefaultScript.java:186)
	at build_4v9fngqjcu0rnrnjre3iugaicd$_run_closure17_closure51.doCall(<https://builds.apache.org/job/Aurora/ws/build.gradle>:391)
	at org.gradle.api.internal.AbstractTask$ClosureTaskAction.execute(AbstractTask.java:548)
	at org.gradle.api.internal.AbstractTask$ClosureTaskAction.execute(AbstractTask.java:529)
	at org.gradle.api.internal.tasks.execution.ExecuteActionsTaskExecuter.executeAction(ExecuteActionsTaskExecuter.java:80)
	at org.gradle.api.internal.tasks.execution.ExecuteActionsTaskExecuter.executeActions(ExecuteActionsTaskExecuter.java:61)
	... 47 more


BUILD FAILED

Total time: 54.983 secs
Build step 'Execute shell' marked build as failure
Recording test results

Mime
View raw message