aurora-dev mailing list archives

Site index · List index
Message view « Date » · « Thread »
Top « Date » · « Thread »
From Kevin Sweeney <kevi...@apache.org>
Subject Re: Build failed in Jenkins: Aurora #553
Date Fri, 12 Sep 2014 23:48:41 GMT
Sorry about this, working on a fix now.

On Fri, Sep 12, 2014 at 4:41 PM, Apache Jenkins Server <
jenkins@builds.apache.org> wrote:

> See <https://builds.apache.org/job/Aurora/553/changes>
>
> Changes:
>
> [kevints] Use a ServletContextListener to configure servlets
>
> ------------------------------------------
> Started by an SCM change
> Building remotely on ubuntu-2 (Ubuntu ubuntu) in workspace <
> https://builds.apache.org/job/Aurora/ws/>
> Wiping out workspace first.
> Cloning the remote Git repository
> Cloning repository
> https://git-wip-us.apache.org/repos/asf/incubator-aurora.git
>  > git init <https://builds.apache.org/job/Aurora/ws/>
> Fetching upstream changes from
> https://git-wip-us.apache.org/repos/asf/incubator-aurora.git
>  > git --version
>  > git fetch --tags --progress
> https://git-wip-us.apache.org/repos/asf/incubator-aurora.git
> +refs/heads/*:refs/remotes/origin/*
>  > git config remote.origin.url
> https://git-wip-us.apache.org/repos/asf/incubator-aurora.git
>  > git config remote.origin.fetch +refs/heads/*:refs/remotes/origin/*
>  > git config remote.origin.url
> https://git-wip-us.apache.org/repos/asf/incubator-aurora.git
> Fetching upstream changes from
> https://git-wip-us.apache.org/repos/asf/incubator-aurora.git
>  > git fetch --tags --progress
> https://git-wip-us.apache.org/repos/asf/incubator-aurora.git
> +refs/heads/*:refs/remotes/origin/*
>  > git rev-parse origin/master^{commit}
> Checking out Revision b0f9f853edc3bd057742aefc853d5c126bd2dc3a
> (origin/master)
>  > git config core.sparsecheckout
>  > git checkout -f b0f9f853edc3bd057742aefc853d5c126bd2dc3a
>  > git rev-list e42f4f0469f10dd02c24fcb373b56a120394e90e
> Cleaning workspace
>  > git rev-parse --verify HEAD
> Resetting working tree
>  > git reset --hard
>  > git clean -fdx
> [Aurora] $ /bin/bash -xe /tmp/hudson5521050042803649262.sh
> + ./build-support/jenkins/build.sh
> + date
> Fri Sep 12 23:39:35 UTC 2014
> + ./gradlew -Pq clean build --stacktrace
> :clean
> :about
> :bootstrapThriftsrc/thrift/transport/TFileTransport.cpp: In member
> function 'void apache::thrift::transport::TFileTransport::writerThread()':
> src/thrift/transport/TFileTransport.cpp:317:30: warning: ignoring return
> value of 'int ftruncate(int, __off_t)', declared with attribute
> warn_unused_result [-Wunused-result]
>        ftruncate(fd_, offset_);
>                               ^
> src/Transport/THttpClient.cs(43,32): warning CS0414: The private field
> `Thrift.Transport.THttpClient.connection' is assigned but its value is
> never used
>
> :checkPython
> :generateSources
> :compileGeneratedJavaNote: Some input files use unchecked or unsafe
> operations.
> Note: Recompile with -Xlint:unchecked for details.
>
> :processGeneratedResources UP-TO-DATE
> :generatedClasses
> :compileJavaNote: Writing <
> https://builds.apache.org/job/Aurora/ws/dist/classes/main/com/twitter/common/args/apt/cmdline.arg.info.txt.2
> >
>
> :processResources
> :classes
> :jar
> :assemble
> :jsHint
> :checkstyleMain[ant:checkstyle] <
> https://builds.apache.org/job/Aurora/ws/src/main/java/org/apache/aurora/scheduler/http/JettyServerModule.java>:85:
> 'com.sun.jersey.api.core.ResourceConfig.PROPERTY_CONTAINER_REQUEST_FILTERS'
> should be separated from previous imports.
>  FAILED
>
> FAILURE: Build failed with an exception.
>
> * What went wrong:
> Execution failed for task ':checkstyleMain'.
> > Checkstyle rule violations were found. See the report at: file://<
> https://builds.apache.org/job/Aurora/ws/dist/reports/checkstyle/main.xml>
>
> * Try:
> Run with --info or --debug option to get more log output.
>
> * Exception is:
> org.gradle.api.tasks.TaskExecutionException: Execution failed for task
> ':checkstyleMain'.
>         at
> org.gradle.api.internal.tasks.execution.ExecuteActionsTaskExecuter.executeActions(ExecuteActionsTaskExecuter.java:69)
>         at
> org.gradle.api.internal.tasks.execution.ExecuteActionsTaskExecuter.execute(ExecuteActionsTaskExecuter.java:46)
>         at
> org.gradle.api.internal.tasks.execution.PostExecutionAnalysisTaskExecuter.execute(PostExecutionAnalysisTaskExecuter.java:35)
>         at
> org.gradle.api.internal.tasks.execution.SkipUpToDateTaskExecuter.execute(SkipUpToDateTaskExecuter.java:64)
>         at
> org.gradle.api.internal.tasks.execution.ValidatingTaskExecuter.execute(ValidatingTaskExecuter.java:58)
>         at
> org.gradle.api.internal.tasks.execution.SkipEmptySourceFilesTaskExecuter.execute(SkipEmptySourceFilesTaskExecuter.java:42)
>         at
> org.gradle.api.internal.tasks.execution.SkipTaskWithNoActionsExecuter.execute(SkipTaskWithNoActionsExecuter.java:52)
>         at
> org.gradle.api.internal.tasks.execution.SkipOnlyIfTaskExecuter.execute(SkipOnlyIfTaskExecuter.java:53)
>         at
> org.gradle.api.internal.tasks.execution.ExecuteAtMostOnceTaskExecuter.execute(ExecuteAtMostOnceTaskExecuter.java:43)
>         at
> org.gradle.api.internal.AbstractTask.executeWithoutThrowingTaskFailure(AbstractTask.java:289)
>         at
> org.gradle.execution.taskgraph.AbstractTaskPlanExecutor$TaskExecutorWorker.executeTask(AbstractTaskPlanExecutor.java:79)
>         at
> org.gradle.execution.taskgraph.AbstractTaskPlanExecutor$TaskExecutorWorker.processTask(AbstractTaskPlanExecutor.java:63)
>         at
> org.gradle.execution.taskgraph.AbstractTaskPlanExecutor$TaskExecutorWorker.run(AbstractTaskPlanExecutor.java:51)
>         at
> org.gradle.execution.taskgraph.DefaultTaskPlanExecutor.process(DefaultTaskPlanExecutor.java:23)
>         at
> org.gradle.execution.taskgraph.DefaultTaskGraphExecuter.execute(DefaultTaskGraphExecuter.java:86)
>         at
> org.gradle.execution.SelectedTaskExecutionAction.execute(SelectedTaskExecutionAction.java:29)
>         at
> org.gradle.execution.DefaultBuildExecuter.execute(DefaultBuildExecuter.java:61)
>         at
> org.gradle.execution.DefaultBuildExecuter.access$200(DefaultBuildExecuter.java:23)
>         at
> org.gradle.execution.DefaultBuildExecuter$2.proceed(DefaultBuildExecuter.java:67)
>         at
> org.gradle.execution.DryRunBuildExecutionAction.execute(DryRunBuildExecutionAction.java:32)
>         at
> org.gradle.execution.DefaultBuildExecuter.execute(DefaultBuildExecuter.java:61)
>         at
> org.gradle.execution.DefaultBuildExecuter.execute(DefaultBuildExecuter.java:54)
>         at
> org.gradle.initialization.DefaultGradleLauncher.doBuildStages(DefaultGradleLauncher.java:166)
>         at
> org.gradle.initialization.DefaultGradleLauncher.doBuild(DefaultGradleLauncher.java:113)
>         at
> org.gradle.initialization.DefaultGradleLauncher.run(DefaultGradleLauncher.java:81)
>         at
> org.gradle.launcher.exec.InProcessBuildActionExecuter$DefaultBuildController.run(InProcessBuildActionExecuter.java:64)
>         at
> org.gradle.launcher.cli.ExecuteBuildAction.run(ExecuteBuildAction.java:33)
>         at
> org.gradle.launcher.cli.ExecuteBuildAction.run(ExecuteBuildAction.java:24)
>         at
> org.gradle.launcher.exec.InProcessBuildActionExecuter.execute(InProcessBuildActionExecuter.java:35)
>         at
> org.gradle.launcher.exec.InProcessBuildActionExecuter.execute(InProcessBuildActionExecuter.java:26)
>         at
> org.gradle.launcher.cli.RunBuildAction.run(RunBuildAction.java:50)
>         at
> org.gradle.internal.Actions$RunnableActionAdapter.execute(Actions.java:171)
>         at
> org.gradle.launcher.cli.CommandLineActionFactory$ParseAndBuildAction.execute(CommandLineActionFactory.java:201)
>         at
> org.gradle.launcher.cli.CommandLineActionFactory$ParseAndBuildAction.execute(CommandLineActionFactory.java:174)
>         at
> org.gradle.launcher.cli.CommandLineActionFactory$WithLogging.execute(CommandLineActionFactory.java:170)
>         at
> org.gradle.launcher.cli.CommandLineActionFactory$WithLogging.execute(CommandLineActionFactory.java:139)
>         at
> org.gradle.launcher.cli.ExceptionReportingAction.execute(ExceptionReportingAction.java:33)
>         at
> org.gradle.launcher.cli.ExceptionReportingAction.execute(ExceptionReportingAction.java:22)
>         at org.gradle.launcher.Main.doAction(Main.java:46)
>         at org.gradle.launcher.bootstrap.EntryPoint.run(EntryPoint.java:45)
>         at org.gradle.launcher.Main.main(Main.java:37)
>         at
> org.gradle.launcher.bootstrap.ProcessBootstrap.runNoExit(ProcessBootstrap.java:50)
>         at
> org.gradle.launcher.bootstrap.ProcessBootstrap.run(ProcessBootstrap.java:32)
>         at org.gradle.launcher.GradleMain.main(GradleMain.java:23)
>         at
> org.gradle.wrapper.BootstrapMainStarter.start(BootstrapMainStarter.java:30)
>         at
> org.gradle.wrapper.WrapperExecutor.execute(WrapperExecutor.java:127)
>         at
> org.gradle.wrapper.GradleWrapperMain.main(GradleWrapperMain.java:55)
> Caused by: org.gradle.api.GradleException: Checkstyle rule violations were
> found. See the report at: file://<
> https://builds.apache.org/job/Aurora/ws/dist/reports/checkstyle/main.xml>
>         at
> org.gradle.api.plugins.quality.Checkstyle$_run_closure1.doCall(Checkstyle.groovy:187)
>         at
> org.gradle.api.internal.ClosureBackedAction.execute(ClosureBackedAction.java:58)
>         at org.gradle.util.ConfigureUtil.configure(ConfigureUtil.java:130)
>         at org.gradle.util.ConfigureUtil.configure(ConfigureUtil.java:91)
>         at org.gradle.util.ConfigureUtil$configure.call(Unknown Source)
>         at
> org.gradle.api.internal.project.DefaultIsolatedAntBuilder.execute(DefaultIsolatedAntBuilder.groovy:116)
>         at
> org.gradle.api.internal.project.IsolatedAntBuilder$execute.call(Unknown
> Source)
>         at
> org.gradle.api.plugins.quality.Checkstyle.run(Checkstyle.groovy:159)
>         at
> org.gradle.internal.reflect.JavaMethod.invoke(JavaMethod.java:63)
>         at
> org.gradle.api.internal.project.taskfactory.AnnotationProcessingTaskFactory$StandardTaskAction.doExecute(AnnotationProcessingTaskFactory.java:219)
>         at
> org.gradle.api.internal.project.taskfactory.AnnotationProcessingTaskFactory$StandardTaskAction.execute(AnnotationProcessingTaskFactory.java:212)
>         at
> org.gradle.api.internal.project.taskfactory.AnnotationProcessingTaskFactory$StandardTaskAction.execute(AnnotationProcessingTaskFactory.java:201)
>         at
> org.gradle.api.internal.AbstractTask$TaskActionWrapper.execute(AbstractTask.java:533)
>         at
> org.gradle.api.internal.AbstractTask$TaskActionWrapper.execute(AbstractTask.java:516)
>         at
> org.gradle.api.internal.tasks.execution.ExecuteActionsTaskExecuter.executeAction(ExecuteActionsTaskExecuter.java:80)
>         at
> org.gradle.api.internal.tasks.execution.ExecuteActionsTaskExecuter.executeActions(ExecuteActionsTaskExecuter.java:61)
>         ... 46 more
>
>
> BUILD FAILED
>
> Total time: 2 mins 24.383 secs
> Build step 'Execute shell' marked build as failure
> Recording test results
>

Mime
  • Unnamed multipart/alternative (inline, None, 0 bytes)
View raw message