aurora-dev mailing list archives

Site index · List index
Message view « Date » · « Thread »
Top « Date » · « Thread »
From Apache Jenkins Server <jenk...@builds.apache.org>
Subject Build failed in Jenkins: Aurora #525
Date Wed, 03 Sep 2014 16:25:37 GMT
See <https://builds.apache.org/job/Aurora/525/changes>

Changes:

[wfarner] Add a separate main class that runs the scheduler in local mode.

------------------------------------------
Started by an SCM change
Building remotely on H10 (Ubuntu ubuntu) in workspace <https://builds.apache.org/job/Aurora/ws/>
Wiping out workspace first.
Cloning the remote Git repository
Cloning repository https://git-wip-us.apache.org/repos/asf/incubator-aurora.git
 > git init <https://builds.apache.org/job/Aurora/ws/>
Fetching upstream changes from https://git-wip-us.apache.org/repos/asf/incubator-aurora.git
 > git --version
 > git fetch --tags --progress https://git-wip-us.apache.org/repos/asf/incubator-aurora.git
+refs/heads/*:refs/remotes/origin/*
 > git config remote.origin.url https://git-wip-us.apache.org/repos/asf/incubator-aurora.git
 > git config remote.origin.fetch +refs/heads/*:refs/remotes/origin/*
 > git config remote.origin.url https://git-wip-us.apache.org/repos/asf/incubator-aurora.git
Fetching upstream changes from https://git-wip-us.apache.org/repos/asf/incubator-aurora.git
 > git fetch --tags --progress https://git-wip-us.apache.org/repos/asf/incubator-aurora.git
+refs/heads/*:refs/remotes/origin/*
 > git rev-parse origin/master^{commit}
Checking out Revision 417cb169cc18bda39c0057851a0f1b7efecedef8 (origin/master)
 > git config core.sparsecheckout
 > git checkout -f 417cb169cc18bda39c0057851a0f1b7efecedef8
 > git rev-list d64f5a353cb486948e7e7a3e6b80850a4f917c3a
Cleaning workspace
 > git rev-parse --verify HEAD
Resetting working tree
 > git reset --hard
 > git clean -fdx
[Aurora] $ /bin/bash -xe /tmp/hudson4137805029349311171.sh
+ ./build-support/jenkins/build.sh
+ date
Wed Sep  3 16:23:08 UTC 2014
+ ./gradlew -Pq clean build --stacktrace
Downloading https://services.gradle.org/distributions/gradle-1.12-bin.zip
........................................................................................................................................................................................................................................................................................................................................................................................................................................................................................................................................................................................................................................................................................................................................................................................................................................................................................................................................................................................................................................................................................................................................................................................................................................................................................................................................................................................................................................................................................................................................................................................................................................................................................................................................................................................................................................................................................................................................................................................................................................................................................................................................................................................
Unzipping /home/jenkins/.gradle/wrapper/dists/gradle-1.12-bin/2qvnajdoo11hasdfkikjaci26k/gradle-1.12-bin.zip
to /home/jenkins/.gradle/wrapper/dists/gradle-1.12-bin/2qvnajdoo11hasdfkikjaci26k
Set executable permissions for: /home/jenkins/.gradle/wrapper/dists/gradle-1.12-bin/2qvnajdoo11hasdfkikjaci26k/gradle-1.12/bin/gradle
Download http://repo1.maven.org/maven2/com/github/ben-manes/gradle-versions-plugin/0.4/gradle-versions-plugin-0.4.pom
Download http://repo1.maven.org/maven2/com/github/goldin/plugins/gradle/about/0.3.1/about-0.3.1.pom
Download http://repo1.maven.org/maven2/nl/javadude/gradle/plugins/license-gradle-plugin/0.9.0/license-gradle-plugin-0.9.0.pom
Download http://repo1.maven.org/maven2/com/eriwen/gradle-js-plugin/1.11.1/gradle-js-plugin-1.11.1.pom
Download http://repo1.maven.org/maven2/org/gcontracts/gcontracts-core/1.2.12/gcontracts-core-1.2.12.pom
Download http://repo1.maven.org/maven2/org/codehaus/gpars/gpars/1.1.0/gpars-1.1.0.pom
Download http://repo1.maven.org/maven2/com/github/goldin/plugins/gradle/common/0.3.1/common-0.3.1.pom
Download http://repo1.maven.org/maven2/com/google/javascript/closure-compiler/v20131014/closure-compiler-v20131014.pom
Download http://repo1.maven.org/maven2/org/multiverse/multiverse-core/0.7.0/multiverse-core-0.7.0.pom
Download http://repo1.maven.org/maven2/org/multiverse/multiverse/0.7.0/multiverse-0.7.0.pom
Download http://repo1.maven.org/maven2/org/codehaus/jsr166-mirror/jsr166y/1.7.0/jsr166y-1.7.0.pom
Download http://repo1.maven.org/maven2/org/spockframework/spock-core/0.7-groovy-1.8/spock-core-0.7-groovy-1.8.pom
Download http://repo1.maven.org/maven2/args4j/args4j/2.0.16/args4j-2.0.16.pom
Download http://repo1.maven.org/maven2/args4j/args4j-site/2.0.16/args4j-site-2.0.16.pom
Download http://repo1.maven.org/maven2/org/codehaus/groovy/groovy-all/1.8.8/groovy-all-1.8.8.pom
Download http://repo1.maven.org/maven2/com/github/ben-manes/gradle-versions-plugin/0.4/gradle-versions-plugin-0.4.jar
Download http://repo1.maven.org/maven2/com/github/goldin/plugins/gradle/about/0.3.1/about-0.3.1.jar
Download http://repo1.maven.org/maven2/nl/javadude/gradle/plugins/license-gradle-plugin/0.9.0/license-gradle-plugin-0.9.0.jar
Download http://repo1.maven.org/maven2/com/eriwen/gradle-js-plugin/1.11.1/gradle-js-plugin-1.11.1.jar
Download http://repo1.maven.org/maven2/org/gcontracts/gcontracts-core/1.2.12/gcontracts-core-1.2.12.jar
Download http://repo1.maven.org/maven2/org/codehaus/gpars/gpars/1.1.0/gpars-1.1.0.jar
Download http://repo1.maven.org/maven2/com/github/goldin/plugins/gradle/common/0.3.1/common-0.3.1.jar
Download http://repo1.maven.org/maven2/com/google/javascript/closure-compiler/v20131014/closure-compiler-v20131014.jar
Download http://repo1.maven.org/maven2/org/multiverse/multiverse-core/0.7.0/multiverse-core-0.7.0.jar
Download http://repo1.maven.org/maven2/org/codehaus/jsr166-mirror/jsr166y/1.7.0/jsr166y-1.7.0.jar
Download http://repo1.maven.org/maven2/org/spockframework/spock-core/0.7-groovy-1.8/spock-core-0.7-groovy-1.8.jar
Download http://repo1.maven.org/maven2/args4j/args4j/2.0.16/args4j-2.0.16.jar
Download http://repo1.maven.org/maven2/org/apache/maven/maven-settings/2.0.5/maven-settings-2.0.5.jar
Download http://repo1.maven.org/maven2/org/apache/maven/maven-profile/2.0.5/maven-profile-2.0.5.jar
Download http://repo1.maven.org/maven2/org/apache/maven/maven-artifact-manager/2.0.5/maven-artifact-manager-2.0.5.jar
Download http://repo1.maven.org/maven2/org/codehaus/groovy/groovy-all/1.8.8/groovy-all-1.8.8.jar

FAILURE: Build failed with an exception.

* What went wrong:
A problem occurred configuring root project 'Aurora'.
> Could not resolve all dependencies for configuration ':classpath'.
   > Could not download artifact 'org.hamcrest:hamcrest-core:1.3:hamcrest-core.jar'
      > Could not HEAD 'http://repo1.maven.org/maven2/org/hamcrest/hamcrest-core/1.3/hamcrest-core-1.3.jar'.
Received status code 503 from server: Connection timed out

* Try:
Run with --info or --debug option to get more log output.

* Exception is:
org.gradle.api.ProjectConfigurationException: A problem occurred configuring root project
'Aurora'.
	at org.gradle.configuration.project.LifecycleProjectEvaluator.addConfigurationFailure(LifecycleProjectEvaluator.java:79)
	at org.gradle.configuration.project.LifecycleProjectEvaluator.evaluate(LifecycleProjectEvaluator.java:57)
	at org.gradle.api.internal.project.AbstractProject.evaluate(AbstractProject.java:493)
	at org.gradle.api.internal.project.AbstractProject.evaluate(AbstractProject.java:80)
	at org.gradle.configuration.DefaultBuildConfigurer.configure(DefaultBuildConfigurer.java:31)
	at org.gradle.initialization.DefaultGradleLauncher.doBuildStages(DefaultGradleLauncher.java:142)
	at org.gradle.initialization.DefaultGradleLauncher.doBuild(DefaultGradleLauncher.java:113)
	at org.gradle.initialization.DefaultGradleLauncher.run(DefaultGradleLauncher.java:81)
	at org.gradle.launcher.exec.InProcessBuildActionExecuter$DefaultBuildController.run(InProcessBuildActionExecuter.java:64)
	at org.gradle.launcher.cli.ExecuteBuildAction.run(ExecuteBuildAction.java:33)
	at org.gradle.launcher.cli.ExecuteBuildAction.run(ExecuteBuildAction.java:24)
	at org.gradle.launcher.exec.InProcessBuildActionExecuter.execute(InProcessBuildActionExecuter.java:35)
	at org.gradle.launcher.exec.InProcessBuildActionExecuter.execute(InProcessBuildActionExecuter.java:26)
	at org.gradle.launcher.cli.RunBuildAction.run(RunBuildAction.java:50)
	at org.gradle.internal.Actions$RunnableActionAdapter.execute(Actions.java:171)
	at org.gradle.launcher.cli.CommandLineActionFactory$ParseAndBuildAction.execute(CommandLineActionFactory.java:201)
	at org.gradle.launcher.cli.CommandLineActionFactory$ParseAndBuildAction.execute(CommandLineActionFactory.java:174)
	at org.gradle.launcher.cli.CommandLineActionFactory$WithLogging.execute(CommandLineActionFactory.java:170)
	at org.gradle.launcher.cli.CommandLineActionFactory$WithLogging.execute(CommandLineActionFactory.java:139)
	at org.gradle.launcher.cli.ExceptionReportingAction.execute(ExceptionReportingAction.java:33)
	at org.gradle.launcher.cli.ExceptionReportingAction.execute(ExceptionReportingAction.java:22)
	at org.gradle.launcher.Main.doAction(Main.java:46)
	at org.gradle.launcher.bootstrap.EntryPoint.run(EntryPoint.java:45)
	at org.gradle.launcher.Main.main(Main.java:37)
	at org.gradle.launcher.bootstrap.ProcessBootstrap.runNoExit(ProcessBootstrap.java:50)
	at org.gradle.launcher.bootstrap.ProcessBootstrap.run(ProcessBootstrap.java:32)
	at org.gradle.launcher.GradleMain.main(GradleMain.java:23)
	at org.gradle.wrapper.BootstrapMainStarter.start(BootstrapMainStarter.java:30)
	at org.gradle.wrapper.WrapperExecutor.execute(WrapperExecutor.java:127)
	at org.gradle.wrapper.GradleWrapperMain.main(GradleWrapperMain.java:55)
Caused by: org.gradle.api.artifacts.ResolveException: Could not resolve all dependencies for
configuration ':classpath'.
	at org.gradle.api.internal.artifacts.ivyservice.ErrorHandlingArtifactDependencyResolver.wrapException(ErrorHandlingArtifactDependencyResolver.java:61)
	at org.gradle.api.internal.artifacts.ivyservice.ErrorHandlingArtifactDependencyResolver.access$000(ErrorHandlingArtifactDependencyResolver.java:35)
	at org.gradle.api.internal.artifacts.ivyservice.ErrorHandlingArtifactDependencyResolver$ErrorHandlingResolvedConfiguration.getFiles(ErrorHandlingArtifactDependencyResolver.java:190)
	at org.gradle.api.internal.artifacts.configurations.DefaultConfiguration$ConfigurationFileCollection.getFiles(DefaultConfiguration.java:467)
	at org.gradle.api.internal.artifacts.configurations.DefaultConfiguration.getFiles(DefaultConfiguration.java:202)
	at org.gradle.api.internal.artifacts.configurations.DefaultConfiguration_Decorated.getFiles(Unknown
Source)
	at org.gradle.configuration.DefaultScriptPluginFactory$ScriptPluginImpl.apply(DefaultScriptPluginFactory.java:127)
	at org.gradle.configuration.project.BuildScriptProcessor.execute(BuildScriptProcessor.java:40)
	at org.gradle.configuration.project.BuildScriptProcessor.execute(BuildScriptProcessor.java:26)
	at org.gradle.configuration.project.ConfigureActionsProjectEvaluator.evaluate(ConfigureActionsProjectEvaluator.java:34)
	at org.gradle.configuration.project.LifecycleProjectEvaluator.evaluate(LifecycleProjectEvaluator.java:55)
	... 28 more
Caused by: org.gradle.api.internal.artifacts.ivyservice.ivyresolve.ArtifactResolveException:
Could not download artifact 'org.hamcrest:hamcrest-core:1.3:hamcrest-core.jar'
	at org.gradle.api.internal.artifacts.repositories.resolver.ExternalResourceResolver.resolveArtifact(ExternalResourceResolver.java:362)
	at org.gradle.api.internal.artifacts.ivyservice.ivyresolve.CacheLockingModuleVersionRepository$4.run(CacheLockingModuleVersionRepository.java:74)
	at org.gradle.internal.Factories$1.create(Factories.java:22)
	at org.gradle.cache.internal.DefaultCacheAccess.longRunningOperation(DefaultCacheAccess.java:237)
	at org.gradle.cache.internal.DefaultCacheAccess.longRunningOperation(DefaultCacheAccess.java:308)
	at org.gradle.cache.internal.DefaultPersistentDirectoryStore.longRunningOperation(DefaultPersistentDirectoryStore.java:114)
	at org.gradle.cache.internal.DefaultCacheFactory$ReferenceTrackingCache.longRunningOperation(DefaultCacheFactory.java:185)
	at org.gradle.api.internal.artifacts.ivyservice.DefaultCacheLockingManager.longRunningOperation(DefaultCacheLockingManager.java:57)
	at org.gradle.api.internal.artifacts.ivyservice.ivyresolve.CacheLockingModuleVersionRepository.resolveArtifact(CacheLockingModuleVersionRepository.java:72)
	at org.gradle.api.internal.artifacts.ivyservice.ivyresolve.CachingModuleVersionRepository.resolveArtifact(CachingModuleVersionRepository.java:263)
	at org.gradle.api.internal.artifacts.ivyservice.ivyresolve.memcache.CachedRepository.resolveArtifact(CachedRepository.java:85)
	at org.gradle.api.internal.artifacts.ivyservice.ivyresolve.RepositoryChainArtifactResolver.resolveArtifact(RepositoryChainArtifactResolver.java:42)
	at org.gradle.api.internal.artifacts.ivyservice.projectmodule.ProjectArtifactResolver.resolveArtifact(ProjectArtifactResolver.java:58)
	at org.gradle.api.internal.artifacts.ivyservice.ContextualArtifactResolver$2$1.execute(ContextualArtifactResolver.java:52)
	at org.gradle.api.internal.artifacts.ivyservice.ContextualArtifactResolver$2$1.execute(ContextualArtifactResolver.java:50)
	at org.gradle.internal.Transformers$3.transform(Transformers.java:131)
	at org.gradle.api.internal.artifacts.ivyservice.DefaultIvyContextManager.withIvy(DefaultIvyContextManager.java:61)
	at org.gradle.api.internal.artifacts.ivyservice.DefaultIvyContextManager.withIvy(DefaultIvyContextManager.java:39)
	at org.gradle.api.internal.artifacts.ivyservice.ContextualArtifactResolver$2.run(ContextualArtifactResolver.java:50)
	at org.gradle.internal.Factories$1.create(Factories.java:22)
	at org.gradle.cache.internal.DefaultCacheAccess.useCache(DefaultCacheAccess.java:187)
	at org.gradle.cache.internal.DefaultCacheAccess.useCache(DefaultCacheAccess.java:175)
	at org.gradle.cache.internal.DefaultPersistentDirectoryStore.useCache(DefaultPersistentDirectoryStore.java:106)
	at org.gradle.cache.internal.DefaultCacheFactory$ReferenceTrackingCache.useCache(DefaultCacheFactory.java:193)
	at org.gradle.api.internal.artifacts.ivyservice.DefaultCacheLockingManager.useCache(DefaultCacheLockingManager.java:65)
	at org.gradle.api.internal.artifacts.ivyservice.ContextualArtifactResolver.resolveArtifact(ContextualArtifactResolver.java:48)
	at org.gradle.api.internal.artifacts.ivyservice.ivyresolve.ErrorHandlingArtifactResolver.resolveArtifact(ErrorHandlingArtifactResolver.java:42)
	at org.gradle.api.internal.artifacts.ivyservice.resolveengine.oldresult.DefaultResolvedConfigurationBuilder$LazyArtifactSource.create(DefaultResolvedConfigurationBuilder.java:131)
	at org.gradle.api.internal.artifacts.ivyservice.resolveengine.oldresult.DefaultResolvedConfigurationBuilder$LazyArtifactSource.create(DefaultResolvedConfigurationBuilder.java:118)
	at org.gradle.api.internal.artifacts.DefaultResolvedArtifact.getFile(DefaultResolvedArtifact.java:106)
	at org.gradle.api.internal.artifacts.ivyservice.DefaultLenientConfiguration$2.run(DefaultLenientConfiguration.java:112)
	at org.gradle.internal.Factories$1.create(Factories.java:22)
	at org.gradle.cache.internal.DefaultCacheAccess.useCache(DefaultCacheAccess.java:187)
	at org.gradle.cache.internal.DefaultCacheAccess.useCache(DefaultCacheAccess.java:175)
	at org.gradle.cache.internal.DefaultPersistentDirectoryStore.useCache(DefaultPersistentDirectoryStore.java:106)
	at org.gradle.cache.internal.DefaultCacheFactory$ReferenceTrackingCache.useCache(DefaultCacheFactory.java:193)
	at org.gradle.api.internal.artifacts.ivyservice.DefaultCacheLockingManager.useCache(DefaultCacheLockingManager.java:65)
	at org.gradle.api.internal.artifacts.ivyservice.DefaultLenientConfiguration.getFiles(DefaultLenientConfiguration.java:109)
	at org.gradle.api.internal.artifacts.ivyservice.DefaultLenientConfiguration.getFilesStrict(DefaultLenientConfiguration.java:81)
	at org.gradle.api.internal.artifacts.ivyservice.DefaultResolvedConfiguration.getFiles(DefaultResolvedConfiguration.java:45)
	at org.gradle.api.internal.artifacts.ivyservice.SelfResolvingDependencyResolver$FilesAggregatingResolvedConfiguration.getFiles(SelfResolvingDependencyResolver.java:85)
	at org.gradle.api.internal.artifacts.ivyservice.ErrorHandlingArtifactDependencyResolver$ErrorHandlingResolvedConfiguration.getFiles(ErrorHandlingArtifactDependencyResolver.java:188)
	... 36 more
Caused by: org.gradle.api.UncheckedIOException: Could not HEAD 'http://repo1.maven.org/maven2/org/hamcrest/hamcrest-core/1.3/hamcrest-core-1.3.jar'.
Received status code 503 from server: Connection timed out
	at org.gradle.api.internal.externalresource.transport.http.HttpClientHelper.processResponse(HttpClientHelper.java:121)
	at org.gradle.api.internal.externalresource.transport.http.HttpClientHelper.performHead(HttpClientHelper.java:62)
	at org.gradle.api.internal.externalresource.transport.http.HttpResourceAccessor.getMetaData(HttpResourceAccessor.java:65)
	at org.gradle.api.internal.externalresource.transfer.ProgressLoggingExternalResourceAccessor.getMetaData(ProgressLoggingExternalResourceAccessor.java:53)
	at org.gradle.api.internal.externalresource.transfer.DefaultCacheAwareExternalResourceAccessor.getResource(DefaultCacheAwareExternalResourceAccessor.java:69)
	at org.gradle.api.internal.externalresource.transport.DefaultExternalResourceRepository.getResource(DefaultExternalResourceRepository.java:65)
	at org.gradle.api.internal.artifacts.repositories.resolver.ExternalResourceResolver$ArtifactResolver.getResource(ExternalResourceResolver.java:579)
	at org.gradle.api.internal.artifacts.repositories.resolver.ExternalResourceResolver$ArtifactResolver.findStaticResourceUsingPatterns(ExternalResourceResolver.java:564)
	at org.gradle.api.internal.artifacts.repositories.resolver.ExternalResourceResolver$ArtifactResolver.resolveArtifact(ExternalResourceResolver.java:552)
	at org.gradle.api.internal.artifacts.repositories.resolver.ExternalResourceResolver.downloadArtifact(ExternalResourceResolver.java:378)
	at org.gradle.api.internal.artifacts.repositories.resolver.ExternalResourceResolver.download(ExternalResourceResolver.java:374)
	at org.gradle.api.internal.artifacts.repositories.resolver.ExternalResourceResolver.resolveArtifact(ExternalResourceResolver.java:360)
	... 77 more


BUILD FAILED

Total time: 1 mins 45.746 secs
Build step 'Execute shell' marked build as failure
Recording test results

Mime
View raw message