aurora-dev mailing list archives

Site index · List index
Message view « Date » · « Thread »
Top « Date » · « Thread »
From Apache Jenkins Server <jenk...@builds.apache.org>
Subject Build failed in Jenkins: Aurora #571
Date Fri, 19 Sep 2014 18:20:25 GMT
See <https://builds.apache.org/job/Aurora/571/changes>

Changes:

[maxim] Fixing python tests.

[maxim] Allow null lock token in saveJobUpdate.

------------------------------------------
Started by an SCM change
Building remotely on jenkins-ubuntu-1404-4gb-5a7 (jenkins-cloud-4GB Ubuntu ubuntu) in workspace
<https://builds.apache.org/job/Aurora/ws/>
Wiping out workspace first.
Cloning the remote Git repository
Cloning repository https://git-wip-us.apache.org/repos/asf/incubator-aurora.git
 > git init <https://builds.apache.org/job/Aurora/ws/>
Fetching upstream changes from https://git-wip-us.apache.org/repos/asf/incubator-aurora.git
 > git --version
 > git fetch --tags --progress https://git-wip-us.apache.org/repos/asf/incubator-aurora.git
+refs/heads/*:refs/remotes/origin/*
 > git config remote.origin.url https://git-wip-us.apache.org/repos/asf/incubator-aurora.git
 > git config remote.origin.fetch +refs/heads/*:refs/remotes/origin/*
 > git config remote.origin.url https://git-wip-us.apache.org/repos/asf/incubator-aurora.git
Fetching upstream changes from https://git-wip-us.apache.org/repos/asf/incubator-aurora.git
 > git fetch --tags --progress https://git-wip-us.apache.org/repos/asf/incubator-aurora.git
+refs/heads/*:refs/remotes/origin/*
 > git rev-parse origin/master^{commit}
Checking out Revision 012aca3d2a5667f9cfd6a1b9b0b91c982d34bb94 (origin/master)
 > git config core.sparsecheckout
 > git checkout -f 012aca3d2a5667f9cfd6a1b9b0b91c982d34bb94
 > git rev-list cff85377199de85a6342b69d1bf787c4d264f9bf
Cleaning workspace
 > git rev-parse --verify HEAD
Resetting working tree
 > git reset --hard
 > git clean -fdx
[Aurora] $ /bin/bash -xe /tmp/hudson8315085986611707346.sh
+ ./build-support/jenkins/build.sh
+ date
Fri Sep 19 18:17:55 UTC 2014
+ ./gradlew -Pq clean build --stacktrace
Downloading https://services.gradle.org/distributions/gradle-1.12-bin.zip

Exception in thread "main" java.lang.RuntimeException: java.net.ConnectException: Connection
timed out
	at org.gradle.wrapper.ExclusiveFileAccessManager.access(ExclusiveFileAccessManager.java:78)
	at org.gradle.wrapper.Install.createDist(Install.java:44)
	at org.gradle.wrapper.WrapperExecutor.execute(WrapperExecutor.java:126)
	at org.gradle.wrapper.GradleWrapperMain.main(GradleWrapperMain.java:55)
Caused by: java.net.ConnectException: Connection timed out
	at java.net.PlainSocketImpl.socketConnect(Native Method)
	at java.net.AbstractPlainSocketImpl.doConnect(AbstractPlainSocketImpl.java:339)
	at java.net.AbstractPlainSocketImpl.connectToAddress(AbstractPlainSocketImpl.java:200)
	at java.net.AbstractPlainSocketImpl.connect(AbstractPlainSocketImpl.java:182)
	at java.net.SocksSocketImpl.connect(SocksSocketImpl.java:392)
	at java.net.Socket.connect(Socket.java:579)
	at sun.security.ssl.SSLSocketImpl.connect(SSLSocketImpl.java:618)
	at sun.security.ssl.BaseSSLSocketImpl.connect(BaseSSLSocketImpl.java:160)
	at sun.net.NetworkClient.doConnect(NetworkClient.java:180)
	at sun.net.www.http.HttpClient.openServer(HttpClient.java:378)
	at sun.net.www.http.HttpClient.openServer(HttpClient.java:473)
	at sun.net.www.protocol.https.HttpsClient.<init>(HttpsClient.java:270)
	at sun.net.www.protocol.https.HttpsClient.New(HttpsClient.java:327)
	at sun.net.www.protocol.https.AbstractDelegateHttpsURLConnection.getNewHttpClient(AbstractDelegateHttpsURLConnection.java:191)
	at sun.net.www.protocol.http.HttpURLConnection.plainConnect(HttpURLConnection.java:931)
	at sun.net.www.protocol.https.AbstractDelegateHttpsURLConnection.connect(AbstractDelegateHttpsURLConnection.java:177)
	at sun.net.www.protocol.http.HttpURLConnection.followRedirect(HttpURLConnection.java:2397)
	at sun.net.www.protocol.http.HttpURLConnection.getInputStream(HttpURLConnection.java:1556)
	at sun.net.www.protocol.https.HttpsURLConnectionImpl.getInputStream(HttpsURLConnectionImpl.java:254)
	at org.gradle.wrapper.Download.downloadInternal(Download.java:56)
	at org.gradle.wrapper.Download.download(Download.java:42)
	at org.gradle.wrapper.Install$1.call(Install.java:57)
	at org.gradle.wrapper.Install$1.call(Install.java:44)
	at org.gradle.wrapper.ExclusiveFileAccessManager.access(ExclusiveFileAccessManager.java:65)
	... 3 more
Build step 'Execute shell' marked build as failure
Recording test results

Mime
View raw message