aurora-dev mailing list archives

Site index · List index
Message view « Date » · « Thread »
Top « Date » · « Thread »
From Apache Jenkins Server <jenk...@builds.apache.org>
Subject Build failed in Jenkins: Aurora #606
Date Tue, 30 Sep 2014 17:58:43 GMT
See <https://builds.apache.org/job/Aurora/606/changes>

Changes:

[maxim] Fixing consumption double counting in quota checks.

------------------------------------------
[...truncated 5070 lines...]
ERROR:root:Could not find user: wickman
ERROR:root:Could not find user: wickman
ERROR:root:Could not find user: wickman
ERROR:root:Could not find user: wickman
WARNING:root:Only able to fast forward to sleep@sequence=-1, high watermark is 0
ERROR:root:Could not find user: wickman
ERROR:root:Could not find user: wickman
ERROR:root:Could not find user: wickman
ERROR:root:Could not find user: wickman
ERROR:root:Could not find user: wickman
WARNING:root:Only able to fast forward to sleep@sequence=-1, high watermark is 0
ERROR:root:Could not find user: wickman
ERROR:root:Could not find user: wickman
ERROR:root:Could not find user: wickman
ERROR:root:Could not find user: wickman
ERROR:root:Could not find user: wickman
WARNING:root:Only able to fast forward to sleep@sequence=-1, high watermark is 0
ERROR:root:Could not find user: wickman
ERROR:root:Could not find user: wickman
ERROR:root:Could not find user: wickman
ERROR:root:Could not find user: wickman
ERROR:root:Could not find user: wickman
PASSED
src/test/python/apache/aurora/executor/test_gc_executor.py::test_gc_without_loss WARNING:root:Only
able to fast forward to sleep@sequence=-1, high watermark is 0
ERROR:root:Could not find user: wickman
ERROR:root:Could not find user: wickman
ERROR:root:Could not find user: wickman
ERROR:root:Could not find user: wickman
ERROR:root:Could not find user: wickman
WARNING:root:Only able to fast forward to sleep@sequence=-1, high watermark is 0
ERROR:root:Could not find user: wickman
ERROR:root:Could not find user: wickman
ERROR:root:Could not find user: wickman
ERROR:root:Could not find user: wickman
ERROR:root:Could not find user: wickman
WARNING:root:Only able to fast forward to sleep@sequence=-1, high watermark is 0
ERROR:root:Could not find user: wickman
ERROR:root:Could not find user: wickman
ERROR:root:Could not find user: wickman
ERROR:root:Could not find user: wickman
ERROR:root:Could not find user: wickman
WARNING:root:Only able to fast forward to sleep@sequence=-1, high watermark is 0
ERROR:root:Could not find user: wickman
ERROR:root:Could not find user: wickman
ERROR:root:Could not find user: wickman
ERROR:root:Could not find user: wickman
ERROR:root:Could not find user: wickman
WARNING:root:Only able to fast forward to sleep@sequence=-1, high watermark is 0
ERROR:root:Could not find user: wickman
ERROR:root:Could not find user: wickman
ERROR:root:Could not find user: wickman
ERROR:root:Could not find user: wickman
ERROR:root:Could not find user: wickman
WARNING:root:Only able to fast forward to sleep@sequence=-1, high watermark is 0
ERROR:root:Could not find user: wickman
ERROR:root:Could not find user: wickman
PASSED
src/test/python/apache/aurora/executor/test_gc_executor.py::test_gc_withheld ERROR:root:Could
not find user: wickman
ERROR:root:Could not find user: wickman
ERROR:root:Could not find user: wickman
WARNING:root:Only able to fast forward to sleep@sequence=-1, high watermark is 0
ERROR:root:Could not find user: wickman
ERROR:root:Could not find user: wickman
ERROR:root:Could not find user: wickman
ERROR:root:Could not find user: wickman
ERROR:root:Could not find user: wickman
WARNING:root:Only able to fast forward to sleep@sequence=-1, high watermark is 0
ERROR:root:Could not find user: wickman
ERROR:root:Could not find user: wickman
ERROR:root:Could not find user: wickman
ERROR:root:Could not find user: wickman
ERROR:root:Could not find user: wickman
WARNING:root:Only able to fast forward to sleep@sequence=-1, high watermark is 0
ERROR:root:Could not find user: wickman
ERROR:root:Could not find user: wickman
ERROR:root:Could not find user: wickman
ERROR:root:Could not find user: wickman
ERROR:root:Could not find user: wickman
WARNING:root:Only able to fast forward to sleep@sequence=-1, high watermark is 0
ERROR:root:Could not find user: wickman
ERROR:root:Could not find user: wickman
ERROR:root:Could not find user: wickman
ERROR:root:Could not find user: wickman
ERROR:root:Could not find user: wickman
WARNING:root:Only able to fast forward to sleep@sequence=-1, high watermark is 0
ERROR:root:Could not find user: wickman
ERROR:root:Could not find user: wickman
ERROR:root:Could not find user: wickman
ERROR:root:Could not find user: wickman
ERROR:root:Could not find user: wickman
WARNING:root:Only able to fast forward to sleep@sequence=-1, high watermark is 0
ERROR:root:Could not find user: wickman
ERROR:root:Could not find user: wickman
ERROR:root:Could not find user: wickman
ERROR:root:Could not find user: wickman
ERROR:root:Could not find user: wickman
WARNING:root:Only able to fast forward to sleep@sequence=-1, high watermark is 0
ERROR:root:Could not find user: wickman
ERROR:root:Could not find user: wickman
ERROR:root:Could not find user: wickman
ERROR:root:Could not find user: wickman
ERROR:root:Could not find user: wickman
WARNING:root:Only able to fast forward to sleep@sequence=-1, high watermark is 0
ERROR:root:Could not find user: wickman
ERROR:root:Could not find user: wickman
ERROR:root:Could not find user: wickman
ERROR:root:Could not find user: wickman
ERROR:root:Could not find user: wickman
WARNING:root:Only able to fast forward to sleep@sequence=-1, high watermark is 0
ERROR:root:Could not find user: wickman
ERROR:root:Could not find user: wickman
ERROR:root:Could not find user: wickman
ERROR:root:Could not find user: wickman
ERROR:root:Could not find user: wickman
WARNING:root:Only able to fast forward to sleep@sequence=-1, high watermark is 0
ERROR:root:Could not find user: wickman
ERROR:root:Could not find user: wickman
PASSED
src/test/python/apache/aurora/executor/test_gc_executor.py::test_gc_withheld_and_executor_missing
ERROR:root:Could not find user: wickman
ERROR:root:Could not find user: wickman
ERROR:root:Could not find user: wickman
ERROR:root:Could not find user: wickman
ERROR:root:Could not find user: wickman
ERROR:root:Could not find user: wickman
WARNING:root:Only able to fast forward to sleep@sequence=-1, high watermark is 0
ERROR:root:Could not find user: wickman
ERROR:root:Could not find user: wickman
ERROR:root:Could not find user: wickman
ERROR:root:Could not find user: wickman
ERROR:root:Could not find user: wickman
WARNING:root:Only able to fast forward to sleep@sequence=-1, high watermark is 0
ERROR:root:Could not find user: wickman
ERROR:root:Could not find user: wickman
ERROR:root:Could not find user: wickman
ERROR:root:Could not find user: wickman
ERROR:root:Could not find user: wickman
WARNING:root:Only able to fast forward to sleep@sequence=-1, high watermark is 0
ERROR:root:Could not find user: wickman
ERROR:root:Could not find user: wickman
ERROR:root:Could not find user: wickman
ERROR:root:Could not find user: wickman
ERROR:root:Could not find user: wickman
WARNING:root:Only able to fast forward to sleep@sequence=-1, high watermark is 0
ERROR:root:Could not find user: wickman
ERROR:root:Could not find user: wickman
ERROR:root:Could not find user: wickman
ERROR:root:Could not find user: wickman
ERROR:root:Could not find user: wickman
WARNING:root:Only able to fast forward to sleep@sequence=-1, high watermark is 0
ERROR:root:Could not find user: wickman
ERROR:root:Could not find user: wickman
ERROR:root:Could not find user: wickman
ERROR:root:Could not find user: wickman
ERROR:root:Could not find user: wickman
WARNING:root:Only able to fast forward to sleep@sequence=-1, high watermark is 0
ERROR:root:Could not find user: wickman
ERROR:root:Could not find user: wickman
ERROR:root:Could not find user: wickman
ERROR:root:Could not find user: wickman
ERROR:root:Could not find user: wickman
WARNING:root:Only able to fast forward to sleep@sequence=-1, high watermark is 0
ERROR:root:Could not find user: wickman
ERROR:root:Could not find user: wickman
ERROR:root:Could not find user: wickman
ERROR:root:Could not find user: wickman
ERROR:root:Could not find user: wickman
WARNING:root:Only able to fast forward to sleep@sequence=-1, high watermark is 0
ERROR:root:Could not find user: wickman
ERROR:root:Could not find user: wickman
ERROR:root:Could not find user: wickman
ERROR:root:Could not find user: wickman
ERROR:root:Could not find user: wickman
WARNING:root:Only able to fast forward to sleep@sequence=-1, high watermark is 0
ERROR:root:Could not find user: wickman
ERROR:root:Could not find user: wickman
PASSED
src/test/python/apache/aurora/executor/test_gc_executor.py::test_gc_killtask_noop PASSED
src/test/python/apache/aurora/executor/test_gc_executor.py::test_gc_killtask_current PASSED
src/test/python/apache/aurora/executor/test_gc_executor.py::test_gc_killtask_queued FAILED

=================================== FAILURES ===================================
___________________________ test_gc_killtask_queued ____________________________

    def test_gc_killtask_queued():
      TASK2_ID = "task2"
      proxy_driver = ProxyDriver()
      with temporary_dir() as td:
        executor = build_blocking_gc_executor(td, proxy_driver)
        executor.launchTask(proxy_driver, serialize_art(AdjustRetainedTasks()))
        thread_yield()
        executor.launchTask(proxy_driver, serialize_art(AdjustRetainedTasks(), task_id=TASK2_ID))
        thread_yield()
>       assert len(executor._gc_task_queue) == 1
E       assert 0 == 1
E        +  where 0 = len(OrderedDict())
E        +    where OrderedDict() = <LongGCThinTestThermosGCExecutor(Thread-154 [TID=6121],
started daemon 139990960957184)>._gc_task_queue

src/test/python/apache/aurora/executor/test_gc_executor.py:444: AssertionError
!!!!!!!!!!!!!!!!!!!! Interrupted: stopping after 1 failures !!!!!!!!!!!!!!!!!!!!
===================== 1 failed, 17 passed in 7.79 seconds ======================
Build operating on top level addresses: set([BuildFileAddress(<https://builds.apache.org/job/Aurora/ws/src/test/python/BUILD,>
all)])
src.test.python.apache.aurora.client.api.api                                    .....   SUCCESS
src.test.python.apache.aurora.client.api.disambiguator                          .....   SUCCESS
src.test.python.apache.aurora.client.api.instance_watcher                       .....   SUCCESS
src.test.python.apache.aurora.client.api.job_monitor                            .....   SUCCESS
src.test.python.apache.aurora.client.api.mux                                    .....   SUCCESS
src.test.python.apache.aurora.client.api.scheduler_client                       .....   SUCCESS
src.test.python.apache.aurora.client.api.updater                                .....   SUCCESS
src.test.python.apache.aurora.client.api.updater_util                           .....   SUCCESS
src.test.python.apache.aurora.client.binding_helper                             .....   SUCCESS
src.test.python.apache.aurora.client.cli.config                                 .....   SUCCESS
src.test.python.apache.aurora.client.cli.inspect                                .....   SUCCESS
src.test.python.apache.aurora.client.cli.job                                    .....   SUCCESS
src.test.python.apache.aurora.client.cli.logging                                .....   SUCCESS
src.test.python.apache.aurora.client.cli.plugins                                .....   SUCCESS
src.test.python.apache.aurora.client.cli.quota                                  .....   SUCCESS
src.test.python.apache.aurora.client.cli.sla                                    .....   SUCCESS
src.test.python.apache.aurora.client.cli.supdate                                .....   SUCCESS
src.test.python.apache.aurora.client.cli.task                                   .....   SUCCESS
src.test.python.apache.aurora.client.commands.admin                             .....   SUCCESS
src.test.python.apache.aurora.client.commands.core                              .....   SUCCESS
src.test.python.apache.aurora.client.commands.ssh                               .....   SUCCESS
src.test.python.apache.aurora.client.config                                     .....   SUCCESS
src.test.python.apache.aurora.client.hooks.hooked_api                           .....   SUCCESS
src.test.python.apache.aurora.client.hooks.non_hooked_api                       .....   SUCCESS
src.test.python.apache.aurora.common.test_aurora_job_key                        .....   SUCCESS
src.test.python.apache.aurora.common.test_cluster                               .....   SUCCESS
src.test.python.apache.aurora.common.test_cluster_option                        .....   SUCCESS
src.test.python.apache.aurora.common.test_clusters                              .....   SUCCESS
src.test.python.apache.aurora.common.test_http_signaler                         .....   SUCCESS
src.test.python.apache.aurora.config.test_loader                                .....   SUCCESS
src.test.python.apache.aurora.config.test_thrift                                .....   SUCCESS
src.test.python.apache.aurora.executor.common.announcer                         .....   SUCCESS
src.test.python.apache.aurora.executor.common.directory_sandbox                 .....   SUCCESS
src.test.python.apache.aurora.executor.common.health_checker                    .....   SUCCESS
src.test.python.apache.aurora.executor.common.task_info                         .....   SUCCESS
src.test.python.apache.aurora.executor.executor_base                            .....   SUCCESS
src.test.python.apache.aurora.executor.executor_vars                            .....   SUCCESS
src.test.python.apache.aurora.executor.gc_executor                              .....   FAILURE
src.test.python.apache.aurora.executor.status_manager                           .....   SUCCESS
src.test.python.apache.thermos.bin.test_thermos                                 .....   SUCCESS
src.test.python.apache.thermos.common.test_pathspec                             .....   SUCCESS
src.test.python.apache.thermos.common.test_task_planner                         .....   SUCCESS
src.test.python.apache.thermos.core.test_angry                                  .....   SUCCESS
src.test.python.apache.thermos.core.test_failing_runner                         .....   SUCCESS
src.test.python.apache.thermos.core.test_runner_integration                     .....   SUCCESS
src.test.python.apache.thermos.monitoring.test_disk                             .....   SUCCESS
Build step 'Execute shell' marked build as failure
Recording test results

Mime
View raw message