aurora-dev mailing list archives

Site index · List index
Message view « Date » · « Thread »
Top « Date » · « Thread »
From Apache Jenkins Server <jenk...@builds.apache.org>
Subject Build failed in Jenkins: Aurora #517
Date Fri, 22 Aug 2014 01:47:08 GMT
See <https://builds.apache.org/job/Aurora/517/changes>

Changes:

[mchucarroll] Fix bug in handling of pystachio bindings.

------------------------------------------
[...truncated 141 lines...]
Download http://maven.twttr.com/com/twitter/common/logging/log4j/0.0.7/log4j-0.0.7.pom
Download http://maven.twttr.com/com/twitter/common/zookeeper/guice/client-flagged/0.0.5/client-flagged-0.0.5.pom
Download http://maven.twttr.com/com/twitter/common/zookeeper/guice/client/0.0.5/client-0.0.5.pom
Download http://maven.twttr.com/com/twitter/common/zookeeper/candidate/0.0.64/candidate-0.0.64.pom
Download http://maven.twttr.com/com/twitter/common/zookeeper/client/0.0.56/client-0.0.56.pom
Download http://maven.twttr.com/com/twitter/common/zookeeper/group/0.0.69/group-0.0.69.pom
Download http://maven.twttr.com/com/twitter/common/zookeeper/server-set/1.0.74/server-set-1.0.74.pom
Download http://maven.twttr.com/com/twitter/common/zookeeper/singleton-service/0.0.85/singleton-service-0.0.85.pom
Download http://maven.twttr.com/com/twitter/common/application-http/0.0.59/application-http-0.0.59.pom
Download http://maven.twttr.com/com/twitter/common/application-module-applauncher/0.0.51/application-module-applauncher-0.0.51.pom
Download http://maven.twttr.com/com/twitter/common/application-module-lifecycle/0.0.48/application-module-lifecycle-0.0.48.pom
Download http://maven.twttr.com/com/twitter/common/application-module-log/0.0.56/application-module-log-0.0.56.pom
Download http://maven.twttr.com/com/twitter/common/application-module-stats/0.0.44/application-module-stats-0.0.44.pom
Download http://maven.twttr.com/com/twitter/common/application/0.0.73/application-0.0.73.pom
Download http://maven.twttr.com/com/twitter/common/args/0.2.9/args-0.2.9.pom
Download http://maven.twttr.com/com/twitter/common/base/0.0.87/base-0.0.87.pom
Download http://maven.twttr.com/com/twitter/common/collections/0.0.74/collections-0.0.74.pom
Download http://maven.twttr.com/com/twitter/common/dynamic-host-set/0.0.44/dynamic-host-set-0.0.44.pom
Download http://maven.twttr.com/com/twitter/common/inject-timed/0.0.11/inject-timed-0.0.11.pom
Download http://maven.twttr.com/com/twitter/common/inject/0.0.35/inject-0.0.35.pom
Download http://maven.twttr.com/com/twitter/common/io/0.0.53/io-0.0.53.pom
Download http://maven.twttr.com/com/twitter/common/jdk-logging/0.0.44/jdk-logging-0.0.44.pom
Download http://maven.twttr.com/com/twitter/common/logging/0.0.61/logging-0.0.61.pom
Download http://maven.twttr.com/com/twitter/common/net-http-handlers-time-series/0.0.51/net-http-handlers-time-series-0.0.51.pom
Download http://maven.twttr.com/com/twitter/common/net-util/0.0.80/net-util-0.0.80.pom
Download http://maven.twttr.com/com/twitter/common/quantity/0.0.71/quantity-0.0.71.pom
Download http://maven.twttr.com/com/twitter/common/stats/0.0.91/stats-0.0.91.pom
Download http://maven.twttr.com/com/twitter/common/thrift/0.0.68/thrift-0.0.68.pom
Download http://maven.twttr.com/com/twitter/common/util-executor-service-shutdown/0.0.49/util-executor-service-shutdown-0.0.49.pom
Download http://maven.twttr.com/com/twitter/common/util-templating/0.0.25/util-templating-0.0.25.pom
Download http://maven.twttr.com/com/twitter/common/util-testing/0.0.10/util-testing-0.0.10.pom
Download http://maven.twttr.com/com/twitter/common/util/0.0.94/util-0.0.94.pom
Download http://repo1.maven.org/maven2/org/sonatype/sisu/inject/cglib/2.2.1-v20090111/cglib-2.2.1-v20090111.pom
Download http://repo1.maven.org/maven2/org/codehaus/jackson/jackson-core-asl/1.9.2/jackson-core-asl-1.9.2.pom
Download http://repo1.maven.org/maven2/org/codehaus/jackson/jackson-mapper-asl/1.9.2/jackson-mapper-asl-1.9.2.pom
Download http://repo1.maven.org/maven2/org/codehaus/jackson/jackson-jaxrs/1.9.2/jackson-jaxrs-1.9.2.pom
Download http://repo1.maven.org/maven2/org/codehaus/jackson/jackson-xc/1.9.2/jackson-xc-1.9.2.pom
Download http://repo1.maven.org/maven2/antlr/antlr/2.7.7/antlr-2.7.7.pom
Download http://repo1.maven.org/maven2/c3p0/c3p0/0.9.1.1/c3p0-0.9.1.1.pom
Download http://maven.twttr.com/com/twitter/common/zookeeper/lock/0.0.36/lock-0.0.36.pom
Download http://maven.twttr.com/com/twitter/common/zookeeper/map/0.0.45/map-0.0.45.pom
Download http://maven.twttr.com/com/twitter/common/zookeeper/node/0.0.45/node-0.0.45.pom
Download http://maven.twttr.com/com/twitter/common/zookeeper/partitioner/0.0.45/partitioner-0.0.45.pom
Download http://maven.twttr.com/com/twitter/common/zookeeper-testing/0.0.45/zookeeper-testing-0.0.45.pom
Download http://maven.twttr.com/com/twitter/common/io-json/0.0.41/io-json-0.0.41.pom
Download http://maven.twttr.com/com/twitter/common/io-thrift/0.0.50/io-thrift-0.0.50.pom
Download http://maven.twttr.com/com/twitter/common/service-thrift/1.0.45/service-thrift-1.0.45.pom
Download http://maven.twttr.com/com/twitter/common/application-action/0.0.68/application-action-0.0.68.pom
Download http://maven.twttr.com/com/twitter/common/net-http/0.0.45/net-http-0.0.45.pom
Download http://maven.twttr.com/com/twitter/common/net-http-handlers/0.0.71/net-http-handlers-0.0.71.pom
Download http://repo1.maven.org/maven2/com/google/inject/extensions/guice-multibindings/3.0/guice-multibindings-3.0.pom
Download http://maven.twttr.com/com/twitter/common/stats-time-series/0.0.56/stats-time-series-0.0.56.pom
Download http://maven.twttr.com/com/twitter/common/stats-jvm/0.0.46/stats-jvm-0.0.46.pom
Download http://maven.twttr.com/com/twitter/common/args-apt/0.1.11/args-apt-0.1.11.pom
Download http://maven.twttr.com/com/twitter/common/args-core/0.1.12/args-core-0.1.12.pom
Download http://maven.twttr.com/com/twitter/common/util-system-mocks/0.0.72/util-system-mocks-0.0.72.pom
Download http://repo1.maven.org/maven2/commons-io/commons-io/2.1/commons-io-2.1.pom
Download http://repo1.maven.org/maven2/joda-time/joda-time/2.3/joda-time-2.3.pom
Download http://repo1.maven.org/maven2/org/joda/joda-convert/1.5/joda-convert-1.5.pom
Download http://maven.twttr.com/com/twitter/common/stat-registry/0.0.27/stat-registry-0.0.27.pom
Download http://maven.twttr.com/com/twitter/common/stats-provider/0.0.57/stats-provider-0.0.57.pom
Download http://maven.twttr.com/com/twitter/common/util-sampler/0.0.53/util-sampler-0.0.53.pom
Download http://maven.twttr.com/com/twitter/common/net-pool/0.0.60/net-pool-0.0.60.pom
Download http://repo1.maven.org/maven2/javax/xml/bind/jaxb-api/2.2.2/jaxb-api-2.2.2.pom
Download http://maven.twttr.com/com/google/testing/test-libraries-for-java/1.1.1/test-libraries-for-java-1.1.1.pom
Download http://maven.twttr.com/com/twitter/common/net-http-handlers-text/0.0.31/net-http-handlers-text-0.0.31.pom
Download http://maven.twttr.com/com/twitter/common/net-http-handlers-params/0.0.17/net-http-handlers-params-0.0.17.pom
Download http://maven.twttr.com/com/twitter/common/net-http-handlers-string-template/0.0.51/net-http-handlers-string-template-0.0.51.pom
Download http://maven.twttr.com/com/twitter/common/stat/0.0.29/stat-0.0.29.pom
Download http://repo1.maven.org/maven2/com/h2database/h2/1.4.177/h2-1.4.177.jar
Download http://repo1.maven.org/maven2/com/sun/jersey/jersey-core/1.18.1/jersey-core-1.18.1.jar
Download http://repo1.maven.org/maven2/com/sun/jersey/jersey-json/1.18.1/jersey-json-1.18.1.jar
Download http://repo1.maven.org/maven2/com/sun/jersey/jersey-server/1.18.1/jersey-server-1.18.1.jar
Download http://repo1.maven.org/maven2/com/sun/jersey/jersey-servlet/1.18.1/jersey-servlet-1.18.1.jar
Download http://repo1.maven.org/maven2/com/sun/jersey/contribs/jersey-guice/1.18.1/jersey-guice-1.18.1.jar
Download http://repo1.maven.org/maven2/org/antlr/stringtemplate/3.2.1/stringtemplate-3.2.1.jar
Download http://repo1.maven.org/maven2/org/apache/mesos/mesos/0.19.1/mesos-0.19.1.jar
Download http://repo1.maven.org/maven2/org/apache/zookeeper/zookeeper/3.3.4/zookeeper-3.3.4.jar
Download http://repo1.maven.org/maven2/org/mybatis/mybatis/3.2.7/mybatis-3.2.7.jar
Download http://repo1.maven.org/maven2/org/mybatis/mybatis-guice/3.6/mybatis-guice-3.6.jar
Download http://repo1.maven.org/maven2/org/quartz-scheduler/quartz/2.2.1/quartz-2.2.1.jar
Download http://repo1.maven.org/maven2/org/slf4j/slf4j-api/1.6.1/slf4j-api-1.6.1.jar
Download http://repo1.maven.org/maven2/org/slf4j/slf4j-jdk14/1.6.1/slf4j-jdk14-1.6.1.jar
Download http://maven.twttr.com/com/twitter/common/logging/log4j/0.0.7/log4j-0.0.7.jar
Download http://maven.twttr.com/com/twitter/common/zookeeper/guice/client-flagged/0.0.5/client-flagged-0.0.5.jar
Download http://maven.twttr.com/com/twitter/common/zookeeper/guice/client/0.0.5/client-0.0.5.jar
Download http://maven.twttr.com/com/twitter/common/zookeeper/candidate/0.0.64/candidate-0.0.64.jar
Download http://maven.twttr.com/com/twitter/common/zookeeper/client/0.0.56/client-0.0.56.jar
Download http://maven.twttr.com/com/twitter/common/zookeeper/group/0.0.69/group-0.0.69.jar
Download http://maven.twttr.com/com/twitter/common/zookeeper/server-set/1.0.74/server-set-1.0.74.jar
Download http://maven.twttr.com/com/twitter/common/zookeeper/singleton-service/0.0.85/singleton-service-0.0.85.jar
Download http://maven.twttr.com/com/twitter/common/application-http/0.0.59/application-http-0.0.59.jar
Download http://maven.twttr.com/com/twitter/common/application-module-applauncher/0.0.51/application-module-applauncher-0.0.51.jar
Download http://maven.twttr.com/com/twitter/common/application-module-lifecycle/0.0.48/application-module-lifecycle-0.0.48.jar
Download http://maven.twttr.com/com/twitter/common/application-module-log/0.0.56/application-module-log-0.0.56.jar
Download http://maven.twttr.com/com/twitter/common/application-module-stats/0.0.44/application-module-stats-0.0.44.jar
Download http://maven.twttr.com/com/twitter/common/application/0.0.73/application-0.0.73.jar
Download http://maven.twttr.com/com/twitter/common/args/0.2.9/args-0.2.9.jar
Download http://maven.twttr.com/com/twitter/common/base/0.0.87/base-0.0.87.jar
Download http://maven.twttr.com/com/twitter/common/collections/0.0.74/collections-0.0.74.jar
Download http://maven.twttr.com/com/twitter/common/dynamic-host-set/0.0.44/dynamic-host-set-0.0.44.jar
Download http://maven.twttr.com/com/twitter/common/inject-timed/0.0.11/inject-timed-0.0.11.jar
Download http://maven.twttr.com/com/twitter/common/inject/0.0.35/inject-0.0.35.jar
Download http://maven.twttr.com/com/twitter/common/io/0.0.53/io-0.0.53.jar
Download http://maven.twttr.com/com/twitter/common/jdk-logging/0.0.44/jdk-logging-0.0.44.jar
Download http://maven.twttr.com/com/twitter/common/logging/0.0.61/logging-0.0.61.jar
Download http://maven.twttr.com/com/twitter/common/net-http-handlers-time-series/0.0.51/net-http-handlers-time-series-0.0.51.jar
Download http://maven.twttr.com/com/twitter/common/net-util/0.0.80/net-util-0.0.80.jar
Download http://maven.twttr.com/com/twitter/common/quantity/0.0.71/quantity-0.0.71.jar
Download http://maven.twttr.com/com/twitter/common/stats/0.0.91/stats-0.0.91.jar
Download http://maven.twttr.com/com/twitter/common/thrift/0.0.68/thrift-0.0.68.jar
Download http://maven.twttr.com/com/twitter/common/util-executor-service-shutdown/0.0.49/util-executor-service-shutdown-0.0.49.jar
Download http://maven.twttr.com/com/twitter/common/util-templating/0.0.25/util-templating-0.0.25.jar
Download http://maven.twttr.com/com/twitter/common/util-testing/0.0.10/util-testing-0.0.10.jar
Download http://maven.twttr.com/com/twitter/common/util/0.0.94/util-0.0.94.jar
Download http://repo1.maven.org/maven2/org/sonatype/sisu/inject/cglib/2.2.1-v20090111/cglib-2.2.1-v20090111.jar
Download http://repo1.maven.org/maven2/org/codehaus/jackson/jackson-core-asl/1.9.2/jackson-core-asl-1.9.2.jar
Download http://repo1.maven.org/maven2/org/codehaus/jackson/jackson-mapper-asl/1.9.2/jackson-mapper-asl-1.9.2.jar
Download http://repo1.maven.org/maven2/org/codehaus/jackson/jackson-jaxrs/1.9.2/jackson-jaxrs-1.9.2.jar
Download http://repo1.maven.org/maven2/org/codehaus/jackson/jackson-xc/1.9.2/jackson-xc-1.9.2.jar
Download http://repo1.maven.org/maven2/antlr/antlr/2.7.7/antlr-2.7.7.jar
Download http://repo1.maven.org/maven2/c3p0/c3p0/0.9.1.1/c3p0-0.9.1.1.jar
Download http://maven.twttr.com/com/twitter/common/zookeeper/lock/0.0.36/lock-0.0.36.jar
Download http://maven.twttr.com/com/twitter/common/zookeeper/map/0.0.45/map-0.0.45.jar
Download http://maven.twttr.com/com/twitter/common/zookeeper/node/0.0.45/node-0.0.45.jar
Download http://maven.twttr.com/com/twitter/common/zookeeper/partitioner/0.0.45/partitioner-0.0.45.jar
Download http://maven.twttr.com/com/twitter/common/zookeeper-testing/0.0.45/zookeeper-testing-0.0.45.jar
Download http://maven.twttr.com/com/twitter/common/io-json/0.0.41/io-json-0.0.41.jar
Download http://maven.twttr.com/com/twitter/common/io-thrift/0.0.50/io-thrift-0.0.50.jar
Download http://maven.twttr.com/com/twitter/common/service-thrift/1.0.45/service-thrift-1.0.45.jar
Download http://maven.twttr.com/com/twitter/common/application-action/0.0.68/application-action-0.0.68.jar
Download http://maven.twttr.com/com/twitter/common/net-http/0.0.45/net-http-0.0.45.jar
Download http://maven.twttr.com/com/twitter/common/net-http-handlers/0.0.71/net-http-handlers-0.0.71.jar
Download http://repo1.maven.org/maven2/com/google/inject/extensions/guice-multibindings/3.0/guice-multibindings-3.0.jar
Download http://maven.twttr.com/com/twitter/common/stats-time-series/0.0.56/stats-time-series-0.0.56.jar
Download http://maven.twttr.com/com/twitter/common/stats-jvm/0.0.46/stats-jvm-0.0.46.jar
Download http://maven.twttr.com/com/twitter/common/args-apt/0.1.11/args-apt-0.1.11.jar
Download http://maven.twttr.com/com/twitter/common/args-core/0.1.12/args-core-0.1.12.jar
Download http://maven.twttr.com/com/twitter/common/util-system-mocks/0.0.72/util-system-mocks-0.0.72.jar
Download http://repo1.maven.org/maven2/commons-io/commons-io/2.1/commons-io-2.1.jar
Download http://repo1.maven.org/maven2/joda-time/joda-time/2.3/joda-time-2.3.jar
Download http://repo1.maven.org/maven2/org/joda/joda-convert/1.5/joda-convert-1.5.jar
Download http://maven.twttr.com/com/twitter/common/stat-registry/0.0.27/stat-registry-0.0.27.jar
Download http://maven.twttr.com/com/twitter/common/stats-provider/0.0.57/stats-provider-0.0.57.jar
Download http://maven.twttr.com/com/twitter/common/util-sampler/0.0.53/util-sampler-0.0.53.jar
Download http://maven.twttr.com/com/twitter/common/net-pool/0.0.60/net-pool-0.0.60.jar
Download http://maven.twttr.com/com/google/testing/test-libraries-for-java/1.1.1/test-libraries-for-java-1.1.1.jar
Download http://maven.twttr.com/com/twitter/common/net-http-handlers-text/0.0.31/net-http-handlers-text-0.0.31.jar
Download http://maven.twttr.com/com/twitter/common/net-http-handlers-params/0.0.17/net-http-handlers-params-0.0.17.jar
Download http://maven.twttr.com/com/twitter/common/net-http-handlers-string-template/0.0.51/net-http-handlers-string-template-0.0.51.jar
Download http://maven.twttr.com/com/twitter/common/stat/0.0.29/stat-0.0.29.jar
Note: Writing <https://builds.apache.org/job/Aurora/ws/dist/classes/main/com/twitter/common/args/apt/cmdline.arg.info.txt.2>
:processResources
:classes
:jar
:assemble
:jsHint
Download http://repo1.maven.org/maven2/org/mozilla/rhino/1.7R3/rhino-1.7R3.pom
Download http://repo1.maven.org/maven2/org/mozilla/rhino/1.7R3/rhino-1.7R3.jar
:checkstyleMain
Download http://repo1.maven.org/maven2/com/puppycrawl/tools/checkstyle/5.6/checkstyle-5.6.pom
Download http://repo1.maven.org/maven2/com/puppycrawl/tools/checkstyle/5.6/checkstyle-5.6.jar
[ant:checkstyle] <https://builds.apache.org/job/Aurora/ws/src/main/java/org/apache/aurora/scheduler/DriverFactory.java>:105:
Line is longer than 100 characters (found 113).
[ant:checkstyle] <https://builds.apache.org/job/Aurora/ws/src/main/java/org/apache/aurora/scheduler/DriverFactory.java>:106:
Line is longer than 100 characters (found 111).
:checkstyleMain FAILED

FAILURE: Build failed with an exception.

* What went wrong:
Execution failed for task ':checkstyleMain'.
> Checkstyle rule violations were found. See the report at: file://<https://builds.apache.org/job/Aurora/ws/dist/reports/checkstyle/main.xml>

* Try:
Run with --info or --debug option to get more log output.

* Exception is:
org.gradle.api.tasks.TaskExecutionException: Execution failed for task ':checkstyleMain'.
	at org.gradle.api.internal.tasks.execution.ExecuteActionsTaskExecuter.executeActions(ExecuteActionsTaskExecuter.java:69)
	at org.gradle.api.internal.tasks.execution.ExecuteActionsTaskExecuter.execute(ExecuteActionsTaskExecuter.java:46)
	at org.gradle.api.internal.tasks.execution.PostExecutionAnalysisTaskExecuter.execute(PostExecutionAnalysisTaskExecuter.java:35)
	at org.gradle.api.internal.tasks.execution.SkipUpToDateTaskExecuter.execute(SkipUpToDateTaskExecuter.java:64)
	at org.gradle.api.internal.tasks.execution.ValidatingTaskExecuter.execute(ValidatingTaskExecuter.java:58)
	at org.gradle.api.internal.tasks.execution.SkipEmptySourceFilesTaskExecuter.execute(SkipEmptySourceFilesTaskExecuter.java:42)
	at org.gradle.api.internal.tasks.execution.SkipTaskWithNoActionsExecuter.execute(SkipTaskWithNoActionsExecuter.java:52)
	at org.gradle.api.internal.tasks.execution.SkipOnlyIfTaskExecuter.execute(SkipOnlyIfTaskExecuter.java:53)
	at org.gradle.api.internal.tasks.execution.ExecuteAtMostOnceTaskExecuter.execute(ExecuteAtMostOnceTaskExecuter.java:43)
	at org.gradle.api.internal.AbstractTask.executeWithoutThrowingTaskFailure(AbstractTask.java:289)
	at org.gradle.execution.taskgraph.AbstractTaskPlanExecutor$TaskExecutorWorker.executeTask(AbstractTaskPlanExecutor.java:79)
	at org.gradle.execution.taskgraph.AbstractTaskPlanExecutor$TaskExecutorWorker.processTask(AbstractTaskPlanExecutor.java:63)
	at org.gradle.execution.taskgraph.AbstractTaskPlanExecutor$TaskExecutorWorker.run(AbstractTaskPlanExecutor.java:51)
	at org.gradle.execution.taskgraph.DefaultTaskPlanExecutor.process(DefaultTaskPlanExecutor.java:23)
	at org.gradle.execution.taskgraph.DefaultTaskGraphExecuter.execute(DefaultTaskGraphExecuter.java:86)
	at org.gradle.execution.SelectedTaskExecutionAction.execute(SelectedTaskExecutionAction.java:29)
	at org.gradle.execution.DefaultBuildExecuter.execute(DefaultBuildExecuter.java:61)
	at org.gradle.execution.DefaultBuildExecuter.access$200(DefaultBuildExecuter.java:23)
	at org.gradle.execution.DefaultBuildExecuter$2.proceed(DefaultBuildExecuter.java:67)
	at org.gradle.execution.DryRunBuildExecutionAction.execute(DryRunBuildExecutionAction.java:32)
	at org.gradle.execution.DefaultBuildExecuter.execute(DefaultBuildExecuter.java:61)
	at org.gradle.execution.DefaultBuildExecuter.execute(DefaultBuildExecuter.java:54)
	at org.gradle.initialization.DefaultGradleLauncher.doBuildStages(DefaultGradleLauncher.java:166)
	at org.gradle.initialization.DefaultGradleLauncher.doBuild(DefaultGradleLauncher.java:113)
	at org.gradle.initialization.DefaultGradleLauncher.run(DefaultGradleLauncher.java:81)
	at org.gradle.launcher.exec.InProcessBuildActionExecuter$DefaultBuildController.run(InProcessBuildActionExecuter.java:64)
	at org.gradle.launcher.cli.ExecuteBuildAction.run(ExecuteBuildAction.java:33)
	at org.gradle.launcher.cli.ExecuteBuildAction.run(ExecuteBuildAction.java:24)
	at org.gradle.launcher.exec.InProcessBuildActionExecuter.execute(InProcessBuildActionExecuter.java:35)
	at org.gradle.launcher.exec.InProcessBuildActionExecuter.execute(InProcessBuildActionExecuter.java:26)
	at org.gradle.launcher.cli.RunBuildAction.run(RunBuildAction.java:50)
	at org.gradle.internal.Actions$RunnableActionAdapter.execute(Actions.java:171)
	at org.gradle.launcher.cli.CommandLineActionFactory$ParseAndBuildAction.execute(CommandLineActionFactory.java:201)
	at org.gradle.launcher.cli.CommandLineActionFactory$ParseAndBuildAction.execute(CommandLineActionFactory.java:174)
	at org.gradle.launcher.cli.CommandLineActionFactory$WithLogging.execute(CommandLineActionFactory.java:170)
	at org.gradle.launcher.cli.CommandLineActionFactory$WithLogging.execute(CommandLineActionFactory.java:139)
	at org.gradle.launcher.cli.ExceptionReportingAction.execute(ExceptionReportingAction.java:33)
	at org.gradle.launcher.cli.ExceptionReportingAction.execute(ExceptionReportingAction.java:22)
	at org.gradle.launcher.Main.doAction(Main.java:46)
	at org.gradle.launcher.bootstrap.EntryPoint.run(EntryPoint.java:45)
	at org.gradle.launcher.Main.main(Main.java:37)
	at org.gradle.launcher.bootstrap.ProcessBootstrap.runNoExit(ProcessBootstrap.java:50)
	at org.gradle.launcher.bootstrap.ProcessBootstrap.run(ProcessBootstrap.java:32)
	at org.gradle.launcher.GradleMain.main(GradleMain.java:23)
	at org.gradle.wrapper.BootstrapMainStarter.start(BootstrapMainStarter.java:30)
	at org.gradle.wrapper.WrapperExecutor.execute(WrapperExecutor.java:127)
	at org.gradle.wrapper.GradleWrapperMain.main(GradleWrapperMain.java:55)
Caused by: org.gradle.api.GradleException: Checkstyle rule violations were found. See the
report at: file://<https://builds.apache.org/job/Aurora/ws/dist/reports/checkstyle/main.xml>
	at org.gradle.api.plugins.quality.Checkstyle$_run_closure1.doCall(Checkstyle.groovy:187)
	at org.gradle.api.internal.ClosureBackedAction.execute(ClosureBackedAction.java:58)
	at org.gradle.util.ConfigureUtil.configure(ConfigureUtil.java:130)
	at org.gradle.util.ConfigureUtil.configure(ConfigureUtil.java:91)
	at org.gradle.util.ConfigureUtil$configure.call(Unknown Source)
	at org.gradle.api.internal.project.DefaultIsolatedAntBuilder.execute(DefaultIsolatedAntBuilder.groovy:116)
	at org.gradle.api.internal.project.IsolatedAntBuilder$execute.call(Unknown Source)
	at org.gradle.api.plugins.quality.Checkstyle.run(Checkstyle.groovy:159)
	at org.gradle.internal.reflect.JavaMethod.invoke(JavaMethod.java:63)
	at org.gradle.api.internal.project.taskfactory.AnnotationProcessingTaskFactory$StandardTaskAction.doExecute(AnnotationProcessingTaskFactory.java:219)
	at org.gradle.api.internal.project.taskfactory.AnnotationProcessingTaskFactory$StandardTaskAction.execute(AnnotationProcessingTaskFactory.java:212)
	at org.gradle.api.internal.project.taskfactory.AnnotationProcessingTaskFactory$StandardTaskAction.execute(AnnotationProcessingTaskFactory.java:201)
	at org.gradle.api.internal.AbstractTask$TaskActionWrapper.execute(AbstractTask.java:533)
	at org.gradle.api.internal.AbstractTask$TaskActionWrapper.execute(AbstractTask.java:516)
	at org.gradle.api.internal.tasks.execution.ExecuteActionsTaskExecuter.executeAction(ExecuteActionsTaskExecuter.java:80)
	at org.gradle.api.internal.tasks.execution.ExecuteActionsTaskExecuter.executeActions(ExecuteActionsTaskExecuter.java:61)
	... 46 more


BUILD FAILED

Total time: 3 mins 33.244 secs
Build step 'Execute shell' marked build as failure
Recording test results

Mime
View raw message