aurora-dev mailing list archives

Site index · List index
Message view « Date » · « Thread »
Top « Date » · « Thread »
From Apache Jenkins Server <jenk...@builds.apache.org>
Subject Build failed in Jenkins: Aurora #465
Date Wed, 23 Jul 2014 05:00:08 GMT
See <https://builds.apache.org/job/Aurora/465/>

------------------------------------------
Started by user wfarner
Building remotely on ubuntu-5 (Ubuntu ubuntu) in workspace <https://builds.apache.org/job/Aurora/ws/>
Wiping out workspace first.
Cloning the remote Git repository
Cloning repository https://git-wip-us.apache.org/repos/asf/incubator-aurora.git
 > git init <https://builds.apache.org/job/Aurora/ws/>
Fetching upstream changes from https://git-wip-us.apache.org/repos/asf/incubator-aurora.git
 > git --version
 > git fetch --tags --progress https://git-wip-us.apache.org/repos/asf/incubator-aurora.git
+refs/heads/*:refs/remotes/origin/*
 > git config remote.origin.url https://git-wip-us.apache.org/repos/asf/incubator-aurora.git
 > git config remote.origin.fetch +refs/heads/*:refs/remotes/origin/*
 > git config remote.origin.url https://git-wip-us.apache.org/repos/asf/incubator-aurora.git
Fetching upstream changes from https://git-wip-us.apache.org/repos/asf/incubator-aurora.git
 > git fetch --tags --progress https://git-wip-us.apache.org/repos/asf/incubator-aurora.git
+refs/heads/*:refs/remotes/origin/*
 > git rev-parse origin/master^{commit}
Checking out Revision 2b78affb3129ffb42ef07217e2362f904ca35177 (origin/master)
 > git config core.sparsecheckout
 > git checkout -f 2b78affb3129ffb42ef07217e2362f904ca35177
 > git rev-list 2b78affb3129ffb42ef07217e2362f904ca35177
Cleaning workspace
 > git rev-parse --verify HEAD
Resetting working tree
 > git reset --hard
 > git clean -fdx
[Aurora] $ /bin/bash -xe /tmp/hudson4475567360457026036.sh
+ export GRADLE_OPTS=-Dorg.gradle.native=false
+ GRADLE_OPTS=-Dorg.gradle.native=false
+ ./build-support/jenkins/build.sh
+ date
Wed Jul 23 05:00:57 UTC 2014
+ ./gradlew -Pq clean build --stacktrace

FAILURE: Build failed with an exception.

* What went wrong:
Could not create service of type FileSystem using FileSystemServices.createFileSystem().

* Try:
Run with --info or --debug option to get more log output.

* Exception is:
org.gradle.internal.service.ServiceCreationException: Could not create service of type FileSystem
using FileSystemServices.createFileSystem().
	at org.gradle.internal.service.DefaultServiceRegistry$FactoryMethodService.invokeMethod(DefaultServiceRegistry.java:638)
	at org.gradle.internal.service.DefaultServiceRegistry$FactoryService.create(DefaultServiceRegistry.java:592)
	at org.gradle.internal.service.DefaultServiceRegistry$ManagedObjectProvider.getInstance(DefaultServiceRegistry.java:434)
	at org.gradle.internal.service.DefaultServiceRegistry$SingletonService.get(DefaultServiceRegistry.java:474)
	at org.gradle.internal.service.DefaultServiceRegistry.doGet(DefaultServiceRegistry.java:295)
	at org.gradle.internal.service.DefaultServiceRegistry.get(DefaultServiceRegistry.java:279)
	at org.gradle.internal.nativeplatform.services.FileSystems.getDefault(FileSystems.java:22)
	at org.gradle.initialization.DefaultCommandLineConverter.<init>(DefaultCommandLineConverter.java:64)
	at org.gradle.launcher.cli.BuildActionsFactory.<init>(BuildActionsFactory.java:71)
	at org.gradle.launcher.cli.CommandLineActionFactory.createActionFactories(CommandLineActionFactory.java:66)
	at org.gradle.launcher.cli.CommandLineActionFactory$ParseAndBuildAction.execute(CommandLineActionFactory.java:186)
	at org.gradle.launcher.cli.CommandLineActionFactory$ParseAndBuildAction.execute(CommandLineActionFactory.java:174)
	at org.gradle.launcher.cli.CommandLineActionFactory$WithLogging.execute(CommandLineActionFactory.java:170)
	at org.gradle.launcher.cli.CommandLineActionFactory$WithLogging.execute(CommandLineActionFactory.java:139)
	at org.gradle.launcher.cli.ExceptionReportingAction.execute(ExceptionReportingAction.java:33)
	at org.gradle.launcher.cli.ExceptionReportingAction.execute(ExceptionReportingAction.java:22)
	at org.gradle.launcher.Main.doAction(Main.java:46)
	at org.gradle.launcher.bootstrap.EntryPoint.run(EntryPoint.java:45)
	at org.gradle.launcher.Main.main(Main.java:37)
	at org.gradle.launcher.bootstrap.ProcessBootstrap.runNoExit(ProcessBootstrap.java:50)
	at org.gradle.launcher.bootstrap.ProcessBootstrap.run(ProcessBootstrap.java:32)
	at org.gradle.launcher.GradleMain.main(GradleMain.java:23)
	at org.gradle.wrapper.BootstrapMainStarter.start(BootstrapMainStarter.java:30)
	at org.gradle.wrapper.WrapperExecutor.execute(WrapperExecutor.java:127)
	at org.gradle.wrapper.GradleWrapperMain.main(GradleWrapperMain.java:55)
Caused by: net.rubygrapefruit.platform.NativeException: Failed to load native library 'libnative-platform.so'
for Linux i386.
	at net.rubygrapefruit.platform.internal.NativeLibraryLoader.load(NativeLibraryLoader.java:49)
	at net.rubygrapefruit.platform.Native.init(Native.java:55)
	at net.rubygrapefruit.platform.Native.get(Native.java:80)
	at org.gradle.internal.nativeplatform.filesystem.FileSystemServices.createFileSystem(FileSystemServices.java:43)
	at org.gradle.internal.reflect.JavaMethod.invoke(JavaMethod.java:63)
	at org.gradle.internal.service.DefaultServiceRegistry.invoke(DefaultServiceRegistry.java:323)
	at org.gradle.internal.service.DefaultServiceRegistry.access$1200(DefaultServiceRegistry.java:53)
	at org.gradle.internal.service.DefaultServiceRegistry$FactoryMethodService.invokeMethod(DefaultServiceRegistry.java:636)
	... 24 more
Caused by: java.lang.UnsatisfiedLinkError: /tmp/native-platform4445950129050312642dir/libnative-platform.so:
libstdc++.so.6: cannot open shared object file: No such file or directory
	at net.rubygrapefruit.platform.internal.NativeLibraryLoader.load(NativeLibraryLoader.java:45)
	... 31 more

Build step 'Execute shell' marked build as failure

Mime
View raw message