aurora-dev mailing list archives

Site index · List index
Message view « Date » · « Thread »
Top « Date » · « Thread »
From Apache Jenkins Server <jenk...@builds.apache.org>
Subject Build failed in Jenkins: Aurora #446
Date Mon, 21 Jul 2014 22:07:31 GMT
See <https://builds.apache.org/job/Aurora/446/changes>

Changes:

[wfarner] Instruct jacoco gradle plugin to save coverage details needed by jacoco jenkins
plugin.

------------------------------------------
[...truncated 3943 lines...]
WARNING:root:* Job ambiguously specified - querying the scheduler to disambiguate
WARNING:root:********************************************************************************
WARNING:root:
CRITICAL:root:No jobs found
PASSED

=========================== 6 passed in 0.55 seconds ===========================
============================= test session starts ==============================
platform linux2 -- Python 2.7.3 -- py-1.4.22 -- pytest-2.6.0 -- /usr/bin/python2.7
plugins: cov, timeout
collecting ... collected 4 items

src/test/python/apache/aurora/common/test_clusters.py@61::test_load_json PASSED
src/test/python/apache/aurora/common/test_clusters.py@74::test_load_yaml PASSED
src/test/python/apache/aurora/common/test_clusters.py@82::test_load_without_yaml_loader PASSED
src/test/python/apache/aurora/common/test_clusters.py@93::test_load_invalid_syntax PASSED

=========================== 4 passed in 0.19 seconds ===========================
============================= test session starts ==============================
platform linux2 -- Python 2.7.3 -- py-1.4.22 -- pytest-2.6.0 -- /usr/bin/python2.7
plugins: cov, timeout
collecting ... collected 12 items

src/test/python/apache/aurora/client/api/test_instance_watcher.py@158::InstanceWatcherTest::test_all_instance_failure
PASSED
src/test/python/apache/aurora/client/api/test_instance_watcher.py@149::InstanceWatcherTest::test_io_failure
ERROR:root:IO Exception during scheduler call: oops
ERROR:root:IO Exception during scheduler call: oops
ERROR:root:IO Exception during scheduler call: oops
ERROR:root:IO Exception during scheduler call: oops
ERROR:root:IO Exception during scheduler call: oops
ERROR:root:IO Exception during scheduler call: oops
ERROR:root:IO Exception during scheduler call: oops
ERROR:root:IO Exception during scheduler call: oops
ERROR:root:IO Exception during scheduler call: oops
ERROR:root:IO Exception during scheduler call: oops
ERROR:root:IO Exception during scheduler call: oops
ERROR:root:IO Exception during scheduler call: oops
ERROR:root:IO Exception during scheduler call: oops
ERROR:root:IO Exception during scheduler call: oops
ERROR:root:IO Exception during scheduler call: oops
ERROR:root:IO Exception during scheduler call: oops
ERROR:root:IO Exception during scheduler call: oops
ERROR:root:IO Exception during scheduler call: oops
PASSED
src/test/python/apache/aurora/client/api/test_instance_watcher.py@178::InstanceWatcherTest::test_restart_threshold
PASSED
src/test/python/apache/aurora/client/api/test_instance_watcher.py@168::InstanceWatcherTest::test_restart_threshold_fail_fast
PASSED
src/test/python/apache/aurora/client/api/test_instance_watcher.py@139::InstanceWatcherTest::test_single_instance_failure
PASSED
src/test/python/apache/aurora/client/api/test_instance_watcher.py@205::InstanceWatcherTest::test_single_watch_period_failure
PASSED
src/test/python/apache/aurora/client/api/test_instance_watcher.py@129::InstanceWatcherTest::test_successful_watch
PASSED
src/test/python/apache/aurora/client/api/test_instance_watcher.py@192::InstanceWatcherTest::test_watch_period_failure
PASSED
src/test/python/apache/aurora/client/api/test_health_check.py@68::HealthCheckTest::test_changed_task_id
PASSED
src/test/python/apache/aurora/client/api/test_health_check.py@61::HealthCheckTest::test_failed_status_health_check
PASSED
src/test/python/apache/aurora/client/api/test_health_check.py@75::HealthCheckTest::test_health_statuses
PASSED
src/test/python/apache/aurora/client/api/test_health_check.py@54::HealthCheckTest::test_simple_status_health_check
PASSED

========================== 12 passed in 0.34 seconds ===========================
============================= test session starts ==============================
platform linux2 -- Python 2.7.3 -- py-1.4.22 -- pytest-2.6.0 -- /usr/bin/python2.7
plugins: cov, timeout
collecting ... collected 10 items

src/test/python/apache/aurora/config/test_thrift.py@45::test_simple_config PASSED
src/test/python/apache/aurora/config/test_thrift.py@69::test_config_with_options PASSED
src/test/python/apache/aurora/config/test_thrift.py@94::test_config_with_ports PASSED
src/test/python/apache/aurora/config/test_thrift.py@108::test_config_with_bad_resources PASSED
src/test/python/apache/aurora/config/test_thrift.py@134::test_config_with_task_links PASSED
src/test/python/apache/aurora/config/test_thrift.py@155::test_unbound_references PASSED
src/test/python/apache/aurora/config/test_thrift.py@169::test_cron_policy_alias PASSED
src/test/python/apache/aurora/config/test_thrift.py@193::test_metadata_in_config PASSED
src/test/python/apache/aurora/config/test_thrift.py@204::test_task_instance_from_job PASSED
src/test/python/apache/aurora/config/test_thrift.py@209::test_identifier_validation PASSED

========================== 10 passed in 2.00 seconds ===========================
============================= test session starts ==============================
platform linux2 -- Python 2.7.3 -- py-1.4.22 -- pytest-2.6.0 -- /usr/bin/python2.7
plugins: cov, timeout
collecting ... collected 1 items

src/test/python/apache/aurora/common/test_cluster.py@21::test_simple PASSED

=========================== 1 passed in 0.04 seconds ===========================
============================= test session starts ==============================
platform linux2 -- Python 2.7.3 -- py-1.4.22 -- pytest-2.6.0 -- /usr/bin/python2.7
plugins: cov, timeout
collecting ... collected 20 items

src/test/python/apache/aurora/client/commands/test_admin.py@81::TestQueryCommand::test_query
test_role/test_job/0 RUNNING
PASSED
src/test/python/apache/aurora/client/commands/test_admin.py@96::TestQueryCommand::test_query_fails
CRITICAL:root:--force is required for expensive queries (no role specified)
PASSED
src/test/python/apache/aurora/client/commands/test_admin.py@131::TestIncreaseQuotaCommand::test_increase_quota
PASSED
src/test/python/apache/aurora/client/commands/test_admin.py@173::TestSetQuotaCommand::test_set_quota
PASSED
src/test/python/apache/aurora/client/commands/test_admin.py@218::TestGetLocksCommand::test_get_locks
PASSED
src/test/python/apache/aurora/client/commands/test_admin_sla.py@89::TestAdminSlaListSafeDomainCommand::test_safe_domain_exclude_hosts
PASSED
src/test/python/apache/aurora/client/commands/test_admin_sla.py@115::TestAdminSlaListSafeDomainCommand::test_safe_domain_exclude_hosts_from_list
PASSED
src/test/python/apache/aurora/client/commands/test_admin_sla.py@284::TestAdminSlaListSafeDomainCommand::test_safe_domain_grouping_error
CRITICAL:root:Unknown grouping function foo. Must be one of: ['by_host']
PASSED
src/test/python/apache/aurora/client/commands/test_admin_sla.py@272::TestAdminSlaListSafeDomainCommand::test_safe_domain_hosts_error
CRITICAL:root:Cannot specify both filename and list for the same option.
PASSED
src/test/python/apache/aurora/client/commands/test_admin_sla.py@138::TestAdminSlaListSafeDomainCommand::test_safe_domain_include_hosts
PASSED
src/test/python/apache/aurora/client/commands/test_admin_sla.py@167::TestAdminSlaListSafeDomainCommand::test_safe_domain_include_hosts_from_list
PASSED
src/test/python/apache/aurora/client/commands/test_admin_sla.py@246::TestAdminSlaListSafeDomainCommand::test_safe_domain_invalid_percentage
CRITICAL:root:Invalid percentage 0. Must be within (0, 100].
PASSED
src/test/python/apache/aurora/client/commands/test_admin_sla.py@221::TestAdminSlaListSafeDomainCommand::test_safe_domain_list_jobs
PASSED
src/test/python/apache/aurora/client/commands/test_admin_sla.py@257::TestAdminSlaListSafeDomainCommand::test_safe_domain_malformed_job_override
CRITICAL:root:Invalid line in /tmp/tmpW2fvBM:30 200s
PASSED
src/test/python/apache/aurora/client/commands/test_admin_sla.py@67::TestAdminSlaListSafeDomainCommand::test_safe_domain_no_options
PASSED
src/test/python/apache/aurora/client/commands/test_admin_sla.py@193::TestAdminSlaListSafeDomainCommand::test_safe_domain_override_jobs
PASSED
src/test/python/apache/aurora/client/commands/test_admin_sla.py@395::TestAdminSlaProbeHostsCommand::test_probe_grouping_error
CRITICAL:root:Unknown grouping function foo. Must be one of: ['by_host']
PASSED
src/test/python/apache/aurora/client/commands/test_admin_sla.py@380::TestAdminSlaProbeHostsCommand::test_probe_hosts_error
CRITICAL:root:Please specify either --filename or --hosts
PASSED
src/test/python/apache/aurora/client/commands/test_admin_sla.py@351::TestAdminSlaProbeHostsCommand::test_probe_hosts_with_file
PASSED
src/test/python/apache/aurora/client/commands/test_admin_sla.py@323::TestAdminSlaProbeHostsCommand::test_probe_hosts_with_list
PASSED

========================== 20 passed in 0.70 seconds ===========================
============================= test session starts ==============================
platform linux2 -- Python 2.7.3 -- py-1.4.22 -- pytest-2.6.0 -- /usr/bin/python2.7
plugins: cov, timeout
collecting ... collected 1 items

src/test/python/apache/aurora/common/test_aurora_job_key.py@22::AuroraJobKeyTest::test_basic
PASSED

=========================== 1 passed in 0.09 seconds ===========================
============================= test session starts ==============================
platform linux2 -- Python 2.7.3 -- py-1.4.22 -- pytest-2.6.0 -- /usr/bin/python2.7
plugins: cov, timeout
collecting ... collected 31 items

src/test/python/apache/aurora/client/commands/test_cancel_update.py@113::TestClientCancelUpdateCommand::test_cancel_update_api_level
PASSED
src/test/python/apache/aurora/client/commands/test_cancel_update.py@83::TestClientCancelUpdateCommand::test_simple_successful_cancel_update
PASSED
src/test/python/apache/aurora/client/commands/test_create.py@172::TestClientCreateCommand::test_create_job_failed
PASSED
src/test/python/apache/aurora/client/commands/test_create.py@226::TestClientCreateCommand::test_create_job_failed_invalid_config
PASSED
src/test/python/apache/aurora/client/commands/test_create.py@249::TestClientCreateCommand::test_create_job_failed_invalid_config_two
PASSED
src/test/python/apache/aurora/client/commands/test_create.py@139::TestClientCreateCommand::test_create_job_wait_until_finished
PASSED
src/test/python/apache/aurora/client/commands/test_create.py@196::TestClientCreateCommand::test_delayed_job
PASSED
src/test/python/apache/aurora/client/commands/test_create.py@96::TestClientCreateCommand::test_simple_successful_create_job
PASSED
src/test/python/apache/aurora/client/commands/test_diff.py@142::TestDiffCommand::test_diff_invalid_config
PASSED
src/test/python/apache/aurora/client/commands/test_diff.py@168::TestDiffCommand::test_diff_server_error
CRITICAL:root:Request failed, server responded with "No tasks found for query"
PASSED
src/test/python/apache/aurora/client/commands/test_diff.py@107::TestDiffCommand::test_successful_diff
PASSED
src/test/python/apache/aurora/client/commands/test_kill.py@249::TestClientKillCommand::test_kill_job_api_level
PASSED
src/test/python/apache/aurora/client/commands/test_kill.py@282::TestClientKillCommand::test_kill_job_api_level_with_shards
PASSED
src/test/python/apache/aurora/client/commands/test_kill.py@316::TestClientKillCommand::test_kill_job_api_level_with_shards_batched
PASSED
src/test/python/apache/aurora/client/commands/test_kill.py@346::TestClientKillCommand::test_kill_job_api_level_with_shards_batched_and_some_errors
ERROR IN KILL_JOB
ERROR IN KILL_JOB
Warning: errors occurred during batch kill
PASSED
src/test/python/apache/aurora/client/commands/test_kill.py@135::TestClientKillCommand::test_kill_job_noshards_fail
Shards option is required for kill; use killall to kill all shards
PASSED
src/test/python/apache/aurora/client/commands/test_kill.py@96::TestClientKillCommand::test_kill_job_tasks_not_killed_in_time
CRITICAL:root:Tasks were not killed in time.
PASSED
src/test/python/apache/aurora/client/commands/test_kill.py@154::TestClientKillCommand::test_simple_successful_killall_job
PASSED
src/test/python/apache/aurora/client/commands/test_kill.py@213::TestClientKillCommand::test_successful_batched_killall_job
PASSED
src/test/python/apache/aurora/client/commands/test_listjobs.py@68::TestListJobs::test_listjobs_badcluster
CRITICAL:root:Unknown cluster: smoof
PASSED
src/test/python/apache/aurora/client/commands/test_listjobs.py@52::TestListJobs::test_successful_listjobs
west/mchucarroll/test/bar	'<Mock name='mock.cronSchedule' id='61887568'>'	<Mock name='mock.cronCollisionPolicy'
id='61887632'>
west/mchucarroll/test/foo	'<Mock name='mock.cronSchedule' id='61887696'>'	<Mock name='mock.cronCollisionPolicy'
id='61887760'>
west/mchucarroll/test/baz	'<Mock name='mock.cronSchedule' id='61887824'>'	<Mock name='mock.cronCollisionPolicy'
id='61887888'>
PASSED
src/test/python/apache/aurora/client/commands/test_restart.py@189::TestRestartCommand::test_restart_failed_restart
ERROR:root:Error restarting instances: Damn
PASSED
src/test/python/apache/aurora/client/commands/test_restart.py@165::TestRestartCommand::test_restart_failed_status
PASSED
src/test/python/apache/aurora/client/commands/test_restart.py@103::TestRestartCommand::test_restart_simple
PASSED
src/test/python/apache/aurora/client/commands/test_restart.py@135::TestRestartCommand::test_restart_simple_invalid_max_failures
max_total_failures option must be >0, but you specified -1
PASSED
src/test/python/apache/aurora/client/commands/test_status.py@99::TestListJobs::test_successful_status
PASSED
src/test/python/apache/aurora/client/commands/test_status.py@131::TestListJobs::test_successful_status_nometadata
PASSED
src/test/python/apache/aurora/client/commands/test_status.py@116::TestListJobs::test_unsuccessful_status
PASSED
src/test/python/apache/aurora/client/commands/test_update.py@71::TestUpdateCommand::test_update_command_line_succeeds
PASSED
src/test/python/apache/aurora/client/commands/test_update.py@92::TestUpdateCommand::test_update_invalid_config
PASSED
src/test/python/apache/aurora/client/commands/test_update.py@210::TestUpdateCommand::test_updater_simple
PASSED

========================== 31 passed in 1.94 seconds ===========================
============================= test session starts ==============================
platform linux2 -- Python 2.7.3 -- py-1.4.22 -- pytest-2.6.0 -- /usr/bin/python2.7
plugins: cov, timeout
collecting ... collected 2 items

src/test/python/apache/aurora/common/test_cluster_option.py@32::test_constructors PASSED
src/test/python/apache/aurora/common/test_cluster_option.py@46::test_parsable tmpApn9zx: error:
borg is not a valid cluster for the --source_cluster option. Valid options for clusters are
smf1 smf1-test
FAILED

=================================== FAILURES ===================================
________________________________ test_parsable _________________________________

capsys = <_pytest.capture.CaptureFixture instance at 0x2537ef0>

    def test_parsable(capsys):
      parser = options.parser().options((
        ClusterOption('--source_cluster', '-s', clusters=CLUSTER_LIST),
        ClusterOption('--dest_cluster', clusters=CLUSTER_LIST),
        ClusterOption('--cluster', cluster_provider=cluster_provider)))
    
      values, _ = parser.parse(['--source_cluster=smf1-test', '--cluster=smf1-test'])
      assert isinstance(values.source_cluster, Cluster)
      assert isinstance(values.cluster, Cluster)
    
      with pytest.raises(SystemExit):
        parser.parse(['--source_cluster=borg'])
    
>     out, err = capsys.readouterr()

src/test/python/apache/aurora/common/test_cluster_option.py:59: 
_ _ _ _ _ _ _ _ _ _ _ _ _ _ _ _ _ _ _ _ _ _ _ _ _ _ _ _ _ _ _ _ _ _ _ _ _ _ _ _ 

self = <_pytest.capture.CaptureFixture instance at 0x2537ef0>

    def readouterr(self):
        try:
            return self._capture.readouterr()
        except AttributeError:
>           return self._outerr
E           AttributeError: CaptureFixture instance has no attribute '_outerr'

/tmp/tmpApn9zx/.deps/pytest-2.6.0-py2.py3-none-any.whl/_pytest/capture.py:205: AttributeError
!!!!!!!!!!!!!!!!!!!! Interrupted: stopping after 1 failures !!!!!!!!!!!!!!!!!!!!
====================== 1 failed, 1 passed in 0.11 seconds ======================
Build operating on top level addresses: set([BuildFileAddress(src/test/python/BUILD, all)])
src.test.python.apache.aurora.client.api.disambiguator                          .....   SUCCESS
src.test.python.apache.aurora.client.api.instance_watcher                       .....   SUCCESS
src.test.python.apache.aurora.client.api.job_monitor                            .....   SUCCESS
src.test.python.apache.aurora.client.api.updater                                .....   SUCCESS
src.test.python.apache.aurora.client.binding_helper                             .....   SUCCESS
src.test.python.apache.aurora.client.cli.config                                 .....   SUCCESS
src.test.python.apache.aurora.client.cli.job                                    .....   SUCCESS
src.test.python.apache.aurora.client.cli.sla                                    .....   SUCCESS
src.test.python.apache.aurora.client.cli.task                                   .....   SUCCESS
src.test.python.apache.aurora.client.commands.admin                             .....   SUCCESS
src.test.python.apache.aurora.client.commands.core                              .....   SUCCESS
src.test.python.apache.aurora.client.config                                     .....   SUCCESS
src.test.python.apache.aurora.client.hooks.hooked_api                           .....   SUCCESS
src.test.python.apache.aurora.client.hooks.non_hooked_api                       .....   SUCCESS
src.test.python.apache.aurora.common.test_aurora_job_key                        .....   SUCCESS
src.test.python.apache.aurora.common.test_cluster                               .....   SUCCESS
src.test.python.apache.aurora.common.test_cluster_option                        .....   FAILURE
src.test.python.apache.aurora.common.test_clusters                              .....   SUCCESS
src.test.python.apache.aurora.common.test_http_signaler                         .....   SUCCESS
src.test.python.apache.aurora.config.test_loader                                .....   SUCCESS
src.test.python.apache.aurora.config.test_thrift                                .....   SUCCESS
src.test.python.apache.aurora.executor.common.directory_sandbox                 .....   SUCCESS
src.test.python.apache.aurora.executor.common.task_info                         .....   SUCCESS
src.test.python.apache.aurora.executor.executor_vars                            .....   SUCCESS
src.test.python.apache.thermos.bin.test_thermos                                 .....   SUCCESS
src.test.python.apache.thermos.common.test_pathspec                             .....   SUCCESS
src.test.python.apache.thermos.common.test_task_planner                         .....   SUCCESS
src.test.python.apache.thermos.core.test_failing_runner                         .....   SUCCESS
src.test.python.apache.thermos.core.test_runner_integration                     .....   SUCCESS
src.test.python.apache.thermos.monitoring.test_disk                             .....   SUCCESS
Build step 'Execute shell' marked build as failure

Mime
View raw message