atlas-dev mailing list archives

Site index · List index
Message view « Date » · « Thread »
Top « Date » · « Thread »
From Apache Jenkins Server <jenk...@builds.apache.org>
Subject Build failed in Jenkins: Atlas-master-NoTests #2393
Date Wed, 12 Sep 2018 03:18:02 GMT
See <https://builds.apache.org/job/Atlas-master-NoTests/2393/display/redirect>

------------------------------------------
[...truncated 139.46 KB...]
[INFO] --- maven-jar-plugin:2.5:jar (default-jar) @ atlas-hbase-server-shaded ---
[INFO] Building jar: <https://builds.apache.org/job/Atlas-master-NoTests/ws/shaded/hbase-server-shaded/target/atlas-hbase-server-shaded-2.0.0-SNAPSHOT.jar>
[INFO] 
[INFO] --- maven-site-plugin:3.7:attach-descriptor (attach-descriptor) @ atlas-hbase-server-shaded
---
[INFO] Skipping because packaging 'jar' is not pom.
[INFO] 
[INFO] --- maven-shade-plugin:2.4.1:shade (default) @ atlas-hbase-server-shaded ---
[INFO] Including org.apache.hbase:hbase-server:jar:tests:1.1.2 in the shaded jar.
[INFO] Including org.apache.hbase:hbase-common:jar:1.1.2 in the shaded jar.
[INFO] Including org.apache.hbase:hbase-annotations:jar:1.1.2 in the shaded jar.
[INFO] Including org.apache.hbase:hbase-protocol:jar:1.1.2 in the shaded jar.
[INFO] Including org.apache.hbase:hbase-procedure:jar:1.1.2 in the shaded jar.
[INFO] Including org.apache.hbase:hbase-common:jar:tests:1.1.2 in the shaded jar.
[INFO] Including org.apache.hbase:hbase-client:jar:1.1.2 in the shaded jar.
[INFO] Including org.jruby.jcodings:jcodings:jar:1.0.8 in the shaded jar.
[INFO] Including org.jruby.joni:joni:jar:2.1.2 in the shaded jar.
[INFO] Including org.apache.hbase:hbase-prefix-tree:jar:1.1.2 in the shaded jar.
[INFO] Including commons-httpclient:commons-httpclient:jar:3.1 in the shaded jar.
[INFO] Including commons-codec:commons-codec:jar:1.9 in the shaded jar.
[INFO] Including commons-collections:commons-collections:jar:3.2.2 in the shaded jar.
[INFO] Including org.apache.hbase:hbase-hadoop-compat:jar:1.1.2 in the shaded jar.
[INFO] Including org.apache.hbase:hbase-hadoop2-compat:jar:1.1.2 in the shaded jar.
[INFO] Including com.yammer.metrics:metrics-core:jar:2.2.0 in the shaded jar.
[INFO] Including com.google.guava:guava:jar:12.0.1 in the shaded jar.
[INFO] Including com.google.code.findbugs:jsr305:jar:1.3.9 in the shaded jar.
[INFO] Including com.google.protobuf:protobuf-java:jar:2.5.0 in the shaded jar.
[INFO] Including com.sun.jersey:jersey-core:jar:1.19 in the shaded jar.
[INFO] Including javax.ws.rs:jsr311-api:jar:1.1.1 in the shaded jar.
[INFO] Including com.sun.jersey:jersey-server:jar:1.19 in the shaded jar.
[INFO] Including commons-cli:commons-cli:jar:1.4 in the shaded jar.
[INFO] Including commons-io:commons-io:jar:2.6 in the shaded jar.
[INFO] Including commons-lang:commons-lang:jar:2.6 in the shaded jar.
[INFO] Including commons-logging:commons-logging:jar:1.2 in the shaded jar.
[INFO] Including org.apache.commons:commons-math:jar:2.2 in the shaded jar.
[INFO] Including log4j:log4j:jar:1.2.17 in the shaded jar.
[INFO] Including org.apache.zookeeper:zookeeper:jar:3.4.6 in the shaded jar.
[INFO] Including org.mortbay.jetty:jetty:jar:6.1.26 in the shaded jar.
[INFO] Including org.mortbay.jetty:jetty-util:jar:6.1.26 in the shaded jar.
[INFO] Including org.mortbay.jetty:jetty-sslengine:jar:6.1.26 in the shaded jar.
[INFO] Including org.mortbay.jetty:jsp-2.1:jar:6.1.14 in the shaded jar.
[INFO] Including org.mortbay.jetty:jsp-api-2.1:jar:6.1.14 in the shaded jar.
[INFO] Excluding org.codehaus.jackson:jackson-core-asl:jar:1.9.13 from the shaded jar.
[INFO] Excluding org.codehaus.jackson:jackson-mapper-asl:jar:1.9.13 from the shaded jar.
[INFO] Excluding org.codehaus.jackson:jackson-jaxrs:jar:1.9.13 from the shaded jar.
[INFO] Including tomcat:jasper-compiler:jar:5.5.23 in the shaded jar.
[INFO] Including tomcat:jasper-runtime:jar:5.5.23 in the shaded jar.
[INFO] Including commons-el:commons-el:jar:1.0 in the shaded jar.
[INFO] Including org.jamon:jamon-runtime:jar:2.3.1 in the shaded jar.
[INFO] Including io.netty:netty-all:jar:4.0.23.Final in the shaded jar.
[INFO] Including org.apache.htrace:htrace-core:jar:3.1.0-incubating in the shaded jar.
[INFO] Including com.lmax:disruptor:jar:3.3.0 in the shaded jar.
[INFO] Including org.apache.hadoop:hadoop-common:jar:2.7.1 in the shaded jar.
[INFO] Including org.apache.hadoop:hadoop-annotations:jar:2.7.1 in the shaded jar.
[INFO] Including org.apache.commons:commons-math3:jar:3.1.1 in the shaded jar.
[INFO] Including xmlenc:xmlenc:jar:0.52 in the shaded jar.
[INFO] Including commons-net:commons-net:jar:3.1 in the shaded jar.
[INFO] Including com.sun.jersey:jersey-json:jar:1.9 in the shaded jar.
[INFO] Including org.codehaus.jettison:jettison:jar:1.3.7 in the shaded jar.
[INFO] Including com.sun.xml.bind:jaxb-impl:jar:2.2.3-1 in the shaded jar.
[INFO] Including net.java.dev.jets3t:jets3t:jar:0.9.0 in the shaded jar.
[INFO] Including org.apache.httpcomponents:httpcore:jar:4.4.1 in the shaded jar.
[INFO] Including com.jamesmurty.utils:java-xmlbuilder:jar:0.4 in the shaded jar.
[INFO] Including commons-configuration:commons-configuration:jar:1.10 in the shaded jar.
[INFO] Including org.apache.avro:avro:jar:1.7.4 in the shaded jar.
[INFO] Including com.thoughtworks.paranamer:paranamer:jar:2.3 in the shaded jar.
[INFO] Including org.xerial.snappy:snappy-java:jar:1.0.4.1 in the shaded jar.
[INFO] Including com.google.code.gson:gson:jar:2.2.4 in the shaded jar.
[INFO] Including com.jcraft:jsch:jar:0.1.42 in the shaded jar.
[INFO] Including org.apache.curator:curator-client:jar:2.11.0 in the shaded jar.
[INFO] Including org.apache.curator:curator-recipes:jar:2.11.0 in the shaded jar.
[INFO] Including org.apache.commons:commons-compress:jar:1.4.1 in the shaded jar.
[INFO] Including org.tukaani:xz:jar:1.0 in the shaded jar.
[INFO] Including org.apache.hadoop:hadoop-auth:jar:2.7.1 in the shaded jar.
[INFO] Including org.apache.httpcomponents:httpclient:jar:4.4.1 in the shaded jar.
[INFO] Including org.apache.directory.server:apacheds-kerberos-codec:jar:2.0.0-M15 in the
shaded jar.
[INFO] Including org.apache.directory.server:apacheds-i18n:jar:2.0.0-M15 in the shaded jar.
[INFO] Including org.apache.directory.api:api-asn1-api:jar:1.0.0-M20 in the shaded jar.
[INFO] Including org.apache.directory.api:api-util:jar:1.0.0-M20 in the shaded jar.
[INFO] Including org.apache.curator:curator-framework:jar:2.11.0 in the shaded jar.
[INFO] Including org.apache.hadoop:hadoop-client:jar:2.7.1 in the shaded jar.
[INFO] Including org.apache.hadoop:hadoop-mapreduce-client-app:jar:2.7.1 in the shaded jar.
[INFO] Including org.apache.hadoop:hadoop-mapreduce-client-common:jar:2.7.1 in the shaded
jar.
[INFO] Including org.apache.hadoop:hadoop-yarn-client:jar:2.7.1 in the shaded jar.
[INFO] Including org.apache.hadoop:hadoop-yarn-server-common:jar:2.7.1 in the shaded jar.
[INFO] Including org.apache.hadoop:hadoop-mapreduce-client-shuffle:jar:2.7.1 in the shaded
jar.
[INFO] Including org.apache.hadoop:hadoop-yarn-api:jar:2.7.1 in the shaded jar.
[INFO] Including org.apache.hadoop:hadoop-mapreduce-client-jobclient:jar:2.7.1 in the shaded
jar.
[INFO] Including org.apache.hadoop:hadoop-mapreduce-client-core:jar:2.5.1 in the shaded jar.
[INFO] Including org.apache.hadoop:hadoop-yarn-common:jar:2.5.1 in the shaded jar.
[INFO] Including javax.xml.bind:jaxb-api:jar:2.2.2 in the shaded jar.
[INFO] Including javax.xml.stream:stax-api:jar:1.0-2 in the shaded jar.
[INFO] Including javax.activation:activation:jar:1.1 in the shaded jar.
[INFO] Excluding org.codehaus.jackson:jackson-xc:jar:1.9.13 from the shaded jar.
[INFO] Including com.google.inject:guice:jar:3.0 in the shaded jar.
[INFO] Including javax.inject:javax.inject:jar:1 in the shaded jar.
[INFO] Including aopalliance:aopalliance:jar:1.0 in the shaded jar.
[INFO] Including com.sun.jersey.contribs:jersey-guice:jar:1.9 in the shaded jar.
[INFO] Including com.google.inject.extensions:guice-servlet:jar:3.0 in the shaded jar.
[INFO] Including org.apache.hadoop:hadoop-hdfs:jar:2.7.1 in the shaded jar.
[INFO] Including commons-daemon:commons-daemon:jar:1.0.13 in the shaded jar.
[INFO] Including xerces:xercesImpl:jar:2.9.1 in the shaded jar.
[INFO] Including xml-apis:xml-apis:jar:1.3.04 in the shaded jar.
[INFO] Including org.fusesource.leveldbjni:leveldbjni-all:jar:1.8 in the shaded jar.
[INFO] Including com.github.stephenc.findbugs:findbugs-annotations:jar:1.3.9-1 in the shaded
jar.
[INFO] Excluding org.slf4j:slf4j-api:jar:1.7.21 from the shaded jar.
[INFO] Excluding org.slf4j:slf4j-log4j12:jar:1.7.21 from the shaded jar.
[INFO] Excluding org.slf4j:jul-to-slf4j:jar:1.7.21 from the shaded jar.
[INFO] Including cglib:cglib:jar:2.2.2 in the shaded jar.
[INFO] Including asm:asm:jar:3.3.1 in the shaded jar.
[WARNING] jsp-2.1-6.1.14.jar, jasper-runtime-5.5.23.jar define 43 overlapping classes: 
[WARNING]   - org.apache.jasper.runtime.PerThreadTagHandlerPool$1
[WARNING]   - org.apache.jasper.runtime.JspFactoryImpl$PrivilegedGetPageContext
[WARNING]   - org.apache.jasper.runtime.PageContextImpl$4
[WARNING]   - org.apache.jasper.runtime.JspSourceDependent
[WARNING]   - org.apache.jasper.runtime.JspRuntimeLibrary$PrivilegedIntrospectHelper
[WARNING]   - org.apache.jasper.runtime.PageContextImpl$2
[WARNING]   - org.apache.jasper.Constants
[WARNING]   - org.apache.jasper.runtime.ProtectedFunctionMapper$2
[WARNING]   - org.apache.jasper.runtime.PageContextImpl
[WARNING]   - org.apache.jasper.runtime.PageContextImpl$11
[WARNING]   - 33 more...
[WARNING] jsp-2.1-6.1.14.jar, jasper-compiler-5.5.23.jar define 143 overlapping classes: 
[WARNING]   - org.apache.jasper.compiler.Node$Nodes
[WARNING]   - org.apache.jasper.compiler.tagplugin.TagPlugin
[WARNING]   - org.apache.jasper.compiler.JspUtil
[WARNING]   - org.apache.jasper.xmlparser.MyEntityResolver
[WARNING]   - org.apache.jasper.compiler.Validator$TagExtraInfoVisitor
[WARNING]   - org.apache.jasper.compiler.SmapGenerator
[WARNING]   - org.apache.jasper.compiler.SmapStratum
[WARNING]   - org.apache.jasper.compiler.tagplugin.TagPluginContext
[WARNING]   - org.apache.jasper.compiler.JasperTagInfo
[WARNING]   - org.apache.jasper.EmbeddedServletOptions
[WARNING]   - 133 more...
[WARNING] hadoop-yarn-api-2.7.1.jar, hadoop-yarn-common-2.5.1.jar define 3 overlapping classes:

[WARNING]   - org.apache.hadoop.yarn.util.package-info
[WARNING]   - org.apache.hadoop.yarn.factories.package-info
[WARNING]   - org.apache.hadoop.yarn.factory.providers.package-info
[WARNING] jsp-2.1-6.1.14.jar, jasper-compiler-5.5.23.jar, jasper-runtime-5.5.23.jar define
1 overlapping classes: 
[WARNING]   - org.apache.jasper.compiler.Localizer
[WARNING] maven-shade-plugin has detected that some class files are
[WARNING] present in two or more JARs. When this happens, only one
[WARNING] single version of the class is copied to the uber jar.
[WARNING] Usually this is not harmful and you can skip these warnings,
[WARNING] otherwise try to manually exclude artifacts based on
[WARNING] mvn dependency:tree -Ddetail=true and the above output.
[WARNING] See http://docs.codehaus.org/display/MAVENUSER/Shade+Plugin
[INFO] Replacing original artifact with shaded artifact.
[INFO] Replacing <https://builds.apache.org/job/Atlas-master-NoTests/ws/shaded/hbase-server-shaded/target/atlas-hbase-server-shaded-2.0.0-SNAPSHOT.jar>
with <https://builds.apache.org/job/Atlas-master-NoTests/ws/shaded/hbase-server-shaded/target/atlas-hbase-server-shaded-2.0.0-SNAPSHOT-shaded.jar>
[INFO] Dependency-reduced POM written at: <https://builds.apache.org/job/Atlas-master-NoTests/ws/shaded/hbase-server-shaded/dependency-reduced-pom.xml>
[INFO] 
[INFO] --- maven-failsafe-plugin:2.18.1:integration-test (integration-test) @ atlas-hbase-server-shaded
---
[INFO] Tests are skipped.
[INFO] 
[INFO] --- maven-source-plugin:2.4:jar-no-fork (attach-sources) @ atlas-hbase-server-shaded
---
[INFO] Building jar: <https://builds.apache.org/job/Atlas-master-NoTests/ws/shaded/hbase-server-shaded/target/atlas-hbase-server-shaded-2.0.0-SNAPSHOT-sources.jar>
[INFO] 
[INFO] --- maven-source-plugin:2.4:test-jar-no-fork (attach-sources) @ atlas-hbase-server-shaded
---
[INFO] Building jar: <https://builds.apache.org/job/Atlas-master-NoTests/ws/shaded/hbase-server-shaded/target/atlas-hbase-server-shaded-2.0.0-SNAPSHOT-test-sources.jar>
[INFO] 
[INFO] --- maven-failsafe-plugin:2.18.1:verify (verify) @ atlas-hbase-server-shaded ---
[INFO] Tests are skipped.
[INFO] 
[INFO] --- maven-checkstyle-plugin:2.9.1:check (checkstyle-check) @ atlas-hbase-server-shaded
---
[INFO] 
[INFO] >>> findbugs-maven-plugin:3.0.1:check (findbugs-check) > :findbugs @ atlas-hbase-server-shaded
>>>
[INFO] 
[INFO] --- findbugs-maven-plugin:3.0.1:findbugs (findbugs) @ atlas-hbase-server-shaded ---
[INFO] 
[INFO] <<< findbugs-maven-plugin:3.0.1:check (findbugs-check) < :findbugs @ atlas-hbase-server-shaded
<<<
[INFO] 
[INFO] 
[INFO] --- findbugs-maven-plugin:3.0.1:check (findbugs-check) @ atlas-hbase-server-shaded
---
[INFO] 
[INFO] --- maven-install-plugin:2.5.2:install (default-install) @ atlas-hbase-server-shaded
---
[INFO] Installing <https://builds.apache.org/job/Atlas-master-NoTests/ws/shaded/hbase-server-shaded/target/atlas-hbase-server-shaded-2.0.0-SNAPSHOT.jar>
to /home/jenkins/.m2/repository/org/apache/atlas/atlas-hbase-server-shaded/2.0.0-SNAPSHOT/atlas-hbase-server-shaded-2.0.0-SNAPSHOT.jar
[INFO] Installing <https://builds.apache.org/job/Atlas-master-NoTests/ws/shaded/hbase-server-shaded/dependency-reduced-pom.xml>
to /home/jenkins/.m2/repository/org/apache/atlas/atlas-hbase-server-shaded/2.0.0-SNAPSHOT/atlas-hbase-server-shaded-2.0.0-SNAPSHOT.pom
[INFO] ------------------------------------------------------------------------
[INFO] Reactor Summary:
[INFO] 
[INFO] Apache Atlas Server Build Tools 1.0 ................ SUCCESS [  1.339 s]
[INFO] apache-atlas 2.0.0-SNAPSHOT ........................ SUCCESS [  5.597 s]
[INFO] Apache Atlas Test Utility Tools .................... SUCCESS [  8.043 s]
[INFO] Apache Atlas Integration ........................... SUCCESS [  9.991 s]
[INFO] Apache Atlas Common ................................ SUCCESS [  2.507 s]
[INFO] Apache Atlas Client ................................ SUCCESS [  0.296 s]
[INFO] atlas-client-common ................................ SUCCESS [  1.487 s]
[INFO] atlas-client-v1 .................................... SUCCESS [  1.539 s]
[INFO] Apache Atlas Server API ............................ SUCCESS [  1.179 s]
[INFO] Apache Atlas Notification .......................... SUCCESS [  3.398 s]
[INFO] atlas-client-v2 .................................... SUCCESS [  1.331 s]
[INFO] Apache Atlas Graph Database Projects ............... SUCCESS [  0.165 s]
[INFO] Apache Atlas Graph Database API .................... SUCCESS [  1.056 s]
[INFO] Graph Database Common Code ......................... SUCCESS [  1.215 s]
[INFO] Apache Atlas JanusGraph DB Impl .................... SUCCESS [  9.455 s]
[INFO] Apache Atlas Graph Database Implementation Dependencies SUCCESS [  2.648 s]
[INFO] Shaded version of Apache hbase client .............. SUCCESS [ 11.510 s]
[INFO] Shaded version of Apache hbase server .............. FAILURE [ 28.785 s]
[INFO] Apache Atlas Authorization ......................... SKIPPED
[INFO] Apache Atlas Repository ............................ SKIPPED
[INFO] Apache Atlas UI .................................... SKIPPED
[INFO] Apache Atlas Web Application ....................... SKIPPED
[INFO] Apache Atlas Documentation ......................... SKIPPED
[INFO] Apache Atlas FileSystem Model ...................... SKIPPED
[INFO] Apache Atlas Plugin Classloader .................... SKIPPED
[INFO] Apache Atlas Hive Bridge Shim ...................... SKIPPED
[INFO] Apache Atlas Hive Bridge ........................... SKIPPED
[INFO] Apache Atlas Falcon Bridge Shim .................... SKIPPED
[INFO] Apache Atlas Falcon Bridge ......................... SKIPPED
[INFO] Apache Atlas Sqoop Bridge Shim ..................... SKIPPED
[INFO] Apache Atlas Sqoop Bridge .......................... SKIPPED
[INFO] Apache Atlas Storm Bridge Shim ..................... SKIPPED
[INFO] Apache Atlas Storm Bridge .......................... SKIPPED
[INFO] Apache Atlas Hbase Bridge Shim ..................... SKIPPED
[INFO] Apache Atlas Hbase Bridge .......................... SKIPPED
[INFO] Apache Atlas Kafka Bridge .......................... SKIPPED
[INFO] Apache Atlas Distribution 2.0.0-SNAPSHOT ........... SKIPPED
[INFO] ------------------------------------------------------------------------
[INFO] BUILD FAILURE
[INFO] ------------------------------------------------------------------------
[INFO] Total time: 01:34 min
[INFO] Finished at: 2018-09-12T03:17:58Z
[INFO] ------------------------------------------------------------------------
[ERROR] Failed to execute goal org.apache.maven.plugins:maven-install-plugin:2.5.2:install
(default-install) on project atlas-hbase-server-shaded: Failed to install metadata org.apache.atlas:atlas-hbase-server-shaded/maven-metadata.xml:
Could not parse metadata /home/jenkins/.m2/repository/org/apache/atlas/atlas-hbase-server-shaded/maven-metadata-local.xml:
in epilog non whitespace content is not allowed but got o (position: END_TAG seen ...</metadata>\no...
@12:2)  -> [Help 1]
[ERROR] 
[ERROR] To see the full stack trace of the errors, re-run Maven with the -e switch.
[ERROR] Re-run Maven using the -X switch to enable full debug logging.
[ERROR] 
[ERROR] For more information about the errors and possible solutions, please read the following
articles:
[ERROR] [Help 1] http://cwiki.apache.org/confluence/display/MAVEN/MojoExecutionException
[ERROR] 
[ERROR] After correcting the problems, you can resume the build with the command
[ERROR]   mvn <goals> -rf :atlas-hbase-server-shaded
Build step 'Execute shell' marked build as failure
[CHECKSTYLE] Collecting checkstyle analysis files...
[CHECKSTYLE] Searching for all files in <https://builds.apache.org/job/Atlas-master-NoTests/ws/>
that match the pattern **/target/checkstyle-result.xml
[CHECKSTYLE] No files found. Configuration error?
<Git Blamer> Using GitBlamer to create author and commit information for all warnings.
<Git Blamer> GIT_COMMIT=eae9761871af9aeecc0fdc2248b7c8555407d0a6, workspace=<https://builds.apache.org/job/Atlas-master-NoTests/ws/>
[CHECKSTYLE] Computing warning deltas based on reference build #2390
[FINDBUGS] Collecting findbugs analysis files...
[FINDBUGS] Searching for all files in <https://builds.apache.org/job/Atlas-master-NoTests/ws/>
that match the pattern **/target/findbugs.xml
[FINDBUGS] No files found. Configuration error?
<Git Blamer> Using GitBlamer to create author and commit information for all warnings.
<Git Blamer> GIT_COMMIT=eae9761871af9aeecc0fdc2248b7c8555407d0a6, workspace=<https://builds.apache.org/job/Atlas-master-NoTests/ws/>
[FINDBUGS] Computing warning deltas based on reference build #2390
Archiving artifacts
TestNG Reports Processing: START
Looking for TestNG results report in workspace using pattern: **/target/surefire-reports/testng-results.xml,**/target/failsafe-reports/testng-results.xml
Did not find any matching files.

Mime
View raw message