atlas-dev mailing list archives

Site index · List index
Message view « Date » · « Thread »
Top « Date » · « Thread »
From Apache Jenkins Server <jenk...@builds.apache.org>
Subject Build failed in Jenkins: Atlas-1.0-IntegrationTests #976
Date Sat, 08 Sep 2018 01:13:03 GMT
See <https://builds.apache.org/job/Atlas-1.0-IntegrationTests/976/display/redirect>

------------------------------------------
[...truncated 588.26 KB...]
127.0.0.1 - - [08/Sep/2018:01:04:28 +0000] "GET //localhost:31000/api/atlas/v2/entity/uniqueAttribute/type/hive_process?attr:qualifiedName=QUERY:default.tablejyzi1yrvdr@primary:1536368661000:default.tablesevkagycxe@primary:1536368661000-%3E:INSERT:default.tablelucqp2civt@primary:1536368661000
HTTP/1.1" 404 277 "-" "Java/1.8.0_172"
127.0.0.1 - - [08/Sep/2018:01:04:33 +0000] "GET //localhost:31000/api/atlas/v2/entity/uniqueAttribute/type/hive_process?attr:qualifiedName=QUERY:default.tablejyzi1yrvdr@primary:1536368661000:default.tablesevkagycxe@primary:1536368661000-%3E:INSERT:default.tablelucqp2civt@primary:1536368661000
HTTP/1.1" 200 3025 "-" "Java/1.8.0_172"
127.0.0.1 - - [08/Sep/2018:01:04:33 +0000] "GET //localhost:31000/api/atlas/v2/entity/uniqueAttribute/type/hive_process?attr:qualifiedName=QUERY:default.tablejyzi1yrvdr@primary:1536368661000:default.tablesevkagycxe@primary:1536368661000-%3E:INSERT:default.tablelucqp2civt@primary:1536368661000
HTTP/1.1" 200 3025 "-" "Java/1.8.0_172"
127.0.0.1 - - [08/Sep/2018:01:04:33 +0000] "GET //localhost:31000/api/atlas/v2/entity/guid/2a6f7f28-7a98-4342-b7d8-1f8593f81843
HTTP/1.1" 200 3025 "-" "Java/1.8.0_172"
127.0.0.1 - - [08/Sep/2018:01:04:33 +0000] "GET //localhost:31000/api/atlas/v2/entity/guid/b73cf1fc-34ec-4a01-8f14-1f6b5f9a858c
HTTP/1.1" 200 5562 "-" "Java/1.8.0_172"
127.0.0.1 - - [08/Sep/2018:01:04:33 +0000] "GET //localhost:31000/api/atlas/v2/entity/guid/c2d5f4c7-db34-498c-9cdb-ca45be7436df
HTTP/1.1" 200 6348 "-" "Java/1.8.0_172"
127.0.0.1 - - [08/Sep/2018:01:04:33 +0000] "GET //localhost:31000/api/atlas/v2/entity/guid/173905fc-8588-4d87-a102-3cb63fbb2430
HTTP/1.1" 200 6351 "-" "Java/1.8.0_172"
127.0.0.1 - - [08/Sep/2018:01:04:36 +0000] "GET //localhost:31000/api/atlas/v2/entity/uniqueAttribute/type/hive_process?attr:qualifiedName=QUERY:default.tablejyzi1yrvdr@primary:1536368661000:default.tablesevkagycxe@primary:1536368661000-%3E:INSERT:default.tablelucqp2civt@primary:1536368661000
HTTP/1.1" 200 3025 "-" "Java/1.8.0_172"
127.0.0.1 - - [08/Sep/2018:01:04:36 +0000] "GET //localhost:31000/api/atlas/v2/entity/uniqueAttribute/type/hive_process?attr:qualifiedName=QUERY:default.tablejyzi1yrvdr@primary:1536368661000:default.tablesevkagycxe@primary:1536368661000-%3E:INSERT:default.tablelucqp2civt@primary:1536368661000
HTTP/1.1" 200 3025 "-" "Java/1.8.0_172"
127.0.0.1 - - [08/Sep/2018:01:04:36 +0000] "GET //localhost:31000/api/atlas/v2/entity/guid/2a6f7f28-7a98-4342-b7d8-1f8593f81843
HTTP/1.1" 200 3025 "-" "Java/1.8.0_172"
127.0.0.1 - - [08/Sep/2018:01:04:36 +0000] "GET //localhost:31000/api/atlas/v2/entity/guid/b73cf1fc-34ec-4a01-8f14-1f6b5f9a858c
HTTP/1.1" 200 5562 "-" "Java/1.8.0_172"
127.0.0.1 - - [08/Sep/2018:01:04:36 +0000] "GET //localhost:31000/api/atlas/v2/entity/guid/c2d5f4c7-db34-498c-9cdb-ca45be7436df
HTTP/1.1" 200 6348 "-" "Java/1.8.0_172"
127.0.0.1 - - [08/Sep/2018:01:04:36 +0000] "GET //localhost:31000/api/atlas/v2/entity/guid/173905fc-8588-4d87-a102-3cb63fbb2430
HTTP/1.1" 200 6351 "-" "Java/1.8.0_172"
127.0.0.1 - - [08/Sep/2018:01:04:38 +0000] "GET //localhost:31000/api/atlas/v2/entity/uniqueAttribute/type/hive_table?attr:qualifiedName=default.tableerqr25xn9m@primary
HTTP/1.1" 200 5180 "-" "Java/1.8.0_172"
127.0.0.1 - - [08/Sep/2018:01:04:38 +0000] "GET //localhost:31000/api/atlas/v2/entity/uniqueAttribute/type/hive_table?attr:qualifiedName=default.tableerqr25xn9m@primary
HTTP/1.1" 200 5180 "-" "Java/1.8.0_172"
127.0.0.1 - - [08/Sep/2018:01:04:38 +0000] "GET //localhost:31000/api/atlas/v2/entity/uniqueAttribute/type/hive_table?attr:qualifiedName=db9ayy763olz.table8voljppc4i@primary
HTTP/1.1" 404 159 "-" "Java/1.8.0_172"
127.0.0.1 - - [08/Sep/2018:01:04:43 +0000] "GET //localhost:31000/api/atlas/v2/entity/uniqueAttribute/type/hive_table?attr:qualifiedName=db9ayy763olz.table8voljppc4i@primary
HTTP/1.1" 200 5623 "-" "Java/1.8.0_172"
127.0.0.1 - - [08/Sep/2018:01:04:43 +0000] "GET //localhost:31000/api/atlas/v2/entity/uniqueAttribute/type/hive_table?attr:qualifiedName=db9ayy763olz.table8voljppc4i@primary
HTTP/1.1" 200 5623 "-" "Java/1.8.0_172"
127.0.0.1 - - [08/Sep/2018:01:04:43 +0000] "GET //localhost:31000/api/atlas/v2/lineage/a24933b1-b4a8-419a-8961-b13741da57b3?depth=0&direction=INPUT
HTTP/1.1" 200 1619 "-" "Java/1.8.0_172"
127.0.0.1 - - [08/Sep/2018:01:04:44 +0000] "GET //localhost:31000/api/atlas/v2/lineage/dcee2d89-44fc-4904-8d6d-f3c392e82838?depth=0&direction=OUTPUT
HTTP/1.1" 200 1620 "-" "Java/1.8.0_172"
127.0.0.1 - - [08/Sep/2018:01:04:46 +0000] "GET //localhost:31000/api/atlas/v2/entity/uniqueAttribute/type/hive_table?attr:qualifiedName=default.tableuxlxwenxab@primary
HTTP/1.1" 404 154 "-" "Java/1.8.0_172"
127.0.0.1 - - [08/Sep/2018:01:04:51 +0000] "GET //localhost:31000/api/atlas/v2/entity/uniqueAttribute/type/hive_table?attr:qualifiedName=default.tableuxlxwenxab@primary
HTTP/1.1" 200 6914 "-" "Java/1.8.0_172"
127.0.0.1 - - [08/Sep/2018:01:04:51 +0000] "GET //localhost:31000/api/atlas/v2/entity/uniqueAttribute/type/hive_table?attr:qualifiedName=default.tableuxlxwenxab@primary
HTTP/1.1" 200 6914 "-" "Java/1.8.0_172"
127.0.0.1 - - [08/Sep/2018:01:04:52 +0000] "GET //localhost:31000/api/atlas/v2/entity/uniqueAttribute/type/hive_process?attr:qualifiedName=LOAD-%3E:default.tableuxlxwenxab@primary:1536368686000
HTTP/1.1" 404 177 "-" "Java/1.8.0_172"
127.0.0.1 - - [08/Sep/2018:01:04:57 +0000] "GET //localhost:31000/api/atlas/v2/entity/uniqueAttribute/type/hive_process?attr:qualifiedName=LOAD-%3E:default.tableuxlxwenxab@primary:1536368686000
HTTP/1.1" 200 2129 "-" "Java/1.8.0_172"
127.0.0.1 - - [08/Sep/2018:01:04:57 +0000] "GET //localhost:31000/api/atlas/v2/entity/uniqueAttribute/type/hive_process?attr:qualifiedName=LOAD-%3E:default.tableuxlxwenxab@primary:1536368686000
HTTP/1.1" 200 2129 "-" "Java/1.8.0_172"
127.0.0.1 - - [08/Sep/2018:01:04:57 +0000] "GET //localhost:31000/api/atlas/v2/entity/guid/45aad3ea-0c92-47f2-b277-260945028e26
HTTP/1.1" 200 2129 "-" "Java/1.8.0_172"
127.0.0.1 - - [08/Sep/2018:01:04:57 +0000] "GET //localhost:31000/api/atlas/v2/entity/guid/2c4604ec-2e25-4923-9200-78fc89d423d6
HTTP/1.1" 200 1442 "-" "Java/1.8.0_172"
127.0.0.1 - - [08/Sep/2018:01:04:57 +0000] "GET //localhost:31000/api/atlas/v2/entity/guid/98dacf7b-7b40-4585-bb12-b39657dffb40
HTTP/1.1" 200 7382 "-" "Java/1.8.0_172"
127.0.0.1 - - [08/Sep/2018:01:04:57 +0000] "GET //localhost:31000/api/atlas/v2/entity/uniqueAttribute/type/hdfs_path?attr:qualifiedName=pfile:/home/jenkins/jenkins-slave/workspace/atlas-1.0-integrationtests/addons/hive-bridge/target/loaddfsfile-data-3dizeerhsc
HTTP/1.1" 200 1442 "-" "Java/1.8.0_172"
127.0.0.1 - - [08/Sep/2018:01:04:57 +0000] "GET //localhost:31000/api/atlas/v2/entity/uniqueAttribute/type/hdfs_path?attr:qualifiedName=pfile:/home/jenkins/jenkins-slave/workspace/atlas-1.0-integrationtests/addons/hive-bridge/target/loaddfsfile-data-3dizeerhsc
HTTP/1.1" 200 1442 "-" "Java/1.8.0_172"
127.0.0.1 - - [08/Sep/2018:01:04:57 +0000] "GET //localhost:31000/api/atlas/v2/entity/guid/98dacf7b-7b40-4585-bb12-b39657dffb40
HTTP/1.1" 200 7382 "-" "Java/1.8.0_172"
127.0.0.1 - - [08/Sep/2018:01:04:57 +0000] "GET //localhost:31000/api/atlas/v2/entity/uniqueAttribute/type/hive_process?attr:qualifiedName=LOAD-%3E:default.tableuxlxwenxab@primary:1536368686000
HTTP/1.1" 200 2129 "-" "Java/1.8.0_172"
127.0.0.1 - - [08/Sep/2018:01:05:02 +0000] "GET //localhost:31000/api/atlas/v2/entity/uniqueAttribute/type/hive_process?attr:qualifiedName=LOAD-%3E:default.tableuxlxwenxab@primary:1536368686000
HTTP/1.1" 200 2586 "-" "Java/1.8.0_172"
127.0.0.1 - - [08/Sep/2018:01:05:02 +0000] "GET //localhost:31000/api/atlas/v2/entity/uniqueAttribute/type/hive_process?attr:qualifiedName=LOAD-%3E:default.tableuxlxwenxab@primary:1536368686000
HTTP/1.1" 200 2586 "-" "Java/1.8.0_172"
127.0.0.1 - - [08/Sep/2018:01:05:02 +0000] "GET //localhost:31000/api/atlas/v2/entity/guid/45aad3ea-0c92-47f2-b277-260945028e26
HTTP/1.1" 200 2586 "-" "Java/1.8.0_172"
127.0.0.1 - - [08/Sep/2018:01:05:02 +0000] "GET //localhost:31000/api/atlas/v2/entity/guid/03e8283e-9559-4bdf-877c-5a7b80d296b0
HTTP/1.1" 200 1446 "-" "Java/1.8.0_172"
127.0.0.1 - - [08/Sep/2018:01:05:02 +0000] "GET //localhost:31000/api/atlas/v2/entity/guid/2c4604ec-2e25-4923-9200-78fc89d423d6
HTTP/1.1" 200 1444 "-" "Java/1.8.0_172"
127.0.0.1 - - [08/Sep/2018:01:05:02 +0000] "GET //localhost:31000/api/atlas/v2/entity/guid/98dacf7b-7b40-4585-bb12-b39657dffb40
HTTP/1.1" 200 7383 "-" "Java/1.8.0_172"
127.0.0.1 - - [08/Sep/2018:01:05:02 +0000] "GET //localhost:31000/api/atlas/v2/entity/uniqueAttribute/type/hive_process?attr:qualifiedName=LOAD-%3E:default.tablekvzdq8xe9j@primary:1536368702000
HTTP/1.1" 404 177 "-" "Java/1.8.0_172"
127.0.0.1 - - [08/Sep/2018:01:05:07 +0000] "GET //localhost:31000/api/atlas/v2/entity/uniqueAttribute/type/hive_process?attr:qualifiedName=LOAD-%3E:default.tablekvzdq8xe9j@primary:1536368702000
HTTP/1.1" 200 1588 "-" "Java/1.8.0_172"
127.0.0.1 - - [08/Sep/2018:01:05:07 +0000] "GET //localhost:31000/api/atlas/v2/entity/uniqueAttribute/type/hive_process?attr:qualifiedName=LOAD-%3E:default.tablekvzdq8xe9j@primary:1536368702000
HTTP/1.1" 200 1588 "-" "Java/1.8.0_172"
127.0.0.1 - - [08/Sep/2018:01:05:08 +0000] "GET //localhost:31000/api/atlas/v2/entity/uniqueAttribute/type/hive_process?attr:qualifiedName=LOAD-%3E:default.tablefk4lsspdkq@primary:1536368707000
HTTP/1.1" 404 177 "-" "Java/1.8.0_172"
127.0.0.1 - - [08/Sep/2018:01:05:13 +0000] "GET //localhost:31000/api/atlas/v2/entity/uniqueAttribute/type/hive_process?attr:qualifiedName=LOAD-%3E:default.tablefk4lsspdkq@primary:1536368707000
HTTP/1.1" 200 1675 "-" "Java/1.8.0_172"
127.0.0.1 - - [08/Sep/2018:01:05:13 +0000] "GET //localhost:31000/api/atlas/v2/entity/uniqueAttribute/type/hive_process?attr:qualifiedName=LOAD-%3E:default.tablefk4lsspdkq@primary:1536368707000
HTTP/1.1" 200 1675 "-" "Java/1.8.0_172"
127.0.0.1 - - [08/Sep/2018:01:05:16 +0000] "GET //localhost:31000/api/atlas/v2/entity/uniqueAttribute/type/hive_column?attr:qualifiedName=dbbiby7xfhjv.tableimpr2kiabm.id@primary
HTTP/1.1" 404 163 "-" "Java/1.8.0_172"
127.0.0.1 - - [08/Sep/2018:01:05:21 +0000] "GET //localhost:31000/api/atlas/v2/entity/uniqueAttribute/type/hive_column?attr:qualifiedName=dbbiby7xfhjv.tableimpr2kiabm.id@primary
HTTP/1.1" 200 845 "-" "Java/1.8.0_172"
127.0.0.1 - - [08/Sep/2018:01:05:21 +0000] "GET //localhost:31000/api/atlas/v2/entity/uniqueAttribute/type/hive_column?attr:qualifiedName=dbbiby7xfhjv.tableimpr2kiabm.id@primary
HTTP/1.1" 200 845 "-" "Java/1.8.0_172"
127.0.0.1 - - [08/Sep/2018:01:05:21 +0000] "POST //localhost:31000/api/atlas/v2/types/typedefs/
HTTP/1.1" 200 425 "-" "Java/1.8.0_172"
127.0.0.1 - - [08/Sep/2018:01:05:21 +0000] "POST //localhost:31000/api/atlas/v2/entity/guid/e14d37e2-3baf-42c5-8868-5e5499d2f465/classifications
HTTP/1.1" 204 0 "-" "Java/1.8.0_172"
127.0.0.1 - - [08/Sep/2018:01:05:23 +0000] "GET //localhost:31000/api/atlas/v2/entity/uniqueAttribute/type/hive_column?attr:qualifiedName=dbbiby7xfhjv.tableimpr2kiabm.id_new@primary
HTTP/1.1" 404 167 "-" "Java/1.8.0_172"
127.0.0.1 - - [08/Sep/2018:01:05:28 +0000] "GET //localhost:31000/api/atlas/v2/entity/uniqueAttribute/type/hive_column?attr:qualifiedName=dbbiby7xfhjv.tableimpr2kiabm.id_new@primary
HTTP/1.1" 200 1045 "-" "Java/1.8.0_172"
127.0.0.1 - - [08/Sep/2018:01:05:28 +0000] "GET //localhost:31000/api/atlas/v2/entity/uniqueAttribute/type/hive_column?attr:qualifiedName=dbbiby7xfhjv.tableimpr2kiabm.id_new@primary
HTTP/1.1" 200 1045 "-" "Java/1.8.0_172"
127.0.0.1 - - [08/Sep/2018:01:05:28 +0000] "GET //localhost:31000/api/atlas/entities/e14d37e2-3baf-42c5-8868-5e5499d2f465
HTTP/1.1" 200 1064 "-" "Java/1.8.0_172"
127.0.0.1 - - [08/Sep/2018:01:05:28 +0000] "GET //localhost:31000/api/atlas/v2/entity/uniqueAttribute/type/hive_table?attr:qualifiedName=default.tablehm3v1svsyu@primary
HTTP/1.1" 404 154 "-" "Java/1.8.0_172"
127.0.0.1 - - [08/Sep/2018:01:05:33 +0000] "GET //localhost:31000/api/atlas/v2/entity/uniqueAttribute/type/hive_table?attr:qualifiedName=default.tablehm3v1svsyu@primary
HTTP/1.1" 200 5476 "-" "Java/1.8.0_172"
127.0.0.1 - - [08/Sep/2018:01:05:34 +0000] "GET //localhost:31000/api/atlas/v2/entity/uniqueAttribute/type/hive_table?attr:qualifiedName=default.tablehm3v1svsyu@primary
HTTP/1.1" 200 5476 "-" "Java/1.8.0_172"
127.0.0.1 - - [08/Sep/2018:01:05:34 +0000] "GET //localhost:31000/api/atlas/v2/entity/uniqueAttribute/type/hive_process?attr:qualifiedName=TRUNCATETABLE-%3E:default.tablehm3v1svsyu@primary:1536368728000
HTTP/1.1" 200 1186 "-" "Java/1.8.0_172"
127.0.0.1 - - [08/Sep/2018:01:05:34 +0000] "GET //localhost:31000/api/atlas/v2/entity/uniqueAttribute/type/hive_process?attr:qualifiedName=TRUNCATETABLE-%3E:default.tablehm3v1svsyu@primary:1536368728000
HTTP/1.1" 200 1186 "-" "Java/1.8.0_172"
127.0.0.1 - - [08/Sep/2018:01:05:34 +0000] "GET //localhost:31000/api/atlas/v2/entity/guid/1a0761ef-61af-4177-b325-a11c8f668927
HTTP/1.1" 200 1186 "-" "Java/1.8.0_172"
127.0.0.1 - - [08/Sep/2018:01:05:34 +0000] "GET //localhost:31000/api/atlas/v2/entity/guid/1607d0e2-2ded-4cb4-a43a-e68e9cfcbfd8
HTTP/1.1" 200 5476 "-" "Java/1.8.0_172"
127.0.0.1 - - [08/Sep/2018:01:05:34 +0000] "GET //localhost:31000/api/atlas/v2/lineage/1607d0e2-2ded-4cb4-a43a-e68e9cfcbfd8?depth=0&direction=INPUT
HTTP/1.1" 200 135 "-" "Java/1.8.0_172"
127.0.0.1 - - [08/Sep/2018:01:05:37 +0000] "GET //localhost:31000/api/atlas/v2/entity/uniqueAttribute/type/hive_process?attr:qualifiedName=QUERY:default.table0rxp1tyowe@primary:1536368735000-%3E
HTTP/1.1" 404 178 "-" "Java/1.8.0_172"
127.0.0.1 - - [08/Sep/2018:01:05:42 +0000] "GET //localhost:31000/api/atlas/v2/entity/uniqueAttribute/type/hive_process?attr:qualifiedName=QUERY:default.table0rxp1tyowe@primary:1536368735000-%3E
HTTP/1.1" 200 2114 "-" "Java/1.8.0_172"
127.0.0.1 - - [08/Sep/2018:01:05:42 +0000] "GET //localhost:31000/api/atlas/v2/entity/uniqueAttribute/type/hive_process?attr:qualifiedName=QUERY:default.table0rxp1tyowe@primary:1536368735000-%3E
HTTP/1.1" 200 2114 "-" "Java/1.8.0_172"
127.0.0.1 - - [08/Sep/2018:01:05:42 +0000] "GET //localhost:31000/api/atlas/v2/entity/guid/e68d540c-d205-467d-9903-955900ceee1c
HTTP/1.1" 200 2114 "-" "Java/1.8.0_172"
127.0.0.1 - - [08/Sep/2018:01:05:42 +0000] "GET //localhost:31000/api/atlas/v2/entity/guid/df228c10-d97a-401b-8f6b-bb82947dfbd1
HTTP/1.1" 200 5640 "-" "Java/1.8.0_172"
127.0.0.1 - - [08/Sep/2018:01:05:42 +0000] "GET //localhost:31000/api/atlas/v2/entity/guid/64776bb3-41cf-4d27-963a-32e041e4e56e
HTTP/1.1" 200 1440 "-" "Java/1.8.0_172"
127.0.0.1 - - [08/Sep/2018:01:05:42 +0000] "GET //localhost:31000/api/atlas/v2/entity/uniqueAttribute/type/hdfs_path?attr:qualifiedName=pfile:/home/jenkins/jenkins-slave/workspace/atlas-1.0-integrationtests/addons/hive-bridge/target/somedfspath1-data-7lq2u0omad
HTTP/1.1" 200 1440 "-" "Java/1.8.0_172"
127.0.0.1 - - [08/Sep/2018:01:05:42 +0000] "GET //localhost:31000/api/atlas/v2/entity/uniqueAttribute/type/hdfs_path?attr:qualifiedName=pfile:/home/jenkins/jenkins-slave/workspace/atlas-1.0-integrationtests/addons/hive-bridge/target/somedfspath1-data-7lq2u0omad
HTTP/1.1" 200 1440 "-" "Java/1.8.0_172"
127.0.0.1 - - [08/Sep/2018:01:05:42 +0000] "GET //localhost:31000/api/atlas/v2/entity/uniqueAttribute/type/hive_table?attr:qualifiedName=default.table0rxp1tyowe@primary
HTTP/1.1" 200 5640 "-" "Java/1.8.0_172"
127.0.0.1 - - [08/Sep/2018:01:05:42 +0000] "GET //localhost:31000/api/atlas/v2/entity/uniqueAttribute/type/hive_table?attr:qualifiedName=default.table0rxp1tyowe@primary
HTTP/1.1" 200 5640 "-" "Java/1.8.0_172"
127.0.0.1 - - [08/Sep/2018:01:05:42 +0000] "GET //localhost:31000/api/atlas/v2/entity/guid/df228c10-d97a-401b-8f6b-bb82947dfbd1
HTTP/1.1" 200 5640 "-" "Java/1.8.0_172"
127.0.0.1 - - [08/Sep/2018:01:05:45 +0000] "GET //localhost:31000/api/atlas/v2/entity/uniqueAttribute/type/hive_table?attr:qualifiedName=default.table0rxp1tyowe@primary
HTTP/1.1" 200 5640 "-" "Java/1.8.0_172"
127.0.0.1 - - [08/Sep/2018:01:05:45 +0000] "GET //localhost:31000/api/atlas/v2/entity/uniqueAttribute/type/hive_table?attr:qualifiedName=default.table0rxp1tyowe@primary
HTTP/1.1" 200 5640 "-" "Java/1.8.0_172"
127.0.0.1 - - [08/Sep/2018:01:05:45 +0000] "GET //localhost:31000/api/atlas/v2/entity/uniqueAttribute/type/hive_process?attr:qualifiedName=QUERY:default.table0rxp1tyowe@primary:1536368735000-%3E
HTTP/1.1" 200 2114 "-" "Java/1.8.0_172"
127.0.0.1 - - [08/Sep/2018:01:05:45 +0000] "GET //localhost:31000/api/atlas/v2/entity/uniqueAttribute/type/hive_process?attr:qualifiedName=QUERY:default.table0rxp1tyowe@primary:1536368735000-%3E
HTTP/1.1" 200 2114 "-" "Java/1.8.0_172"
127.0.0.1 - - [08/Sep/2018:01:05:45 +0000] "GET //localhost:31000/api/atlas/v2/entity/guid/e68d540c-d205-467d-9903-955900ceee1c
HTTP/1.1" 200 2114 "-" "Java/1.8.0_172"
127.0.0.1 - - [08/Sep/2018:01:05:45 +0000] "GET //localhost:31000/api/atlas/v2/entity/guid/df228c10-d97a-401b-8f6b-bb82947dfbd1
HTTP/1.1" 200 5640 "-" "Java/1.8.0_172"
127.0.0.1 - - [08/Sep/2018:01:05:45 +0000] "GET //localhost:31000/api/atlas/v2/entity/guid/64776bb3-41cf-4d27-963a-32e041e4e56e
HTTP/1.1" 200 1440 "-" "Java/1.8.0_172"
127.0.0.1 - - [08/Sep/2018:01:05:45 +0000] "GET //localhost:31000/api/atlas/v2/entity/uniqueAttribute/type/hdfs_path?attr:qualifiedName=pfile:/home/jenkins/jenkins-slave/workspace/atlas-1.0-integrationtests/addons/hive-bridge/target/somedfspath1-data-7lq2u0omad
HTTP/1.1" 200 1440 "-" "Java/1.8.0_172"
127.0.0.1 - - [08/Sep/2018:01:05:45 +0000] "GET //localhost:31000/api/atlas/v2/entity/uniqueAttribute/type/hdfs_path?attr:qualifiedName=pfile:/home/jenkins/jenkins-slave/workspace/atlas-1.0-integrationtests/addons/hive-bridge/target/somedfspath1-data-7lq2u0omad
HTTP/1.1" 200 1440 "-" "Java/1.8.0_172"
127.0.0.1 - - [08/Sep/2018:01:05:48 +0000] "GET //localhost:31000/api/atlas/v2/entity/uniqueAttribute/type/hive_table?attr:qualifiedName=default.table0rxp1tyowe@primary
HTTP/1.1" 200 5640 "-" "Java/1.8.0_172"
127.0.0.1 - - [08/Sep/2018:01:05:48 +0000] "GET //localhost:31000/api/atlas/v2/entity/uniqueAttribute/type/hive_table?attr:qualifiedName=default.table0rxp1tyowe@primary
HTTP/1.1" 200 5640 "-" "Java/1.8.0_172"
127.0.0.1 - - [08/Sep/2018:01:05:48 +0000] "GET //localhost:31000/api/atlas/v2/entity/uniqueAttribute/type/hive_process?attr:qualifiedName=QUERY:default.table0rxp1tyowe@primary:1536368735000-%3E
HTTP/1.1" 200 2569 "-" "Java/1.8.0_172"
127.0.0.1 - - [08/Sep/2018:01:05:48 +0000] "GET //localhost:31000/api/atlas/v2/entity/uniqueAttribute/type/hive_process?attr:qualifiedName=QUERY:default.table0rxp1tyowe@primary:1536368735000-%3E
HTTP/1.1" 200 2569 "-" "Java/1.8.0_172"
127.0.0.1 - - [08/Sep/2018:01:05:48 +0000] "GET //localhost:31000/api/atlas/v2/entity/guid/e68d540c-d205-467d-9903-955900ceee1c
HTTP/1.1" 200 2569 "-" "Java/1.8.0_172"
127.0.0.1 - - [08/Sep/2018:01:05:48 +0000] "GET //localhost:31000/api/atlas/v2/entity/guid/df228c10-d97a-401b-8f6b-bb82947dfbd1
HTTP/1.1" 200 5640 "-" "Java/1.8.0_172"
127.0.0.1 - - [08/Sep/2018:01:05:48 +0000] "GET //localhost:31000/api/atlas/v2/entity/guid/1bcfc83f-f08f-4c76-a773-ed252c173d05
HTTP/1.1" 200 1440 "-" "Java/1.8.0_172"
127.0.0.1 - - [08/Sep/2018:01:05:48 +0000] "GET //localhost:31000/api/atlas/v2/entity/guid/64776bb3-41cf-4d27-963a-32e041e4e56e
HTTP/1.1" 200 1441 "-" "Java/1.8.0_172"
127.0.0.1 - - [08/Sep/2018:01:05:48 +0000] "GET //localhost:31000/api/atlas/v2/entity/uniqueAttribute/type/hdfs_path?attr:qualifiedName=pfile:/home/jenkins/jenkins-slave/workspace/atlas-1.0-integrationtests/addons/hive-bridge/target/somedfspath2-data-h7lxhyeoes
HTTP/1.1" 200 1440 "-" "Java/1.8.0_172"
127.0.0.1 - - [08/Sep/2018:01:05:48 +0000] "GET //localhost:31000/api/atlas/v2/entity/uniqueAttribute/type/hdfs_path?attr:qualifiedName=pfile:/home/jenkins/jenkins-slave/workspace/atlas-1.0-integrationtests/addons/hive-bridge/target/somedfspath2-data-h7lxhyeoes
HTTP/1.1" 200 1440 "-" "Java/1.8.0_172"
Tests run: 45, Failures: 1, Errors: 0, Skipped: 0, Time elapsed: 440.066 sec <<<
FAILURE! - in TestSuite
testDropDatabaseWithoutCascade(org.apache.atlas.hive.hook.HiveHookIT)  Time elapsed: 6.968
sec  <<< FAILURE!
java.lang.AssertionError: Entity was not supposed to exist for typeName = hive_db, attributeName
= qualifiedName, attributeValue = dblq4jir6mye@primary
	at org.testng.Assert.fail(Assert.java:94)
	at org.apache.atlas.hive.hook.HiveHookIT.testDropDatabaseWithoutCascade(HiveHookIT.java:1621)


Results :

Failed tests: 
  HiveHookIT.testDropDatabaseWithoutCascade:1621 Entity was not supposed to exist for typeName
= hive_db, attributeName = qualifiedName, attributeValue = dblq4jir6mye@primary

Tests run: 45, Failures: 1, Errors: 0, Skipped: 0

[INFO] 
[INFO] --- jetty-maven-plugin:9.3.14.v20161028:stop (stop-jetty) @ hive-bridge ---
[INFO] Waiting 10 seconds for jetty to stop
[INFO] Stopped ServerConnector@5cbbe2df{HTTP/1.1,[http/1.1]}{0.0.0.0:31000}
[INFO] Closing Spring root WebApplicationContext
[INFO] Shutting down log4j
[INFO] Stopped o.e.j.m.p.JettyWebAppContext@494bc5b6{/,file://<https://builds.apache.org/job/Atlas-1.0-IntegrationTests/ws/webapp/target/atlas-webapp-1.1.0-SNAPSHOT/,UNAVAILABLE}{/home/jenkins/jenkins-slave/workspace/Atlas-1.0-IntegrationTests/webapp/target/atlas-webapp-1.1.0-SNAPSHOT.war}>
[INFO] Server reports itself as stopped
[INFO] 
[INFO] --- maven-source-plugin:2.4:jar-no-fork (attach-sources) @ hive-bridge ---
[INFO] Building jar: <https://builds.apache.org/job/Atlas-1.0-IntegrationTests/ws/addons/hive-bridge/target/hive-bridge-1.1.0-SNAPSHOT-sources.jar>
[INFO] 
[INFO] --- maven-source-plugin:2.4:test-jar-no-fork (attach-sources) @ hive-bridge ---
[INFO] Building jar: <https://builds.apache.org/job/Atlas-1.0-IntegrationTests/ws/addons/hive-bridge/target/hive-bridge-1.1.0-SNAPSHOT-test-sources.jar>
log4j:WARN No appenders could be found for logger (org.apache.zookeeper.ClientCnxn).
log4j:WARN Please initialize the log4j system properly.
log4j:WARN See http://logging.apache.org/log4j/1.2/faq.html#noconfig for more info.
[INFO] 
[INFO] --- maven-failsafe-plugin:2.18.1:verify (verify) @ hive-bridge ---
[INFO] Failsafe report directory: <https://builds.apache.org/job/Atlas-1.0-IntegrationTests/ws/addons/hive-bridge/target/failsafe-reports>
[INFO] ------------------------------------------------------------------------
[INFO] Reactor Summary:
[INFO] 
[INFO] Apache Atlas Server Build Tools 1.0 ................ SUCCESS [  0.691 s]
[INFO] apache-atlas 1.1.0-SNAPSHOT ........................ SUCCESS [  4.898 s]
[INFO] Apache Atlas Test Utility Tools .................... SUCCESS [ 11.152 s]
[INFO] Apache Atlas Integration ........................... SUCCESS [ 27.325 s]
[INFO] Apache Atlas Common ................................ SUCCESS [  9.970 s]
[INFO] Apache Atlas Client ................................ SUCCESS [  0.596 s]
[INFO] atlas-client-common ................................ SUCCESS [  7.395 s]
[INFO] atlas-client-v1 .................................... SUCCESS [  8.799 s]
[INFO] Apache Atlas Server API ............................ SUCCESS [  6.856 s]
[INFO] Apache Atlas Notification .......................... SUCCESS [ 11.596 s]
[INFO] atlas-client-v2 .................................... SUCCESS [  6.166 s]
[INFO] Apache Atlas Graph Database Projects ............... SUCCESS [  0.449 s]
[INFO] Apache Atlas Graph Database API .................... SUCCESS [  5.573 s]
[INFO] Graph Database Common Code ......................... SUCCESS [  5.931 s]
[INFO] Apache Atlas JanusGraph DB Impl .................... SUCCESS [ 22.400 s]
[INFO] Apache Atlas Graph Database Implementation Dependencies SUCCESS [  2.753 s]
[INFO] Shaded version of Apache hbase client .............. SUCCESS [  9.960 s]
[INFO] Shaded version of Apache hbase server .............. SUCCESS [ 24.022 s]
[INFO] Apache Atlas Authorization ......................... SUCCESS [  8.417 s]
[INFO] Apache Atlas Repository ............................ SUCCESS [ 41.466 s]
[INFO] Apache Atlas UI .................................... SUCCESS [01:51 min]
[INFO] Apache Atlas Web Application ....................... SUCCESS [09:01 min]
[INFO] Apache Atlas Documentation ......................... SUCCESS [  4.745 s]
[INFO] Apache Atlas FileSystem Model ...................... SUCCESS [  3.026 s]
[INFO] Apache Atlas Plugin Classloader .................... SUCCESS [  6.318 s]
[INFO] Apache Atlas Hive Bridge Shim ...................... SUCCESS [  5.157 s]
[INFO] Apache Atlas Hive Bridge ........................... FAILURE [08:27 min]
[INFO] Apache Atlas Falcon Bridge Shim .................... SKIPPED
[INFO] Apache Atlas Falcon Bridge ......................... SKIPPED
[INFO] Apache Atlas Sqoop Bridge Shim ..................... SKIPPED
[INFO] Apache Atlas Sqoop Bridge .......................... SKIPPED
[INFO] Apache Atlas Storm Bridge Shim ..................... SKIPPED
[INFO] Apache Atlas Storm Bridge .......................... SKIPPED
[INFO] Apache Atlas Hbase Bridge Shim ..................... SKIPPED
[INFO] Apache Atlas Hbase Bridge .......................... SKIPPED
[INFO] Apache Atlas Kafka Bridge .......................... SKIPPED
[INFO] Apache Atlas Distribution 1.1.0-SNAPSHOT ........... SKIPPED
[INFO] ------------------------------------------------------------------------
[INFO] BUILD FAILURE
[INFO] ------------------------------------------------------------------------
[INFO] Total time: 23:17 min
[INFO] Finished at: 2018-09-08T01:05:52Z
[INFO] ------------------------------------------------------------------------
[ERROR] Failed to execute goal org.apache.maven.plugins:maven-failsafe-plugin:2.18.1:verify
(verify) on project hive-bridge: There are test failures.
[ERROR] 
[ERROR] Please refer to <https://builds.apache.org/job/Atlas-1.0-IntegrationTests/ws/addons/hive-bridge/target/failsafe-reports>
for the individual test results.
[ERROR] -> [Help 1]
[ERROR] 
[ERROR] To see the full stack trace of the errors, re-run Maven with the -e switch.
[ERROR] Re-run Maven using the -X switch to enable full debug logging.
[ERROR] 
[ERROR] For more information about the errors and possible solutions, please read the following
articles:
[ERROR] [Help 1] http://cwiki.apache.org/confluence/display/MAVEN/MojoFailureException
[ERROR] 
[ERROR] After correcting the problems, you can resume the build with the command
[ERROR]   mvn <goals> -rf :hive-bridge
Build step 'Execute shell' marked build as failure
[CHECKSTYLE] Collecting checkstyle analysis files...
[CHECKSTYLE] Searching for all files in <https://builds.apache.org/job/Atlas-1.0-IntegrationTests/ws/>
that match the pattern **/target/checkstyle-result.xml
[CHECKSTYLE] Parsing 25 files in <https://builds.apache.org/job/Atlas-1.0-IntegrationTests/ws/>
[CHECKSTYLE] Successfully parsed file <https://builds.apache.org/job/Atlas-1.0-IntegrationTests/ws/addons/hdfs-model/target/checkstyle-result.xml>
with 0 unique warnings and 0 duplicates.
[CHECKSTYLE] Successfully parsed file <https://builds.apache.org/job/Atlas-1.0-IntegrationTests/ws/addons/hive-bridge-shim/target/checkstyle-result.xml>
with 15 unique warnings and 0 duplicates.
[CHECKSTYLE] Successfully parsed file <https://builds.apache.org/job/Atlas-1.0-IntegrationTests/ws/authorization/target/checkstyle-result.xml>
with 988 unique warnings and 0 duplicates.
[CHECKSTYLE] Successfully parsed file <https://builds.apache.org/job/Atlas-1.0-IntegrationTests/ws/client/client-v1/target/checkstyle-result.xml>
with 1887 unique warnings and 0 duplicates.
[CHECKSTYLE] Successfully parsed file <https://builds.apache.org/job/Atlas-1.0-IntegrationTests/ws/client/client-v2/target/checkstyle-result.xml>
with 2246 unique warnings and 0 duplicates.
[CHECKSTYLE] Successfully parsed file <https://builds.apache.org/job/Atlas-1.0-IntegrationTests/ws/client/common/target/checkstyle-result.xml>
with 2738 unique warnings and 0 duplicates.
[CHECKSTYLE] Successfully parsed file <https://builds.apache.org/job/Atlas-1.0-IntegrationTests/ws/client/target/checkstyle-result.xml>
with 2738 unique warnings and 0 duplicates.
[CHECKSTYLE] Successfully parsed file <https://builds.apache.org/job/Atlas-1.0-IntegrationTests/ws/common/target/checkstyle-result.xml>
with 3815 unique warnings and 0 duplicates.
[CHECKSTYLE] Successfully parsed file <https://builds.apache.org/job/Atlas-1.0-IntegrationTests/ws/dashboardv2/target/checkstyle-result.xml>
with 3815 unique warnings and 0 duplicates.
[CHECKSTYLE] Successfully parsed file <https://builds.apache.org/job/Atlas-1.0-IntegrationTests/ws/docs/target/checkstyle-result.xml>
with 3815 unique warnings and 0 duplicates.
[CHECKSTYLE] Successfully parsed file <https://builds.apache.org/job/Atlas-1.0-IntegrationTests/ws/graphdb/api/target/checkstyle-result.xml>
with 4117 unique warnings and 0 duplicates.
[CHECKSTYLE] Successfully parsed file <https://builds.apache.org/job/Atlas-1.0-IntegrationTests/ws/graphdb/common/target/checkstyle-result.xml>
with 4343 unique warnings and 0 duplicates.
[CHECKSTYLE] Successfully parsed file <https://builds.apache.org/job/Atlas-1.0-IntegrationTests/ws/graphdb/graphdb-impls/target/checkstyle-result.xml>
with 4343 unique warnings and 0 duplicates.
[CHECKSTYLE] Successfully parsed file <https://builds.apache.org/job/Atlas-1.0-IntegrationTests/ws/graphdb/janus/target/checkstyle-result.xml>
with 6669 unique warnings and 0 duplicates.
[CHECKSTYLE] Successfully parsed file <https://builds.apache.org/job/Atlas-1.0-IntegrationTests/ws/graphdb/target/checkstyle-result.xml>
with 6669 unique warnings and 0 duplicates.
[CHECKSTYLE] Successfully parsed file <https://builds.apache.org/job/Atlas-1.0-IntegrationTests/ws/intg/target/checkstyle-result.xml>
with 18785 unique warnings and 0 duplicates.
[CHECKSTYLE] Successfully parsed file <https://builds.apache.org/job/Atlas-1.0-IntegrationTests/ws/notification/target/checkstyle-result.xml>
with 20059 unique warnings and 0 duplicates.
[CHECKSTYLE] Successfully parsed file <https://builds.apache.org/job/Atlas-1.0-IntegrationTests/ws/plugin-classloader/target/checkstyle-result.xml>
with 20172 unique warnings and 0 duplicates.
[CHECKSTYLE] Successfully parsed file <https://builds.apache.org/job/Atlas-1.0-IntegrationTests/ws/repository/target/checkstyle-result.xml>
with 39339 unique warnings and 0 duplicates.
[CHECKSTYLE] Successfully parsed file <https://builds.apache.org/job/Atlas-1.0-IntegrationTests/ws/server-api/target/checkstyle-result.xml>
with 39534 unique warnings and 0 duplicates.
[CHECKSTYLE] Successfully parsed file <https://builds.apache.org/job/Atlas-1.0-IntegrationTests/ws/shaded/hbase-client-shaded/target/checkstyle-result.xml>
with 39534 unique warnings and 0 duplicates.
[CHECKSTYLE] Successfully parsed file <https://builds.apache.org/job/Atlas-1.0-IntegrationTests/ws/shaded/hbase-server-shaded/target/checkstyle-result.xml>
with 39534 unique warnings and 0 duplicates.
[CHECKSTYLE] Successfully parsed file <https://builds.apache.org/job/Atlas-1.0-IntegrationTests/ws/target/checkstyle-result.xml>
with 39534 unique warnings and 0 duplicates.
[CHECKSTYLE] Successfully parsed file <https://builds.apache.org/job/Atlas-1.0-IntegrationTests/ws/test-tools/target/checkstyle-result.xml>
with 39572 unique warnings and 0 duplicates.
[CHECKSTYLE] Successfully parsed file <https://builds.apache.org/job/Atlas-1.0-IntegrationTests/ws/webapp/target/checkstyle-result.xml>
with 47988 unique warnings and 0 duplicates.
<Git Blamer> Using GitBlamer to create author and commit information for all warnings.
<Git Blamer> GIT_COMMIT=9e76ed2eb80ec5aea45099a5d388734f66586351, workspace=<https://builds.apache.org/job/Atlas-1.0-IntegrationTests/ws/>
 > git rev-parse 9e76ed2eb80ec5aea45099a5d388734f66586351^{commit} # timeout=10
[CHECKSTYLE] Computing warning deltas based on reference build #975
[FINDBUGS] Collecting findbugs analysis files...
[FINDBUGS] Searching for all files in <https://builds.apache.org/job/Atlas-1.0-IntegrationTests/ws/>
that match the pattern **/target/findbugs.xml
[FINDBUGS] Parsing 16 files in <https://builds.apache.org/job/Atlas-1.0-IntegrationTests/ws/>
[FINDBUGS] Successfully parsed file <https://builds.apache.org/job/Atlas-1.0-IntegrationTests/ws/addons/hive-bridge-shim/target/findbugs.xml>
with 0 unique warnings and 0 duplicates.
[FINDBUGS] Successfully parsed file <https://builds.apache.org/job/Atlas-1.0-IntegrationTests/ws/authorization/target/findbugs.xml>
with 0 unique warnings and 0 duplicates.
[FINDBUGS] Successfully parsed file <https://builds.apache.org/job/Atlas-1.0-IntegrationTests/ws/client/client-v1/target/findbugs.xml>
with 0 unique warnings and 0 duplicates.
[FINDBUGS] Successfully parsed file <https://builds.apache.org/job/Atlas-1.0-IntegrationTests/ws/client/client-v2/target/findbugs.xml>
with 0 unique warnings and 0 duplicates.
[FINDBUGS] Successfully parsed file <https://builds.apache.org/job/Atlas-1.0-IntegrationTests/ws/client/common/target/findbugs.xml>
with 0 unique warnings and 0 duplicates.
[FINDBUGS] Successfully parsed file <https://builds.apache.org/job/Atlas-1.0-IntegrationTests/ws/common/target/findbugs.xml>
with 0 unique warnings and 0 duplicates.
[FINDBUGS] Successfully parsed file <https://builds.apache.org/job/Atlas-1.0-IntegrationTests/ws/graphdb/api/target/findbugs.xml>
with 0 unique warnings and 0 duplicates.
[FINDBUGS] Successfully parsed file <https://builds.apache.org/job/Atlas-1.0-IntegrationTests/ws/graphdb/common/target/findbugs.xml>
with 0 unique warnings and 0 duplicates.
[FINDBUGS] Successfully parsed file <https://builds.apache.org/job/Atlas-1.0-IntegrationTests/ws/graphdb/janus/target/findbugs.xml>
with 0 unique warnings and 0 duplicates.
[FINDBUGS] Successfully parsed file <https://builds.apache.org/job/Atlas-1.0-IntegrationTests/ws/intg/target/findbugs.xml>
with 0 unique warnings and 0 duplicates.
[FINDBUGS] Successfully parsed file <https://builds.apache.org/job/Atlas-1.0-IntegrationTests/ws/notification/target/findbugs.xml>
with 0 unique warnings and 0 duplicates.
[FINDBUGS] Successfully parsed file <https://builds.apache.org/job/Atlas-1.0-IntegrationTests/ws/plugin-classloader/target/findbugs.xml>
with 0 unique warnings and 0 duplicates.
[FINDBUGS] Successfully parsed file <https://builds.apache.org/job/Atlas-1.0-IntegrationTests/ws/repository/target/findbugs.xml>
with 0 unique warnings and 0 duplicates.
[FINDBUGS] Successfully parsed file <https://builds.apache.org/job/Atlas-1.0-IntegrationTests/ws/server-api/target/findbugs.xml>
with 0 unique warnings and 0 duplicates.
[FINDBUGS] Successfully parsed file <https://builds.apache.org/job/Atlas-1.0-IntegrationTests/ws/test-tools/target/findbugs.xml>
with 0 unique warnings and 0 duplicates.
[FINDBUGS] Successfully parsed file <https://builds.apache.org/job/Atlas-1.0-IntegrationTests/ws/webapp/target/findbugs.xml>
with 0 unique warnings and 0 duplicates.
<Git Blamer> Using GitBlamer to create author and commit information for all warnings.
<Git Blamer> GIT_COMMIT=9e76ed2eb80ec5aea45099a5d388734f66586351, workspace=<https://builds.apache.org/job/Atlas-1.0-IntegrationTests/ws/>
[FINDBUGS] Computing warning deltas based on reference build #975
Archiving artifacts
[Fast Archiver] Compressed 168.90 MB of artifacts by 84.0% relative to #975
TestNG Reports Processing: START
Looking for TestNG results report in workspace using pattern: **/target/surefire-reports/testng-results.xml,**/target/failsafe-reports/testng-results.xml
Saving reports...
Processing '/x1/jenkins/jenkins-home/jobs/Atlas-1.0-IntegrationTests/builds/976/testng/testng-results-1.xml'
Processing '/x1/jenkins/jenkins-home/jobs/Atlas-1.0-IntegrationTests/builds/976/testng/testng-results.xml'
0.609756% of tests failed, which exceeded threshold of 0%. Marking build as UNSTABLE
TestNG Reports Processing: FINISH

Mime
View raw message