atlas-dev mailing list archives

Site index · List index
Message view « Date » · « Thread »
Top « Date » · « Thread »
From Apache Jenkins Server <jenk...@builds.apache.org>
Subject Build failed in Jenkins: Atlas-1.0-UnitTests #978
Date Thu, 06 Sep 2018 21:25:15 GMT
See <https://builds.apache.org/job/Atlas-1.0-UnitTests/978/display/redirect>

------------------------------------------
[...truncated 204.04 KB...]
[INFO] Exclude: .svn/**
[INFO] Exclude: .git/**
[INFO] Exclude: .gitignore
[INFO] Exclude: **/.idea/**
[INFO] Exclude: **/*.twiki
[INFO] Exclude: **/*.iml
[INFO] Exclude: **/*.json
[INFO] Exclude: **/*.log
[INFO] Exclude: **/target/**
[INFO] Exclude: **/target*/**
[INFO] Exclude: **/build/**
[INFO] Exclude: **/*.patch
[INFO] Exclude: derby.log
[INFO] Exclude: **/logs/**
[INFO] Exclude: **/.classpath
[INFO] Exclude: **/.project
[INFO] Exclude: **/.settings/**
[INFO] Exclude: **/test-output/**
[INFO] Exclude: **/mock/**
[INFO] Exclude: **/data/**
[INFO] Exclude: **/maven-eclipse.xml
[INFO] Exclude: **/.externalToolBuilders/**
[INFO] Exclude: **/build.log
[INFO] Exclude: **/.bowerrc
[INFO] Exclude: *.json
[INFO] Exclude: **/overlays/**
[INFO] Exclude: dev-support/**
[INFO] Exclude: **/users-credentials.properties
[INFO] Exclude: **/public/css/animate.min.css
[INFO] Exclude: **/public/css/bootstrap-sidebar.css
[INFO] Exclude: **/public/js/external_lib/**
[INFO] Exclude: **/node_modules/**
[INFO] Exclude: **/public/js/libs/**
[INFO] Exclude: **/atlas.data/**
[INFO] Exclude: **/${sys:atlas.data}/**
[INFO] Exclude: **/policy-store.txt
[INFO] Exclude: **/*rebel*.xml
[INFO] Exclude: **/*rebel*.xml.bak
[INFO] Exclude: **/test/resources/**
[INFO] 125 resources included (use -debug for more details)
[INFO] Rat check: Summary over all files. Unapproved: 0, unknown: 0, generated: 0, approved:
125 licenses.
[INFO] 
[INFO] --- maven-resources-plugin:2.7:copy-resources (copy-resources) @ atlas-webapp ---
[INFO] Using 'UTF-8' encoding to copy filtered resources.
[INFO] Copying 15 resources
[INFO] 
[INFO] --- maven-resources-plugin:2.7:copy-resources (copy-solr-resources) @ atlas-webapp
---
[INFO] Using 'UTF-8' encoding to copy filtered resources.
[INFO] Copying 9 resources
[INFO] 
[INFO] --- maven-remote-resources-plugin:1.5:process (default) @ atlas-webapp ---
[INFO] 
[INFO] --- keytool-maven-plugin:1.5:clean (clean) @ atlas-webapp ---
[WARNING] Keystore file '<https://builds.apache.org/job/Atlas-1.0-UnitTests/ws/webapp/target/atlas.keystore'>
doesn't exist.
[INFO] 
[INFO] --- keytool-maven-plugin:1.5:generateKeyPair (generateKeyPair) @ atlas-webapp ---
[WARNING] 
[WARNING] Warning:
[WARNING] The JKS keystore uses a proprietary format. It is recommended to migrate to PKCS12
which is an industry standard format using "keytool -importkeystore -srckeystore <https://builds.apache.org/job/Atlas-1.0-UnitTests/ws/webapp/target/atlas.keystore>
-destkeystore <https://builds.apache.org/job/Atlas-1.0-UnitTests/ws/webapp/target/atlas.keystore>
-deststoretype pkcs12".
[INFO] 
[INFO] --- maven-resources-plugin:2.7:resources (default-resources) @ atlas-webapp ---
[INFO] Using 'UTF-8' encoding to copy filtered resources.
[INFO] Copying 2 resources
[INFO] Copying 2 resources to META-INF
[INFO] Copying 3 resources
[INFO] 
[INFO] --- maven-compiler-plugin:3.7.0:compile (default-compile) @ atlas-webapp ---
[INFO] Changes detected - recompiling the module!
[INFO] Compiling 69 source files to <https://builds.apache.org/job/Atlas-1.0-UnitTests/ws/webapp/target/classes>
[INFO] <https://builds.apache.org/job/Atlas-1.0-UnitTests/ws/webapp/src/main/java/org/apache/atlas/examples/QuickStart.java>:
Some input files use or override a deprecated API.
[INFO] <https://builds.apache.org/job/Atlas-1.0-UnitTests/ws/webapp/src/main/java/org/apache/atlas/examples/QuickStart.java>:
Recompile with -Xlint:deprecation for details.
[INFO] <https://builds.apache.org/job/Atlas-1.0-UnitTests/ws/webapp/src/main/java/org/apache/atlas/notification/NotificationEntityChangeListener.java>:
Some input files use unchecked or unsafe operations.
[INFO] <https://builds.apache.org/job/Atlas-1.0-UnitTests/ws/webapp/src/main/java/org/apache/atlas/notification/NotificationEntityChangeListener.java>:
Recompile with -Xlint:unchecked for details.
[INFO] 
[INFO] --- maven-resources-plugin:2.7:testResources (default-testResources) @ atlas-webapp
---
[INFO] Using 'UTF-8' encoding to copy filtered resources.
[INFO] Copying 9 resources
[INFO] Copying 3 resources
[INFO] 
[INFO] --- maven-compiler-plugin:3.7.0:testCompile (default-testCompile) @ atlas-webapp ---
[INFO] Changes detected - recompiling the module!
[INFO] Compiling 48 source files to <https://builds.apache.org/job/Atlas-1.0-UnitTests/ws/webapp/target/test-classes>
[INFO] <https://builds.apache.org/job/Atlas-1.0-UnitTests/ws/webapp/src/test/java/org/apache/atlas/web/adapters/TestEntitiesREST.java>:
Some input files use or override a deprecated API.
[INFO] <https://builds.apache.org/job/Atlas-1.0-UnitTests/ws/webapp/src/test/java/org/apache/atlas/web/adapters/TestEntitiesREST.java>:
Recompile with -Xlint:deprecation for details.
[INFO] <https://builds.apache.org/job/Atlas-1.0-UnitTests/ws/webapp/src/test/java/org/apache/atlas/util/RestUtilsTest.java>:
Some input files use unchecked or unsafe operations.
[INFO] <https://builds.apache.org/job/Atlas-1.0-UnitTests/ws/webapp/src/test/java/org/apache/atlas/util/RestUtilsTest.java>:
Recompile with -Xlint:unchecked for details.
[INFO] 
[INFO] --- maven-surefire-plugin:2.18.1:test (default-test) @ atlas-webapp ---
[INFO] Tests are skipped.
[INFO] 
[INFO] --- maven-surefire-plugin:2.18.1:test (unit-tests) @ atlas-webapp ---
[WARNING] The parameter forkMode is deprecated since version 2.14. Use forkCount and reuseForks
instead.
[INFO] Surefire report directory: <https://builds.apache.org/job/Atlas-1.0-UnitTests/ws/webapp/target/surefire-reports>
[INFO] Using configured provider org.apache.maven.surefire.testng.TestNGProvider

-------------------------------------------------------
 T E S T S
-------------------------------------------------------
Running org.apache.atlas.notification.NotificationHookConsumerKafkaTest
Tests run: 3, Failures: 1, Errors: 0, Skipped: 1, Time elapsed: 26.827 sec <<< FAILURE!
- in org.apache.atlas.notification.NotificationHookConsumerKafkaTest
testConsumerConsumesNewMessageWithAutoCommitDisabled(org.apache.atlas.notification.NotificationHookConsumerKafkaTest)
 Time elapsed: 15.078 sec  <<< FAILURE!
org.mockito.exceptions.verification.WantedButNotInvoked: 
Wanted but not invoked:
atlasEntityStore.createOrUpdate(
    <any>,
    <any>
);
-> at org.apache.atlas.notification.NotificationHookConsumerKafkaTest.testConsumerConsumesNewMessageWithAutoCommitDisabled(NotificationHookConsumerKafkaTest.java:112)
Actually, there were zero interactions with this mock.

	at org.apache.atlas.notification.NotificationHookConsumerKafkaTest.testConsumerConsumesNewMessageWithAutoCommitDisabled(NotificationHookConsumerKafkaTest.java:112)

Running org.apache.atlas.notification.NotificationHookConsumerTest
Tests run: 12, Failures: 0, Errors: 0, Skipped: 0, Time elapsed: 7.735 sec - in org.apache.atlas.notification.NotificationHookConsumerTest
Running org.apache.atlas.notification.NotificationEntityChangeListenerTest
Tests run: 1, Failures: 0, Errors: 0, Skipped: 0, Time elapsed: 0.923 sec - in org.apache.atlas.notification.NotificationEntityChangeListenerTest
Running org.apache.atlas.notification.AdaptiveWaiterTest
Tests run: 3, Failures: 0, Errors: 0, Skipped: 0, Time elapsed: 4.204 sec - in org.apache.atlas.notification.AdaptiveWaiterTest
Running org.apache.atlas.util.RestUtilsTest
Tests run: 2, Failures: 0, Errors: 0, Skipped: 0, Time elapsed: 1.89 sec - in org.apache.atlas.util.RestUtilsTest
Running org.apache.atlas.web.setup.SetupStepsTest
Tests run: 6, Failures: 0, Errors: 0, Skipped: 0, Time elapsed: 1.247 sec - in org.apache.atlas.web.setup.SetupStepsTest
Running org.apache.atlas.web.resources.AdminExportTest
Tests run: 0, Failures: 0, Errors: 0, Skipped: 0, Time elapsed: 0.318 sec - in org.apache.atlas.web.resources.AdminExportTest
Running org.apache.atlas.web.resources.EntityResourceTest
Tests run: 1, Failures: 0, Errors: 0, Skipped: 0, Time elapsed: 0.701 sec - in org.apache.atlas.web.resources.EntityResourceTest
Running org.apache.atlas.web.resources.AdminResourceTest
Tests run: 2, Failures: 0, Errors: 0, Skipped: 0, Time elapsed: 1.664 sec - in org.apache.atlas.web.resources.AdminResourceTest
Running org.apache.atlas.web.filters.AtlasCSRFPreventionFilterTest
Tests run: 6, Failures: 0, Errors: 0, Skipped: 0, Time elapsed: 1.342 sec - in org.apache.atlas.web.filters.AtlasCSRFPreventionFilterTest
Running org.apache.atlas.web.filters.AuditFilterTest
Tests run: 6, Failures: 0, Errors: 0, Skipped: 0, Time elapsed: 1.431 sec - in org.apache.atlas.web.filters.AuditFilterTest
Running org.apache.atlas.web.security.UserDaoTest
Tests run: 2, Failures: 0, Errors: 0, Skipped: 0, Time elapsed: 0.746 sec - in org.apache.atlas.web.security.UserDaoTest
Running org.apache.atlas.web.security.FileAuthenticationTest
Tests run: 6, Failures: 0, Errors: 0, Skipped: 0, Time elapsed: 2.874 sec - in org.apache.atlas.web.security.FileAuthenticationTest
Running org.apache.atlas.web.util.ServletsTest
Tests run: 1, Failures: 0, Errors: 0, Skipped: 0, Time elapsed: 1.388 sec - in org.apache.atlas.web.util.ServletsTest
Running org.apache.atlas.web.service.ActiveInstanceElectorServiceTest
Tests run: 14, Failures: 0, Errors: 0, Skipped: 0, Time elapsed: 1.248 sec - in org.apache.atlas.web.service.ActiveInstanceElectorServiceTest
Running org.apache.atlas.web.service.ActiveInstanceStateTest
Tests run: 5, Failures: 0, Errors: 0, Skipped: 0, Time elapsed: 1.013 sec - in org.apache.atlas.web.service.ActiveInstanceStateTest
Running org.apache.atlas.web.service.AtlasZookeeperSecurityPropertiesTest
Tests run: 6, Failures: 0, Errors: 0, Skipped: 0, Time elapsed: 0.435 sec - in org.apache.atlas.web.service.AtlasZookeeperSecurityPropertiesTest
Running org.apache.atlas.web.service.CuratorFactoryTest
Tests run: 3, Failures: 0, Errors: 0, Skipped: 0, Time elapsed: 1.591 sec - in org.apache.atlas.web.service.CuratorFactoryTest
Running org.apache.atlas.web.service.ServiceStateTest
Tests run: 3, Failures: 0, Errors: 0, Skipped: 0, Time elapsed: 1.046 sec - in org.apache.atlas.web.service.ServiceStateTest

Results :

Failed tests: 
  NotificationHookConsumerKafkaTest.testConsumerConsumesNewMessageWithAutoCommitDisabled:112

Wanted but not invoked:
atlasEntityStore.createOrUpdate(
    <any>,
    <any>
);
-> at org.apache.atlas.notification.NotificationHookConsumerKafkaTest.testConsumerConsumesNewMessageWithAutoCommitDisabled(NotificationHookConsumerKafkaTest.java:112)
Actually, there were zero interactions with this mock.


Tests run: 82, Failures: 1, Errors: 0, Skipped: 1

[INFO] ------------------------------------------------------------------------
[INFO] Reactor Summary:
[INFO] 
[INFO] Apache Atlas Server Build Tools 1.0 ................ SUCCESS [  0.652 s]
[INFO] apache-atlas 1.1.0-SNAPSHOT ........................ SUCCESS [  2.390 s]
[INFO] Apache Atlas Test Utility Tools .................... SUCCESS [  5.133 s]
[INFO] Apache Atlas Integration ........................... SUCCESS [ 40.493 s]
[INFO] Apache Atlas Common ................................ SUCCESS [  2.962 s]
[INFO] Apache Atlas Client ................................ SUCCESS [  0.243 s]
[INFO] atlas-client-common ................................ SUCCESS [  1.235 s]
[INFO] atlas-client-v1 .................................... SUCCESS [  3.071 s]
[INFO] Apache Atlas Server API ............................ SUCCESS [  1.133 s]
[INFO] Apache Atlas Notification .......................... SUCCESS [ 28.338 s]
[INFO] atlas-client-v2 .................................... SUCCESS [  0.980 s]
[INFO] Apache Atlas Graph Database Projects ............... SUCCESS [  0.112 s]
[INFO] Apache Atlas Graph Database API .................... SUCCESS [  0.788 s]
[INFO] Graph Database Common Code ......................... SUCCESS [  1.002 s]
[INFO] Apache Atlas JanusGraph DB Impl .................... SUCCESS [02:44 min]
[INFO] Apache Atlas Graph Database Implementation Dependencies SUCCESS [  2.450 s]
[INFO] Shaded version of Apache hbase client .............. SUCCESS [  9.579 s]
[INFO] Shaded version of Apache hbase server .............. SUCCESS [ 22.631 s]
[INFO] Apache Atlas Authorization ......................... SUCCESS [  2.403 s]
[INFO] Apache Atlas Repository ............................ SUCCESS [06:58 min]
[INFO] Apache Atlas UI .................................... SUCCESS [01:47 min]
[INFO] Apache Atlas Web Application ....................... FAILURE [01:20 min]
[INFO] Apache Atlas Documentation ......................... SKIPPED
[INFO] Apache Atlas FileSystem Model ...................... SKIPPED
[INFO] Apache Atlas Plugin Classloader .................... SKIPPED
[INFO] Apache Atlas Hive Bridge Shim ...................... SKIPPED
[INFO] Apache Atlas Hive Bridge ........................... SKIPPED
[INFO] Apache Atlas Falcon Bridge Shim .................... SKIPPED
[INFO] Apache Atlas Falcon Bridge ......................... SKIPPED
[INFO] Apache Atlas Sqoop Bridge Shim ..................... SKIPPED
[INFO] Apache Atlas Sqoop Bridge .......................... SKIPPED
[INFO] Apache Atlas Storm Bridge Shim ..................... SKIPPED
[INFO] Apache Atlas Storm Bridge .......................... SKIPPED
[INFO] Apache Atlas Hbase Bridge Shim ..................... SKIPPED
[INFO] Apache Atlas Hbase Bridge .......................... SKIPPED
[INFO] Apache Atlas Kafka Bridge .......................... SKIPPED
[INFO] Apache Atlas Distribution 1.1.0-SNAPSHOT ........... SKIPPED
[INFO] ------------------------------------------------------------------------
[INFO] BUILD FAILURE
[INFO] ------------------------------------------------------------------------
[INFO] Total time: 14:57 min
[INFO] Finished at: 2018-09-06T21:25:07Z
[INFO] ------------------------------------------------------------------------
[ERROR] Failed to execute goal org.apache.maven.plugins:maven-surefire-plugin:2.18.1:test
(unit-tests) on project atlas-webapp: There are test failures.
[ERROR] 
[ERROR] Please refer to <https://builds.apache.org/job/Atlas-1.0-UnitTests/ws/webapp/target/surefire-reports>
for the individual test results.
[ERROR] -> [Help 1]
[ERROR] 
[ERROR] To see the full stack trace of the errors, re-run Maven with the -e switch.
[ERROR] Re-run Maven using the -X switch to enable full debug logging.
[ERROR] 
[ERROR] For more information about the errors and possible solutions, please read the following
articles:
[ERROR] [Help 1] http://cwiki.apache.org/confluence/display/MAVEN/MojoFailureException
[ERROR] 
[ERROR] After correcting the problems, you can resume the build with the command
[ERROR]   mvn <goals> -rf :atlas-webapp
Build step 'Execute shell' marked build as failure
[CHECKSTYLE] Collecting checkstyle analysis files...
[CHECKSTYLE] Searching for all files in <https://builds.apache.org/job/Atlas-1.0-UnitTests/ws/>
that match the pattern **/target/checkstyle-result.xml
[CHECKSTYLE] No files found. Configuration error?
<Git Blamer> Using GitBlamer to create author and commit information for all warnings.
<Git Blamer> GIT_COMMIT=a19b3906b229f4adddf1c0c934d718ff319e3f4f, workspace=<https://builds.apache.org/job/Atlas-1.0-UnitTests/ws/>
[CHECKSTYLE] Computing warning deltas based on reference build #976
[FINDBUGS] Collecting findbugs analysis files...
[FINDBUGS] Searching for all files in <https://builds.apache.org/job/Atlas-1.0-UnitTests/ws/>
that match the pattern **/target/findbugs.xml
[FINDBUGS] No files found. Configuration error?
<Git Blamer> Using GitBlamer to create author and commit information for all warnings.
<Git Blamer> GIT_COMMIT=a19b3906b229f4adddf1c0c934d718ff319e3f4f, workspace=<https://builds.apache.org/job/Atlas-1.0-UnitTests/ws/>
[FINDBUGS] Computing warning deltas based on reference build #976
Archiving artifacts
TestNG Reports Processing: START
Looking for TestNG results report in workspace using pattern: **/target/surefire-reports/testng-results.xml,**/target/failsafe-reports/testng-results.xml
Saving reports...
Processing '/x1/jenkins/jenkins-home/jobs/Atlas-1.0-UnitTests/builds/978/testng/testng-results-1.xml'
Processing '/x1/jenkins/jenkins-home/jobs/Atlas-1.0-UnitTests/builds/978/testng/testng-results-2.xml'
Processing '/x1/jenkins/jenkins-home/jobs/Atlas-1.0-UnitTests/builds/978/testng/testng-results-3.xml'
Processing '/x1/jenkins/jenkins-home/jobs/Atlas-1.0-UnitTests/builds/978/testng/testng-results-4.xml'
Processing '/x1/jenkins/jenkins-home/jobs/Atlas-1.0-UnitTests/builds/978/testng/testng-results-5.xml'
Processing '/x1/jenkins/jenkins-home/jobs/Atlas-1.0-UnitTests/builds/978/testng/testng-results-6.xml'
Processing '/x1/jenkins/jenkins-home/jobs/Atlas-1.0-UnitTests/builds/978/testng/testng-results-7.xml'
Processing '/x1/jenkins/jenkins-home/jobs/Atlas-1.0-UnitTests/builds/978/testng/testng-results.xml'
TestNG Reports Processing: FINISH

Mime
View raw message