atlas-dev mailing list archives

Site index · List index
Message view « Date » · « Thread »
Top « Date » · « Thread »
From Apache Jenkins Server <jenk...@builds.apache.org>
Subject Build failed in Jenkins: Atlas-1.0-IntegrationTests #979
Date Sat, 08 Sep 2018 10:16:14 GMT
See <https://builds.apache.org/job/Atlas-1.0-IntegrationTests/979/display/redirect>

------------------------------------------
[...truncated 582.05 KB...]
127.0.0.1 - - [08/Sep/2018:10:08:03 +0000] "GET //localhost:31000/api/atlas/v2/entity/uniqueAttribute/type/hive_process?attr:qualifiedName=LOAD-%3E:default.tableinrjo2hrba@primary:1536401267000
HTTP/1.1" 200 2586 "-" "Java/1.8.0_172"
127.0.0.1 - - [08/Sep/2018:10:08:03 +0000] "GET //localhost:31000/api/atlas/v2/entity/uniqueAttribute/type/hive_process?attr:qualifiedName=LOAD-%3E:default.tableinrjo2hrba@primary:1536401267000
HTTP/1.1" 200 2586 "-" "Java/1.8.0_172"
127.0.0.1 - - [08/Sep/2018:10:08:03 +0000] "GET //localhost:31000/api/atlas/v2/entity/guid/63f31b48-8928-4b7b-8350-92396f43459f
HTTP/1.1" 200 2586 "-" "Java/1.8.0_172"
127.0.0.1 - - [08/Sep/2018:10:08:03 +0000] "GET //localhost:31000/api/atlas/v2/entity/guid/010cd3ba-543a-499c-9072-7413f75f3b08
HTTP/1.1" 200 1446 "-" "Java/1.8.0_172"
127.0.0.1 - - [08/Sep/2018:10:08:03 +0000] "GET //localhost:31000/api/atlas/v2/entity/guid/103f9f34-b05f-4816-af6d-59c40a7d0f12
HTTP/1.1" 200 1444 "-" "Java/1.8.0_172"
127.0.0.1 - - [08/Sep/2018:10:08:03 +0000] "GET //localhost:31000/api/atlas/v2/entity/guid/33f33df4-3e83-401a-8276-43fd5ea65148
HTTP/1.1" 200 7383 "-" "Java/1.8.0_172"
127.0.0.1 - - [08/Sep/2018:10:08:04 +0000] "GET //localhost:31000/api/atlas/v2/entity/uniqueAttribute/type/hive_process?attr:qualifiedName=LOAD-%3E:default.tablejdlrywybn5@primary:1536401283000
HTTP/1.1" 404 177 "-" "Java/1.8.0_172"
127.0.0.1 - - [08/Sep/2018:10:08:09 +0000] "GET //localhost:31000/api/atlas/v2/entity/uniqueAttribute/type/hive_process?attr:qualifiedName=LOAD-%3E:default.tablejdlrywybn5@primary:1536401283000
HTTP/1.1" 200 1588 "-" "Java/1.8.0_172"
127.0.0.1 - - [08/Sep/2018:10:08:09 +0000] "GET //localhost:31000/api/atlas/v2/entity/uniqueAttribute/type/hive_process?attr:qualifiedName=LOAD-%3E:default.tablejdlrywybn5@primary:1536401283000
HTTP/1.1" 200 1588 "-" "Java/1.8.0_172"
127.0.0.1 - - [08/Sep/2018:10:08:09 +0000] "GET //localhost:31000/api/atlas/v2/entity/uniqueAttribute/type/hive_process?attr:qualifiedName=LOAD-%3E:default.tablem9rc0sezz6@primary:1536401289000
HTTP/1.1" 404 177 "-" "Java/1.8.0_172"
127.0.0.1 - - [08/Sep/2018:10:08:14 +0000] "GET //localhost:31000/api/atlas/v2/entity/uniqueAttribute/type/hive_process?attr:qualifiedName=LOAD-%3E:default.tablem9rc0sezz6@primary:1536401289000
HTTP/1.1" 200 1675 "-" "Java/1.8.0_172"
127.0.0.1 - - [08/Sep/2018:10:08:14 +0000] "GET //localhost:31000/api/atlas/v2/entity/uniqueAttribute/type/hive_process?attr:qualifiedName=LOAD-%3E:default.tablem9rc0sezz6@primary:1536401289000
HTTP/1.1" 200 1675 "-" "Java/1.8.0_172"
127.0.0.1 - - [08/Sep/2018:10:08:21 +0000] "GET //localhost:31000/api/atlas/v2/entity/uniqueAttribute/type/hive_column?attr:qualifiedName=dbamghawhe8e.tablegtudwpizs9.id@primary
HTTP/1.1" 404 163 "-" "Java/1.8.0_172"
127.0.0.1 - - [08/Sep/2018:10:08:26 +0000] "GET //localhost:31000/api/atlas/v2/entity/uniqueAttribute/type/hive_column?attr:qualifiedName=dbamghawhe8e.tablegtudwpizs9.id@primary
HTTP/1.1" 200 845 "-" "Java/1.8.0_172"
127.0.0.1 - - [08/Sep/2018:10:08:26 +0000] "GET //localhost:31000/api/atlas/v2/entity/uniqueAttribute/type/hive_column?attr:qualifiedName=dbamghawhe8e.tablegtudwpizs9.id@primary
HTTP/1.1" 200 845 "-" "Java/1.8.0_172"
127.0.0.1 - - [08/Sep/2018:10:08:26 +0000] "POST //localhost:31000/api/atlas/v2/types/typedefs/
HTTP/1.1" 200 425 "-" "Java/1.8.0_172"
127.0.0.1 - - [08/Sep/2018:10:08:26 +0000] "POST //localhost:31000/api/atlas/v2/entity/guid/e48b5b2d-9702-4621-9c42-768f803ea59c/classifications
HTTP/1.1" 204 0 "-" "Java/1.8.0_172"
127.0.0.1 - - [08/Sep/2018:10:08:29 +0000] "GET //localhost:31000/api/atlas/v2/entity/uniqueAttribute/type/hive_column?attr:qualifiedName=dbamghawhe8e.tablegtudwpizs9.id_new@primary
HTTP/1.1" 200 1042 "-" "Java/1.8.0_172"
127.0.0.1 - - [08/Sep/2018:10:08:29 +0000] "GET //localhost:31000/api/atlas/v2/entity/uniqueAttribute/type/hive_column?attr:qualifiedName=dbamghawhe8e.tablegtudwpizs9.id_new@primary
HTTP/1.1" 200 1042 "-" "Java/1.8.0_172"
127.0.0.1 - - [08/Sep/2018:10:08:29 +0000] "GET //localhost:31000/api/atlas/entities/e48b5b2d-9702-4621-9c42-768f803ea59c
HTTP/1.1" 200 1062 "-" "Java/1.8.0_172"
127.0.0.1 - - [08/Sep/2018:10:08:30 +0000] "GET //localhost:31000/api/atlas/v2/entity/uniqueAttribute/type/hive_table?attr:qualifiedName=default.tablebxyko7k0zh@primary
HTTP/1.1" 404 154 "-" "Java/1.8.0_172"
127.0.0.1 - - [08/Sep/2018:10:08:35 +0000] "GET //localhost:31000/api/atlas/v2/entity/uniqueAttribute/type/hive_table?attr:qualifiedName=default.tablebxyko7k0zh@primary
HTTP/1.1" 200 5476 "-" "Java/1.8.0_172"
127.0.0.1 - - [08/Sep/2018:10:08:35 +0000] "GET //localhost:31000/api/atlas/v2/entity/uniqueAttribute/type/hive_table?attr:qualifiedName=default.tablebxyko7k0zh@primary
HTTP/1.1" 200 5476 "-" "Java/1.8.0_172"
127.0.0.1 - - [08/Sep/2018:10:08:35 +0000] "GET //localhost:31000/api/atlas/v2/entity/uniqueAttribute/type/hive_process?attr:qualifiedName=TRUNCATETABLE-%3E:default.tablebxyko7k0zh@primary:1536401309000
HTTP/1.1" 200 1186 "-" "Java/1.8.0_172"
127.0.0.1 - - [08/Sep/2018:10:08:35 +0000] "GET //localhost:31000/api/atlas/v2/entity/uniqueAttribute/type/hive_process?attr:qualifiedName=TRUNCATETABLE-%3E:default.tablebxyko7k0zh@primary:1536401309000
HTTP/1.1" 200 1186 "-" "Java/1.8.0_172"
127.0.0.1 - - [08/Sep/2018:10:08:35 +0000] "GET //localhost:31000/api/atlas/v2/entity/guid/a57b6e4b-6e28-4047-bbf7-63d7c7185de4
HTTP/1.1" 200 1186 "-" "Java/1.8.0_172"
127.0.0.1 - - [08/Sep/2018:10:08:35 +0000] "GET //localhost:31000/api/atlas/v2/entity/guid/f1f22e43-7e5f-4eb3-9a09-e248f92eb109
HTTP/1.1" 200 5476 "-" "Java/1.8.0_172"
127.0.0.1 - - [08/Sep/2018:10:08:35 +0000] "GET //localhost:31000/api/atlas/v2/lineage/f1f22e43-7e5f-4eb3-9a09-e248f92eb109?depth=0&direction=INPUT
HTTP/1.1" 200 135 "-" "Java/1.8.0_172"
127.0.0.1 - - [08/Sep/2018:10:08:39 +0000] "GET //localhost:31000/api/atlas/v2/entity/uniqueAttribute/type/hive_process?attr:qualifiedName=QUERY:default.table7v2j2qrwaw@primary:1536401317000-%3E
HTTP/1.1" 200 2114 "-" "Java/1.8.0_172"
127.0.0.1 - - [08/Sep/2018:10:08:39 +0000] "GET //localhost:31000/api/atlas/v2/entity/uniqueAttribute/type/hive_process?attr:qualifiedName=QUERY:default.table7v2j2qrwaw@primary:1536401317000-%3E
HTTP/1.1" 200 2114 "-" "Java/1.8.0_172"
127.0.0.1 - - [08/Sep/2018:10:08:39 +0000] "GET //localhost:31000/api/atlas/v2/entity/guid/bf768132-c924-4e1c-9d8f-64785d5e576e
HTTP/1.1" 200 2114 "-" "Java/1.8.0_172"
127.0.0.1 - - [08/Sep/2018:10:08:39 +0000] "GET //localhost:31000/api/atlas/v2/entity/guid/758ee757-7b9b-49f9-bf5d-24ce95cfd4a0
HTTP/1.1" 200 5640 "-" "Java/1.8.0_172"
127.0.0.1 - - [08/Sep/2018:10:08:39 +0000] "GET //localhost:31000/api/atlas/v2/entity/guid/2d21f847-6cd6-4fda-a954-8e52233c12b6
HTTP/1.1" 200 1440 "-" "Java/1.8.0_172"
127.0.0.1 - - [08/Sep/2018:10:08:39 +0000] "GET //localhost:31000/api/atlas/v2/entity/uniqueAttribute/type/hdfs_path?attr:qualifiedName=pfile:/home/jenkins/jenkins-slave/workspace/atlas-1.0-integrationtests/addons/hive-bridge/target/somedfspath1-data-drthxmnnbr
HTTP/1.1" 200 1440 "-" "Java/1.8.0_172"
127.0.0.1 - - [08/Sep/2018:10:08:39 +0000] "GET //localhost:31000/api/atlas/v2/entity/uniqueAttribute/type/hdfs_path?attr:qualifiedName=pfile:/home/jenkins/jenkins-slave/workspace/atlas-1.0-integrationtests/addons/hive-bridge/target/somedfspath1-data-drthxmnnbr
HTTP/1.1" 200 1440 "-" "Java/1.8.0_172"
127.0.0.1 - - [08/Sep/2018:10:08:39 +0000] "GET //localhost:31000/api/atlas/v2/entity/uniqueAttribute/type/hive_table?attr:qualifiedName=default.table7v2j2qrwaw@primary
HTTP/1.1" 200 5640 "-" "Java/1.8.0_172"
127.0.0.1 - - [08/Sep/2018:10:08:39 +0000] "GET //localhost:31000/api/atlas/v2/entity/uniqueAttribute/type/hive_table?attr:qualifiedName=default.table7v2j2qrwaw@primary
HTTP/1.1" 200 5640 "-" "Java/1.8.0_172"
127.0.0.1 - - [08/Sep/2018:10:08:40 +0000] "GET //localhost:31000/api/atlas/v2/entity/guid/758ee757-7b9b-49f9-bf5d-24ce95cfd4a0
HTTP/1.1" 200 5640 "-" "Java/1.8.0_172"
127.0.0.1 - - [08/Sep/2018:10:08:43 +0000] "GET //localhost:31000/api/atlas/v2/entity/uniqueAttribute/type/hive_table?attr:qualifiedName=default.table7v2j2qrwaw@primary
HTTP/1.1" 200 5640 "-" "Java/1.8.0_172"
127.0.0.1 - - [08/Sep/2018:10:08:43 +0000] "GET //localhost:31000/api/atlas/v2/entity/uniqueAttribute/type/hive_table?attr:qualifiedName=default.table7v2j2qrwaw@primary
HTTP/1.1" 200 5640 "-" "Java/1.8.0_172"
127.0.0.1 - - [08/Sep/2018:10:08:43 +0000] "GET //localhost:31000/api/atlas/v2/entity/uniqueAttribute/type/hive_process?attr:qualifiedName=QUERY:default.table7v2j2qrwaw@primary:1536401317000-%3E
HTTP/1.1" 200 2114 "-" "Java/1.8.0_172"
127.0.0.1 - - [08/Sep/2018:10:08:43 +0000] "GET //localhost:31000/api/atlas/v2/entity/uniqueAttribute/type/hive_process?attr:qualifiedName=QUERY:default.table7v2j2qrwaw@primary:1536401317000-%3E
HTTP/1.1" 200 2114 "-" "Java/1.8.0_172"
127.0.0.1 - - [08/Sep/2018:10:08:43 +0000] "GET //localhost:31000/api/atlas/v2/entity/guid/bf768132-c924-4e1c-9d8f-64785d5e576e
HTTP/1.1" 200 2114 "-" "Java/1.8.0_172"
127.0.0.1 - - [08/Sep/2018:10:08:43 +0000] "GET //localhost:31000/api/atlas/v2/entity/guid/758ee757-7b9b-49f9-bf5d-24ce95cfd4a0
HTTP/1.1" 200 5640 "-" "Java/1.8.0_172"
127.0.0.1 - - [08/Sep/2018:10:08:43 +0000] "GET //localhost:31000/api/atlas/v2/entity/guid/2d21f847-6cd6-4fda-a954-8e52233c12b6
HTTP/1.1" 200 1440 "-" "Java/1.8.0_172"
127.0.0.1 - - [08/Sep/2018:10:08:43 +0000] "GET //localhost:31000/api/atlas/v2/entity/uniqueAttribute/type/hdfs_path?attr:qualifiedName=pfile:/home/jenkins/jenkins-slave/workspace/atlas-1.0-integrationtests/addons/hive-bridge/target/somedfspath1-data-drthxmnnbr
HTTP/1.1" 200 1440 "-" "Java/1.8.0_172"
127.0.0.1 - - [08/Sep/2018:10:08:43 +0000] "GET //localhost:31000/api/atlas/v2/entity/uniqueAttribute/type/hdfs_path?attr:qualifiedName=pfile:/home/jenkins/jenkins-slave/workspace/atlas-1.0-integrationtests/addons/hive-bridge/target/somedfspath1-data-drthxmnnbr
HTTP/1.1" 200 1440 "-" "Java/1.8.0_172"
127.0.0.1 - - [08/Sep/2018:10:08:47 +0000] "GET //localhost:31000/api/atlas/v2/entity/uniqueAttribute/type/hive_table?attr:qualifiedName=default.table7v2j2qrwaw@primary
HTTP/1.1" 200 5640 "-" "Java/1.8.0_172"
127.0.0.1 - - [08/Sep/2018:10:08:47 +0000] "GET //localhost:31000/api/atlas/v2/entity/uniqueAttribute/type/hive_table?attr:qualifiedName=default.table7v2j2qrwaw@primary
HTTP/1.1" 200 5640 "-" "Java/1.8.0_172"
127.0.0.1 - - [08/Sep/2018:10:08:47 +0000] "GET //localhost:31000/api/atlas/v2/entity/uniqueAttribute/type/hive_process?attr:qualifiedName=QUERY:default.table7v2j2qrwaw@primary:1536401317000-%3E
HTTP/1.1" 200 2569 "-" "Java/1.8.0_172"
127.0.0.1 - - [08/Sep/2018:10:08:47 +0000] "GET //localhost:31000/api/atlas/v2/entity/uniqueAttribute/type/hive_process?attr:qualifiedName=QUERY:default.table7v2j2qrwaw@primary:1536401317000-%3E
HTTP/1.1" 200 2569 "-" "Java/1.8.0_172"
127.0.0.1 - - [08/Sep/2018:10:08:47 +0000] "GET //localhost:31000/api/atlas/v2/entity/guid/bf768132-c924-4e1c-9d8f-64785d5e576e
HTTP/1.1" 200 2569 "-" "Java/1.8.0_172"
127.0.0.1 - - [08/Sep/2018:10:08:47 +0000] "GET //localhost:31000/api/atlas/v2/entity/guid/758ee757-7b9b-49f9-bf5d-24ce95cfd4a0
HTTP/1.1" 200 5640 "-" "Java/1.8.0_172"
127.0.0.1 - - [08/Sep/2018:10:08:47 +0000] "GET //localhost:31000/api/atlas/v2/entity/guid/76745208-4f12-4b2e-b0f2-08419cdd6939
HTTP/1.1" 200 1440 "-" "Java/1.8.0_172"
127.0.0.1 - - [08/Sep/2018:10:08:47 +0000] "GET //localhost:31000/api/atlas/v2/entity/guid/2d21f847-6cd6-4fda-a954-8e52233c12b6
HTTP/1.1" 200 1441 "-" "Java/1.8.0_172"
127.0.0.1 - - [08/Sep/2018:10:08:47 +0000] "GET //localhost:31000/api/atlas/v2/entity/uniqueAttribute/type/hdfs_path?attr:qualifiedName=pfile:/home/jenkins/jenkins-slave/workspace/atlas-1.0-integrationtests/addons/hive-bridge/target/somedfspath2-data-tihran2npr
HTTP/1.1" 200 1440 "-" "Java/1.8.0_172"
127.0.0.1 - - [08/Sep/2018:10:08:47 +0000] "GET //localhost:31000/api/atlas/v2/entity/uniqueAttribute/type/hdfs_path?attr:qualifiedName=pfile:/home/jenkins/jenkins-slave/workspace/atlas-1.0-integrationtests/addons/hive-bridge/target/somedfspath2-data-tihran2npr
HTTP/1.1" 200 1440 "-" "Java/1.8.0_172"
127.0.0.1 - - [08/Sep/2018:10:08:48 +0000] "GET //localhost:31000/api/atlas/v2/entity/uniqueAttribute/type/hive_db?attr:qualifiedName=default@primary
HTTP/1.1" 200 17595 "-" "Java/1.8.0_172"
127.0.0.1 - - [08/Sep/2018:10:08:48 +0000] "GET //localhost:31000/api/atlas/v2/entity/uniqueAttribute/type/hive_db?attr:qualifiedName=default@primary
HTTP/1.1" 200 17595 "-" "Java/1.8.0_172"
127.0.0.1 - - [08/Sep/2018:10:08:48 +0000] "GET //localhost:31000/api/atlas/v2/entity/uniqueAttribute/type/hive_table?attr:qualifiedName=default.tableeou4fmxzwf@primary
HTTP/1.1" 404 154 "-" "Java/1.8.0_172"
127.0.0.1 - - [08/Sep/2018:10:08:53 +0000] "GET //localhost:31000/api/atlas/v2/entity/uniqueAttribute/type/hive_table?attr:qualifiedName=default.tableeou4fmxzwf@primary
HTTP/1.1" 200 5623 "-" "Java/1.8.0_172"
127.0.0.1 - - [08/Sep/2018:10:08:53 +0000] "GET //localhost:31000/api/atlas/v2/entity/uniqueAttribute/type/hive_table?attr:qualifiedName=default.tableeou4fmxzwf@primary
HTTP/1.1" 200 5623 "-" "Java/1.8.0_172"
127.0.0.1 - - [08/Sep/2018:10:08:53 +0000] "GET //localhost:31000/api/atlas/v2/entity/uniqueAttribute/type/hive_process?attr:qualifiedName=default.tableeou4fmxzwf@primary:1536401328000
HTTP/1.1" 200 2113 "-" "Java/1.8.0_172"
127.0.0.1 - - [08/Sep/2018:10:08:53 +0000] "GET //localhost:31000/api/atlas/v2/entity/uniqueAttribute/type/hive_process?attr:qualifiedName=default.tableeou4fmxzwf@primary:1536401328000
HTTP/1.1" 200 2113 "-" "Java/1.8.0_172"
127.0.0.1 - - [08/Sep/2018:10:08:53 +0000] "GET //localhost:31000/api/atlas/v2/entity/guid/be474d65-82b4-450d-af98-7cd010e4c2ba
HTTP/1.1" 200 2113 "-" "Java/1.8.0_172"
127.0.0.1 - - [08/Sep/2018:10:08:53 +0000] "GET //localhost:31000/api/atlas/v2/entity/uniqueAttribute/type/hdfs_path?attr:qualifiedName=pfile:/home/jenkins/jenkins-slave/workspace/atlas-1.0-integrationtests/addons/hive-bridge/target/parentpath-data-t01ymsucjk
HTTP/1.1" 200 1434 "-" "Java/1.8.0_172"
127.0.0.1 - - [08/Sep/2018:10:08:53 +0000] "GET //localhost:31000/api/atlas/v2/entity/uniqueAttribute/type/hdfs_path?attr:qualifiedName=pfile:/home/jenkins/jenkins-slave/workspace/atlas-1.0-integrationtests/addons/hive-bridge/target/parentpath-data-t01ymsucjk
HTTP/1.1" 200 1434 "-" "Java/1.8.0_172"
127.0.0.1 - - [08/Sep/2018:10:08:53 +0000] "GET //localhost:31000/api/atlas/entities?type=hive_table
HTTP/1.1" 200 2732 "-" "Java/1.8.0_172"
127.0.0.1 - - [08/Sep/2018:10:08:53 +0000] "GET //localhost:31000/api/atlas/v2/entity/guid/9816f56c-b135-43f2-85b1-083d080ebe53
HTTP/1.1" 200 17865 "-" "Java/1.8.0_172"
127.0.0.1 - - [08/Sep/2018:10:08:53 +0000] "GET //localhost:31000/api/atlas/v2/entity/uniqueAttribute/type/hive_table?attr:qualifiedName=default.tableeou4fmxzwf@primary
HTTP/1.1" 200 5623 "-" "Java/1.8.0_172"
127.0.0.1 - - [08/Sep/2018:10:08:53 +0000] "POST //localhost:31000/api/atlas/v2/entity/ HTTP/1.1"
200 384 "-" "Java/1.8.0_172"
127.0.0.1 - - [08/Sep/2018:10:08:53 +0000] "GET //localhost:31000/api/atlas/v2/entity/uniqueAttribute/type/hive_process?attr:qualifiedName=default.tableeou4fmxzwf@primary:1536401328000
HTTP/1.1" 200 2113 "-" "Java/1.8.0_172"
127.0.0.1 - - [08/Sep/2018:10:08:53 +0000] "GET //localhost:31000/api/atlas/v2/entity/uniqueAttribute/type/hive_table?attr:qualifiedName=default.tableeou4fmxzwf@primary
HTTP/1.1" 200 5621 "-" "Java/1.8.0_172"
127.0.0.1 - - [08/Sep/2018:10:08:53 +0000] "GET //localhost:31000/api/atlas/v2/entity/uniqueAttribute/type/hive_table?attr:qualifiedName=default.tableeou4fmxzwf@primary
HTTP/1.1" 200 5621 "-" "Java/1.8.0_172"
127.0.0.1 - - [08/Sep/2018:10:08:54 +0000] "GET //localhost:31000/api/atlas/v2/entity/uniqueAttribute/type/hive_process?attr:qualifiedName=default.tableeou4fmxzwf@primary:1536401328000
HTTP/1.1" 200 2113 "-" "Java/1.8.0_172"
127.0.0.1 - - [08/Sep/2018:10:08:54 +0000] "GET //localhost:31000/api/atlas/v2/entity/uniqueAttribute/type/hive_process?attr:qualifiedName=default.tableeou4fmxzwf@primary:1536401328000
HTTP/1.1" 200 2113 "-" "Java/1.8.0_172"
127.0.0.1 - - [08/Sep/2018:10:08:54 +0000] "GET //localhost:31000/api/atlas/entities?type=hive_table
HTTP/1.1" 200 2732 "-" "Java/1.8.0_172"
127.0.0.1 - - [08/Sep/2018:10:08:54 +0000] "GET //localhost:31000/api/atlas/v2/entity/uniqueAttribute/type/hive_db?attr:qualifiedName=default@primary
HTTP/1.1" 200 17865 "-" "Java/1.8.0_172"
127.0.0.1 - - [08/Sep/2018:10:08:54 +0000] "GET //localhost:31000/api/atlas/v2/entity/uniqueAttribute/type/hive_db?attr:qualifiedName=default@primary
HTTP/1.1" 200 17865 "-" "Java/1.8.0_172"
127.0.0.1 - - [08/Sep/2018:10:08:54 +0000] "GET //localhost:31000/api/atlas/v2/entity/guid/9816f56c-b135-43f2-85b1-083d080ebe53
HTTP/1.1" 200 17865 "-" "Java/1.8.0_172"
127.0.0.1 - - [08/Sep/2018:10:08:54 +0000] "GET //localhost:31000/api/atlas/v2/entity/uniqueAttribute/type/hive_table?attr:qualifiedName=default.table1zry8kpvbe@primary
HTTP/1.1" 404 154 "-" "Java/1.8.0_172"
127.0.0.1 - - [08/Sep/2018:10:08:54 +0000] "POST //localhost:31000/api/atlas/v2/entity/ HTTP/1.1"
200 859 "-" "Java/1.8.0_172"
127.0.0.1 - - [08/Sep/2018:10:08:55 +0000] "GET //localhost:31000/api/atlas/v2/entity/guid/af55c463-44ab-4f7d-8e7c-11a157f03fc0
HTTP/1.1" 200 3963 "-" "Java/1.8.0_172"
127.0.0.1 - - [08/Sep/2018:10:08:55 +0000] "GET //localhost:31000/api/atlas/v2/entity/uniqueAttribute/type/hive_process?attr:qualifiedName=default.table1zry8kpvbe@primary:1536401334000
HTTP/1.1" 404 170 "-" "Java/1.8.0_172"
127.0.0.1 - - [08/Sep/2018:10:08:55 +0000] "POST //localhost:31000/api/atlas/v2/entity/bulk/
HTTP/1.1" 200 753 "-" "Java/1.8.0_172"
127.0.0.1 - - [08/Sep/2018:10:08:56 +0000] "GET //localhost:31000/api/atlas/v2/entity/guid/f6f8f36d-d522-4d13-96e1-dc53dd474346
HTTP/1.1" 200 2188 "-" "Java/1.8.0_172"
127.0.0.1 - - [08/Sep/2018:10:08:56 +0000] "GET //localhost:31000/api/atlas/v2/entity/guid/a3f0de8a-3a54-41f8-b60c-b0882273ef5f
HTTP/1.1" 200 1417 "-" "Java/1.8.0_172"
127.0.0.1 - - [08/Sep/2018:10:08:56 +0000] "GET //localhost:31000/api/atlas/v2/entity/uniqueAttribute/type/hive_table?attr:qualifiedName=default.table1zry8kpvbe@primary
HTTP/1.1" 200 4412 "-" "Java/1.8.0_172"
127.0.0.1 - - [08/Sep/2018:10:08:56 +0000] "GET //localhost:31000/api/atlas/v2/entity/uniqueAttribute/type/hive_table?attr:qualifiedName=default.table1zry8kpvbe@primary
HTTP/1.1" 200 4412 "-" "Java/1.8.0_172"
127.0.0.1 - - [08/Sep/2018:10:08:56 +0000] "GET //localhost:31000/api/atlas/v2/entity/uniqueAttribute/type/hive_process?attr:qualifiedName=default.table1zry8kpvbe@primary:1536401334000
HTTP/1.1" 200 2188 "-" "Java/1.8.0_172"
127.0.0.1 - - [08/Sep/2018:10:08:56 +0000] "GET //localhost:31000/api/atlas/v2/entity/uniqueAttribute/type/hive_process?attr:qualifiedName=default.table1zry8kpvbe@primary:1536401334000
HTTP/1.1" 200 2188 "-" "Java/1.8.0_172"
127.0.0.1 - - [08/Sep/2018:10:08:56 +0000] "GET //localhost:31000/api/atlas/v2/entity/guid/f6f8f36d-d522-4d13-96e1-dc53dd474346
HTTP/1.1" 200 2188 "-" "Java/1.8.0_172"
Tests run: 45, Failures: 1, Errors: 0, Skipped: 0, Time elapsed: 474.393 sec <<<
FAILURE! - in TestSuite
testDropDatabaseWithoutCascade(org.apache.atlas.hive.hook.HiveHookIT)  Time elapsed: 7.601
sec  <<< FAILURE!
java.lang.AssertionError: Entity was not supposed to exist for typeName = hive_db, attributeName
= qualifiedName, attributeValue = db0bir3zlxvg@primary
	at org.testng.Assert.fail(Assert.java:94)
	at org.apache.atlas.hive.hook.HiveHookIT.testDropDatabaseWithoutCascade(HiveHookIT.java:1621)


Results :

Failed tests: 
  HiveHookIT.testDropDatabaseWithoutCascade:1621 Entity was not supposed to exist for typeName
= hive_db, attributeName = qualifiedName, attributeValue = db0bir3zlxvg@primary

Tests run: 45, Failures: 1, Errors: 0, Skipped: 0

[INFO] 
[INFO] --- jetty-maven-plugin:9.3.14.v20161028:stop (stop-jetty) @ hive-bridge ---
[INFO] Waiting 10 seconds for jetty to stop
[INFO] Stopped ServerConnector@652875e3{HTTP/1.1,[http/1.1]}{0.0.0.0:31000}
[INFO] Closing Spring root WebApplicationContext
[INFO] Shutting down log4j
[INFO] Stopped o.e.j.m.p.JettyWebAppContext@562d4156{/,file://<https://builds.apache.org/job/Atlas-1.0-IntegrationTests/ws/webapp/target/atlas-webapp-1.1.0-SNAPSHOT/,UNAVAILABLE}{/home/jenkins/jenkins-slave/workspace/Atlas-1.0-IntegrationTests/webapp/target/atlas-webapp-1.1.0-SNAPSHOT.war}>
[INFO] Server reports itself as stopped
[INFO] 
[INFO] --- maven-source-plugin:2.4:jar-no-fork (attach-sources) @ hive-bridge ---
[INFO] Building jar: <https://builds.apache.org/job/Atlas-1.0-IntegrationTests/ws/addons/hive-bridge/target/hive-bridge-1.1.0-SNAPSHOT-sources.jar>
[INFO] 
[INFO] --- maven-source-plugin:2.4:test-jar-no-fork (attach-sources) @ hive-bridge ---
[INFO] Building jar: <https://builds.apache.org/job/Atlas-1.0-IntegrationTests/ws/addons/hive-bridge/target/hive-bridge-1.1.0-SNAPSHOT-test-sources.jar>
log4j:WARN No appenders could be found for logger (org.apache.zookeeper.ClientCnxn).
log4j:WARN Please initialize the log4j system properly.
log4j:WARN See http://logging.apache.org/log4j/1.2/faq.html#noconfig for more info.
[INFO] 
[INFO] --- maven-failsafe-plugin:2.18.1:verify (verify) @ hive-bridge ---
[INFO] Failsafe report directory: <https://builds.apache.org/job/Atlas-1.0-IntegrationTests/ws/addons/hive-bridge/target/failsafe-reports>
[INFO] ------------------------------------------------------------------------
[INFO] Reactor Summary:
[INFO] 
[INFO] Apache Atlas Server Build Tools 1.0 ................ SUCCESS [  0.659 s]
[INFO] apache-atlas 1.1.0-SNAPSHOT ........................ SUCCESS [  4.118 s]
[INFO] Apache Atlas Test Utility Tools .................... SUCCESS [ 11.051 s]
[INFO] Apache Atlas Integration ........................... SUCCESS [ 23.443 s]
[INFO] Apache Atlas Common ................................ SUCCESS [  8.923 s]
[INFO] Apache Atlas Client ................................ SUCCESS [  0.548 s]
[INFO] atlas-client-common ................................ SUCCESS [  7.600 s]
[INFO] atlas-client-v1 .................................... SUCCESS [  7.599 s]
[INFO] Apache Atlas Server API ............................ SUCCESS [  6.369 s]
[INFO] Apache Atlas Notification .......................... SUCCESS [ 10.111 s]
[INFO] atlas-client-v2 .................................... SUCCESS [  6.202 s]
[INFO] Apache Atlas Graph Database Projects ............... SUCCESS [  0.466 s]
[INFO] Apache Atlas Graph Database API .................... SUCCESS [  5.159 s]
[INFO] Graph Database Common Code ......................... SUCCESS [  5.486 s]
[INFO] Apache Atlas JanusGraph DB Impl .................... SUCCESS [ 16.220 s]
[INFO] Apache Atlas Graph Database Implementation Dependencies SUCCESS [  2.604 s]
[INFO] Shaded version of Apache hbase client .............. SUCCESS [  8.818 s]
[INFO] Shaded version of Apache hbase server .............. SUCCESS [ 23.880 s]
[INFO] Apache Atlas Authorization ......................... SUCCESS [  8.044 s]
[INFO] Apache Atlas Repository ............................ SUCCESS [ 37.132 s]
[INFO] Apache Atlas UI .................................... SUCCESS [01:50 min]
[INFO] Apache Atlas Web Application ....................... SUCCESS [08:54 min]
[INFO] Apache Atlas Documentation ......................... SUCCESS [  4.543 s]
[INFO] Apache Atlas FileSystem Model ...................... SUCCESS [  2.923 s]
[INFO] Apache Atlas Plugin Classloader .................... SUCCESS [  6.150 s]
[INFO] Apache Atlas Hive Bridge Shim ...................... SUCCESS [  4.928 s]
[INFO] Apache Atlas Hive Bridge ........................... FAILURE [09:11 min]
[INFO] Apache Atlas Falcon Bridge Shim .................... SKIPPED
[INFO] Apache Atlas Falcon Bridge ......................... SKIPPED
[INFO] Apache Atlas Sqoop Bridge Shim ..................... SKIPPED
[INFO] Apache Atlas Sqoop Bridge .......................... SKIPPED
[INFO] Apache Atlas Storm Bridge Shim ..................... SKIPPED
[INFO] Apache Atlas Storm Bridge .......................... SKIPPED
[INFO] Apache Atlas Hbase Bridge Shim ..................... SKIPPED
[INFO] Apache Atlas Hbase Bridge .......................... SKIPPED
[INFO] Apache Atlas Kafka Bridge .......................... SKIPPED
[INFO] Apache Atlas Distribution 1.1.0-SNAPSHOT ........... SKIPPED
[INFO] ------------------------------------------------------------------------
[INFO] BUILD FAILURE
[INFO] ------------------------------------------------------------------------
[INFO] Total time: 23:31 min
[INFO] Finished at: 2018-09-08T10:09:03Z
[INFO] ------------------------------------------------------------------------
[ERROR] Failed to execute goal org.apache.maven.plugins:maven-failsafe-plugin:2.18.1:verify
(verify) on project hive-bridge: There are test failures.
[ERROR] 
[ERROR] Please refer to <https://builds.apache.org/job/Atlas-1.0-IntegrationTests/ws/addons/hive-bridge/target/failsafe-reports>
for the individual test results.
[ERROR] -> [Help 1]
[ERROR] 
[ERROR] To see the full stack trace of the errors, re-run Maven with the -e switch.
[ERROR] Re-run Maven using the -X switch to enable full debug logging.
[ERROR] 
[ERROR] For more information about the errors and possible solutions, please read the following
articles:
[ERROR] [Help 1] http://cwiki.apache.org/confluence/display/MAVEN/MojoFailureException
[ERROR] 
[ERROR] After correcting the problems, you can resume the build with the command
[ERROR]   mvn <goals> -rf :hive-bridge
Build step 'Execute shell' marked build as failure
[CHECKSTYLE] Collecting checkstyle analysis files...
[CHECKSTYLE] Searching for all files in <https://builds.apache.org/job/Atlas-1.0-IntegrationTests/ws/>
that match the pattern **/target/checkstyle-result.xml
[CHECKSTYLE] Parsing 25 files in <https://builds.apache.org/job/Atlas-1.0-IntegrationTests/ws/>
[CHECKSTYLE] Successfully parsed file <https://builds.apache.org/job/Atlas-1.0-IntegrationTests/ws/addons/hdfs-model/target/checkstyle-result.xml>
with 0 unique warnings and 0 duplicates.
[CHECKSTYLE] Successfully parsed file <https://builds.apache.org/job/Atlas-1.0-IntegrationTests/ws/addons/hive-bridge-shim/target/checkstyle-result.xml>
with 15 unique warnings and 0 duplicates.
[CHECKSTYLE] Successfully parsed file <https://builds.apache.org/job/Atlas-1.0-IntegrationTests/ws/authorization/target/checkstyle-result.xml>
with 988 unique warnings and 0 duplicates.
[CHECKSTYLE] Successfully parsed file <https://builds.apache.org/job/Atlas-1.0-IntegrationTests/ws/client/client-v1/target/checkstyle-result.xml>
with 1887 unique warnings and 0 duplicates.
[CHECKSTYLE] Successfully parsed file <https://builds.apache.org/job/Atlas-1.0-IntegrationTests/ws/client/client-v2/target/checkstyle-result.xml>
with 2246 unique warnings and 0 duplicates.
[CHECKSTYLE] Successfully parsed file <https://builds.apache.org/job/Atlas-1.0-IntegrationTests/ws/client/common/target/checkstyle-result.xml>
with 2738 unique warnings and 0 duplicates.
[CHECKSTYLE] Successfully parsed file <https://builds.apache.org/job/Atlas-1.0-IntegrationTests/ws/client/target/checkstyle-result.xml>
with 2738 unique warnings and 0 duplicates.
[CHECKSTYLE] Successfully parsed file <https://builds.apache.org/job/Atlas-1.0-IntegrationTests/ws/common/target/checkstyle-result.xml>
with 3815 unique warnings and 0 duplicates.
[CHECKSTYLE] Successfully parsed file <https://builds.apache.org/job/Atlas-1.0-IntegrationTests/ws/dashboardv2/target/checkstyle-result.xml>
with 3815 unique warnings and 0 duplicates.
[CHECKSTYLE] Successfully parsed file <https://builds.apache.org/job/Atlas-1.0-IntegrationTests/ws/docs/target/checkstyle-result.xml>
with 3815 unique warnings and 0 duplicates.
[CHECKSTYLE] Successfully parsed file <https://builds.apache.org/job/Atlas-1.0-IntegrationTests/ws/graphdb/api/target/checkstyle-result.xml>
with 4117 unique warnings and 0 duplicates.
[CHECKSTYLE] Successfully parsed file <https://builds.apache.org/job/Atlas-1.0-IntegrationTests/ws/graphdb/common/target/checkstyle-result.xml>
with 4343 unique warnings and 0 duplicates.
[CHECKSTYLE] Successfully parsed file <https://builds.apache.org/job/Atlas-1.0-IntegrationTests/ws/graphdb/graphdb-impls/target/checkstyle-result.xml>
with 4343 unique warnings and 0 duplicates.
[CHECKSTYLE] Successfully parsed file <https://builds.apache.org/job/Atlas-1.0-IntegrationTests/ws/graphdb/janus/target/checkstyle-result.xml>
with 6669 unique warnings and 0 duplicates.
[CHECKSTYLE] Successfully parsed file <https://builds.apache.org/job/Atlas-1.0-IntegrationTests/ws/graphdb/target/checkstyle-result.xml>
with 6669 unique warnings and 0 duplicates.
[CHECKSTYLE] Successfully parsed file <https://builds.apache.org/job/Atlas-1.0-IntegrationTests/ws/intg/target/checkstyle-result.xml>
with 18785 unique warnings and 0 duplicates.
[CHECKSTYLE] Successfully parsed file <https://builds.apache.org/job/Atlas-1.0-IntegrationTests/ws/notification/target/checkstyle-result.xml>
with 20059 unique warnings and 0 duplicates.
[CHECKSTYLE] Successfully parsed file <https://builds.apache.org/job/Atlas-1.0-IntegrationTests/ws/plugin-classloader/target/checkstyle-result.xml>
with 20172 unique warnings and 0 duplicates.
[CHECKSTYLE] Successfully parsed file <https://builds.apache.org/job/Atlas-1.0-IntegrationTests/ws/repository/target/checkstyle-result.xml>
with 39339 unique warnings and 0 duplicates.
[CHECKSTYLE] Successfully parsed file <https://builds.apache.org/job/Atlas-1.0-IntegrationTests/ws/server-api/target/checkstyle-result.xml>
with 39534 unique warnings and 0 duplicates.
[CHECKSTYLE] Successfully parsed file <https://builds.apache.org/job/Atlas-1.0-IntegrationTests/ws/shaded/hbase-client-shaded/target/checkstyle-result.xml>
with 39534 unique warnings and 0 duplicates.
[CHECKSTYLE] Successfully parsed file <https://builds.apache.org/job/Atlas-1.0-IntegrationTests/ws/shaded/hbase-server-shaded/target/checkstyle-result.xml>
with 39534 unique warnings and 0 duplicates.
[CHECKSTYLE] Successfully parsed file <https://builds.apache.org/job/Atlas-1.0-IntegrationTests/ws/target/checkstyle-result.xml>
with 39534 unique warnings and 0 duplicates.
[CHECKSTYLE] Successfully parsed file <https://builds.apache.org/job/Atlas-1.0-IntegrationTests/ws/test-tools/target/checkstyle-result.xml>
with 39572 unique warnings and 0 duplicates.
[CHECKSTYLE] Successfully parsed file <https://builds.apache.org/job/Atlas-1.0-IntegrationTests/ws/webapp/target/checkstyle-result.xml>
with 47988 unique warnings and 0 duplicates.
<Git Blamer> Using GitBlamer to create author and commit information for all warnings.
<Git Blamer> GIT_COMMIT=9e76ed2eb80ec5aea45099a5d388734f66586351, workspace=<https://builds.apache.org/job/Atlas-1.0-IntegrationTests/ws/>
 > git rev-parse 9e76ed2eb80ec5aea45099a5d388734f66586351^{commit} # timeout=10
[CHECKSTYLE] Computing warning deltas based on reference build #978
[FINDBUGS] Collecting findbugs analysis files...
[FINDBUGS] Searching for all files in <https://builds.apache.org/job/Atlas-1.0-IntegrationTests/ws/>
that match the pattern **/target/findbugs.xml
[FINDBUGS] Parsing 16 files in <https://builds.apache.org/job/Atlas-1.0-IntegrationTests/ws/>
[FINDBUGS] Successfully parsed file <https://builds.apache.org/job/Atlas-1.0-IntegrationTests/ws/addons/hive-bridge-shim/target/findbugs.xml>
with 0 unique warnings and 0 duplicates.
[FINDBUGS] Successfully parsed file <https://builds.apache.org/job/Atlas-1.0-IntegrationTests/ws/authorization/target/findbugs.xml>
with 0 unique warnings and 0 duplicates.
[FINDBUGS] Successfully parsed file <https://builds.apache.org/job/Atlas-1.0-IntegrationTests/ws/client/client-v1/target/findbugs.xml>
with 0 unique warnings and 0 duplicates.
[FINDBUGS] Successfully parsed file <https://builds.apache.org/job/Atlas-1.0-IntegrationTests/ws/client/client-v2/target/findbugs.xml>
with 0 unique warnings and 0 duplicates.
[FINDBUGS] Successfully parsed file <https://builds.apache.org/job/Atlas-1.0-IntegrationTests/ws/client/common/target/findbugs.xml>
with 0 unique warnings and 0 duplicates.
[FINDBUGS] Successfully parsed file <https://builds.apache.org/job/Atlas-1.0-IntegrationTests/ws/common/target/findbugs.xml>
with 0 unique warnings and 0 duplicates.
[FINDBUGS] Successfully parsed file <https://builds.apache.org/job/Atlas-1.0-IntegrationTests/ws/graphdb/api/target/findbugs.xml>
with 0 unique warnings and 0 duplicates.
[FINDBUGS] Successfully parsed file <https://builds.apache.org/job/Atlas-1.0-IntegrationTests/ws/graphdb/common/target/findbugs.xml>
with 0 unique warnings and 0 duplicates.
[FINDBUGS] Successfully parsed file <https://builds.apache.org/job/Atlas-1.0-IntegrationTests/ws/graphdb/janus/target/findbugs.xml>
with 0 unique warnings and 0 duplicates.
[FINDBUGS] Successfully parsed file <https://builds.apache.org/job/Atlas-1.0-IntegrationTests/ws/intg/target/findbugs.xml>
with 0 unique warnings and 0 duplicates.
[FINDBUGS] Successfully parsed file <https://builds.apache.org/job/Atlas-1.0-IntegrationTests/ws/notification/target/findbugs.xml>
with 0 unique warnings and 0 duplicates.
[FINDBUGS] Successfully parsed file <https://builds.apache.org/job/Atlas-1.0-IntegrationTests/ws/plugin-classloader/target/findbugs.xml>
with 0 unique warnings and 0 duplicates.
[FINDBUGS] Successfully parsed file <https://builds.apache.org/job/Atlas-1.0-IntegrationTests/ws/repository/target/findbugs.xml>
with 0 unique warnings and 0 duplicates.
[FINDBUGS] Successfully parsed file <https://builds.apache.org/job/Atlas-1.0-IntegrationTests/ws/server-api/target/findbugs.xml>
with 0 unique warnings and 0 duplicates.
[FINDBUGS] Successfully parsed file <https://builds.apache.org/job/Atlas-1.0-IntegrationTests/ws/test-tools/target/findbugs.xml>
with 0 unique warnings and 0 duplicates.
[FINDBUGS] Successfully parsed file <https://builds.apache.org/job/Atlas-1.0-IntegrationTests/ws/webapp/target/findbugs.xml>
with 0 unique warnings and 0 duplicates.
<Git Blamer> Using GitBlamer to create author and commit information for all warnings.
<Git Blamer> GIT_COMMIT=9e76ed2eb80ec5aea45099a5d388734f66586351, workspace=<https://builds.apache.org/job/Atlas-1.0-IntegrationTests/ws/>
[FINDBUGS] Computing warning deltas based on reference build #978
Archiving artifacts
[Fast Archiver] Compressed 169.08 MB of artifacts by 83.8% relative to #978
TestNG Reports Processing: START
Looking for TestNG results report in workspace using pattern: **/target/surefire-reports/testng-results.xml,**/target/failsafe-reports/testng-results.xml
Saving reports...
Processing '/x1/jenkins/jenkins-home/jobs/Atlas-1.0-IntegrationTests/builds/979/testng/testng-results-1.xml'
Processing '/x1/jenkins/jenkins-home/jobs/Atlas-1.0-IntegrationTests/builds/979/testng/testng-results.xml'
0.609756% of tests failed, which exceeded threshold of 0%. Marking build as UNSTABLE
TestNG Reports Processing: FINISH

Mime
View raw message