atlas-dev mailing list archives

Site index · List index
Message view « Date » · « Thread »
Top « Date » · « Thread »
From Apache Jenkins Server <jenk...@builds.apache.org>
Subject Build failed in Jenkins: Atlas-1.0-AllTests #1099
Date Sun, 23 Sep 2018 07:04:04 GMT
See <https://builds.apache.org/job/Atlas-1.0-AllTests/1099/display/redirect>

------------------------------------------
[...truncated 308.24 KB...]
[INFO] Exclude: **/public/css/bootstrap-sidebar.css
[INFO] Exclude: **/public/js/external_lib/**
[INFO] Exclude: **/node_modules/**
[INFO] Exclude: **/public/js/libs/**
[INFO] Exclude: **/atlas.data/**
[INFO] Exclude: **/${sys:atlas.data}/**
[INFO] Exclude: **/policy-store.txt
[INFO] Exclude: **/*rebel*.xml
[INFO] Exclude: **/*rebel*.xml.bak
[INFO] Exclude: **/test/resources/**
[INFO] 125 resources included (use -debug for more details)
[INFO] Rat check: Summary over all files. Unapproved: 0, unknown: 0, generated: 0, approved:
125 licenses.
[INFO] 
[INFO] --- maven-resources-plugin:2.7:copy-resources (copy-resources) @ atlas-webapp ---
[INFO] Using 'UTF-8' encoding to copy filtered resources.
[INFO] Copying 15 resources
[INFO] 
[INFO] --- maven-resources-plugin:2.7:copy-resources (copy-solr-resources) @ atlas-webapp
---
[INFO] Using 'UTF-8' encoding to copy filtered resources.
[INFO] Copying 9 resources
[INFO] 
[INFO] --- maven-remote-resources-plugin:1.5:process (default) @ atlas-webapp ---
[INFO] 
[INFO] --- keytool-maven-plugin:1.5:clean (clean) @ atlas-webapp ---
[WARNING] Keystore file '<https://builds.apache.org/job/Atlas-1.0-AllTests/ws/webapp/target/atlas.keystore'>
doesn't exist.
[INFO] 
[INFO] --- keytool-maven-plugin:1.5:generateKeyPair (generateKeyPair) @ atlas-webapp ---
[WARNING] 
[WARNING] Warning:
[WARNING] The JKS keystore uses a proprietary format. It is recommended to migrate to PKCS12
which is an industry standard format using "keytool -importkeystore -srckeystore <https://builds.apache.org/job/Atlas-1.0-AllTests/ws/webapp/target/atlas.keystore>
-destkeystore <https://builds.apache.org/job/Atlas-1.0-AllTests/ws/webapp/target/atlas.keystore>
-deststoretype pkcs12".
[INFO] 
[INFO] --- maven-resources-plugin:2.7:resources (default-resources) @ atlas-webapp ---
[INFO] Using 'UTF-8' encoding to copy filtered resources.
[INFO] Copying 2 resources
[INFO] Copying 2 resources to META-INF
[INFO] Copying 3 resources
[INFO] 
[INFO] --- maven-compiler-plugin:3.7.0:compile (default-compile) @ atlas-webapp ---
[INFO] Changes detected - recompiling the module!
[INFO] Compiling 69 source files to <https://builds.apache.org/job/Atlas-1.0-AllTests/ws/webapp/target/classes>
[INFO] <https://builds.apache.org/job/Atlas-1.0-AllTests/ws/webapp/src/main/java/org/apache/atlas/examples/QuickStartV2.java>:
Some input files use or override a deprecated API.
[INFO] <https://builds.apache.org/job/Atlas-1.0-AllTests/ws/webapp/src/main/java/org/apache/atlas/examples/QuickStartV2.java>:
Recompile with -Xlint:deprecation for details.
[INFO] <https://builds.apache.org/job/Atlas-1.0-AllTests/ws/webapp/src/main/java/org/apache/atlas/web/security/AtlasAuthenticationSuccessHandler.java>:
Some input files use unchecked or unsafe operations.
[INFO] <https://builds.apache.org/job/Atlas-1.0-AllTests/ws/webapp/src/main/java/org/apache/atlas/web/security/AtlasAuthenticationSuccessHandler.java>:
Recompile with -Xlint:unchecked for details.
[INFO] 
[INFO] --- maven-resources-plugin:2.7:testResources (default-testResources) @ atlas-webapp
---
[INFO] Using 'UTF-8' encoding to copy filtered resources.
[INFO] Copying 9 resources
[INFO] Copying 3 resources
[INFO] 
[INFO] --- maven-compiler-plugin:3.7.0:testCompile (default-testCompile) @ atlas-webapp ---
[INFO] Changes detected - recompiling the module!
[INFO] Compiling 48 source files to <https://builds.apache.org/job/Atlas-1.0-AllTests/ws/webapp/target/test-classes>
[INFO] <https://builds.apache.org/job/Atlas-1.0-AllTests/ws/webapp/src/test/java/org/apache/atlas/web/util/ServletsTest.java>:
Some input files use or override a deprecated API.
[INFO] <https://builds.apache.org/job/Atlas-1.0-AllTests/ws/webapp/src/test/java/org/apache/atlas/web/util/ServletsTest.java>:
Recompile with -Xlint:deprecation for details.
[INFO] <https://builds.apache.org/job/Atlas-1.0-AllTests/ws/webapp/src/test/java/org/apache/atlas/examples/QuickStartIT.java>:
Some input files use unchecked or unsafe operations.
[INFO] <https://builds.apache.org/job/Atlas-1.0-AllTests/ws/webapp/src/test/java/org/apache/atlas/examples/QuickStartIT.java>:
Recompile with -Xlint:unchecked for details.
[INFO] 
[INFO] --- maven-surefire-plugin:2.18.1:test (default-test) @ atlas-webapp ---
[INFO] Tests are skipped.
[INFO] 
[INFO] --- maven-surefire-plugin:2.18.1:test (unit-tests) @ atlas-webapp ---
[WARNING] The parameter forkMode is deprecated since version 2.14. Use forkCount and reuseForks
instead.
[INFO] Surefire report directory: <https://builds.apache.org/job/Atlas-1.0-AllTests/ws/webapp/target/surefire-reports>
[INFO] Using configured provider org.apache.maven.surefire.testng.TestNGProvider

-------------------------------------------------------
 T E S T S
-------------------------------------------------------
Running org.apache.atlas.notification.NotificationHookConsumerKafkaTest
Tests run: 5, Failures: 1, Errors: 0, Skipped: 4, Time elapsed: 1.241 sec <<< FAILURE!
- in org.apache.atlas.notification.NotificationHookConsumerKafkaTest
setup(org.apache.atlas.notification.NotificationHookConsumerKafkaTest)  Time elapsed: 1.131
sec  <<< FAILURE!
org.apache.atlas.AtlasException: Failed to start embedded kafka
	at sun.nio.ch.Net.bind0(Native Method)
	at sun.nio.ch.Net.bind(Net.java:433)
	at sun.nio.ch.Net.bind(Net.java:425)
	at sun.nio.ch.ServerSocketChannelImpl.bind(ServerSocketChannelImpl.java:223)
	at sun.nio.ch.ServerSocketAdaptor.bind(ServerSocketAdaptor.java:74)
	at sun.nio.ch.ServerSocketAdaptor.bind(ServerSocketAdaptor.java:67)
	at org.apache.zookeeper.server.NIOServerCnxnFactory.configure(NIOServerCnxnFactory.java:95)
	at org.apache.zookeeper.server.ServerCnxnFactory.createFactory(ServerCnxnFactory.java:126)
	at org.apache.atlas.kafka.EmbeddedKafkaServer.startZk(EmbeddedKafkaServer.java:116)
	at org.apache.atlas.kafka.EmbeddedKafkaServer.start(EmbeddedKafkaServer.java:80)
	at org.apache.atlas.notification.NotificationHookConsumerKafkaTest.initNotificationService(NotificationHookConsumerKafkaTest.java:233)
	at org.apache.atlas.notification.NotificationHookConsumerKafkaTest.setup(NotificationHookConsumerKafkaTest.java:94)

Running org.apache.atlas.notification.NotificationEntityChangeListenerTest
Tests run: 1, Failures: 0, Errors: 0, Skipped: 0, Time elapsed: 0.819 sec - in org.apache.atlas.notification.NotificationEntityChangeListenerTest
Running org.apache.atlas.notification.NotificationHookConsumerTest
Tests run: 12, Failures: 0, Errors: 0, Skipped: 0, Time elapsed: 7.437 sec - in org.apache.atlas.notification.NotificationHookConsumerTest
Running org.apache.atlas.notification.AdaptiveWaiterTest
Tests run: 3, Failures: 0, Errors: 0, Skipped: 0, Time elapsed: 4.165 sec - in org.apache.atlas.notification.AdaptiveWaiterTest
Running org.apache.atlas.util.RestUtilsTest
Tests run: 2, Failures: 0, Errors: 0, Skipped: 0, Time elapsed: 1.676 sec - in org.apache.atlas.util.RestUtilsTest
Running org.apache.atlas.web.filters.AuditFilterTest
Tests run: 6, Failures: 0, Errors: 0, Skipped: 0, Time elapsed: 1.225 sec - in org.apache.atlas.web.filters.AuditFilterTest
Running org.apache.atlas.web.filters.AtlasCSRFPreventionFilterTest
Tests run: 6, Failures: 0, Errors: 0, Skipped: 0, Time elapsed: 1.209 sec - in org.apache.atlas.web.filters.AtlasCSRFPreventionFilterTest
Running org.apache.atlas.web.service.CuratorFactoryTest
Tests run: 3, Failures: 0, Errors: 0, Skipped: 0, Time elapsed: 1.232 sec - in org.apache.atlas.web.service.CuratorFactoryTest
Running org.apache.atlas.web.service.AtlasZookeeperSecurityPropertiesTest
Tests run: 6, Failures: 0, Errors: 0, Skipped: 0, Time elapsed: 0.379 sec - in org.apache.atlas.web.service.AtlasZookeeperSecurityPropertiesTest
Running org.apache.atlas.web.service.ActiveInstanceStateTest
Tests run: 5, Failures: 0, Errors: 0, Skipped: 0, Time elapsed: 0.994 sec - in org.apache.atlas.web.service.ActiveInstanceStateTest
Running org.apache.atlas.web.service.ServiceStateTest
Tests run: 3, Failures: 0, Errors: 0, Skipped: 0, Time elapsed: 0.88 sec - in org.apache.atlas.web.service.ServiceStateTest
Running org.apache.atlas.web.service.ActiveInstanceElectorServiceTest
Tests run: 14, Failures: 0, Errors: 0, Skipped: 0, Time elapsed: 1.122 sec - in org.apache.atlas.web.service.ActiveInstanceElectorServiceTest
Running org.apache.atlas.web.util.ServletsTest
Tests run: 1, Failures: 0, Errors: 0, Skipped: 0, Time elapsed: 1.207 sec - in org.apache.atlas.web.util.ServletsTest
Running org.apache.atlas.web.setup.SetupStepsTest
Tests run: 6, Failures: 0, Errors: 0, Skipped: 0, Time elapsed: 1.15 sec - in org.apache.atlas.web.setup.SetupStepsTest
Running org.apache.atlas.web.security.FileAuthenticationTest
Tests run: 6, Failures: 0, Errors: 0, Skipped: 0, Time elapsed: 2.467 sec - in org.apache.atlas.web.security.FileAuthenticationTest
Running org.apache.atlas.web.security.UserDaoTest
Tests run: 2, Failures: 0, Errors: 0, Skipped: 0, Time elapsed: 0.635 sec - in org.apache.atlas.web.security.UserDaoTest
Running org.apache.atlas.web.resources.AdminExportTest
Tests run: 0, Failures: 0, Errors: 0, Skipped: 0, Time elapsed: 0.274 sec - in org.apache.atlas.web.resources.AdminExportTest
Running org.apache.atlas.web.resources.AdminResourceTest
Tests run: 2, Failures: 0, Errors: 0, Skipped: 0, Time elapsed: 1.676 sec - in org.apache.atlas.web.resources.AdminResourceTest
Running org.apache.atlas.web.resources.EntityResourceTest
Tests run: 1, Failures: 0, Errors: 0, Skipped: 0, Time elapsed: 0.676 sec - in org.apache.atlas.web.resources.EntityResourceTest

Results :

Failed tests: 
  NotificationHookConsumerKafkaTest.setup:94->initNotificationService:233 » Atlas

Tests run: 84, Failures: 1, Errors: 0, Skipped: 4

[INFO] ------------------------------------------------------------------------
[INFO] Reactor Summary:
[INFO] 
[INFO] Apache Atlas Server Build Tools 1.0 ................ SUCCESS [  0.890 s]
[INFO] apache-atlas 1.2.0-SNAPSHOT ........................ SUCCESS [  4.854 s]
[INFO] Apache Atlas Test Utility Tools .................... SUCCESS [ 11.134 s]
[INFO] Apache Atlas Integration ........................... SUCCESS [01:04 min]
[INFO] Apache Atlas Common ................................ SUCCESS [ 10.857 s]
[INFO] Apache Atlas Client ................................ SUCCESS [  0.592 s]
[INFO] atlas-client-common ................................ SUCCESS [  7.091 s]
[INFO] atlas-client-v1 .................................... SUCCESS [  9.579 s]
[INFO] Apache Atlas Server API ............................ SUCCESS [  6.228 s]
[INFO] Apache Atlas Notification .......................... SUCCESS [ 27.894 s]
[INFO] atlas-client-v2 .................................... SUCCESS [  5.974 s]
[INFO] Apache Atlas Graph Database Projects ............... SUCCESS [  0.477 s]
[INFO] Apache Atlas Graph Database API .................... SUCCESS [  5.380 s]
[INFO] Graph Database Common Code ......................... SUCCESS [  5.519 s]
[INFO] Apache Atlas JanusGraph DB Impl .................... SUCCESS [02:46 min]
[INFO] Apache Atlas Graph Database Implementation Dependencies SUCCESS [  2.445 s]
[INFO] Shaded version of Apache hbase client .............. SUCCESS [  8.606 s]
[INFO] Shaded version of Apache hbase server .............. SUCCESS [ 21.592 s]
[INFO] Apache Atlas Authorization ......................... SUCCESS [  9.565 s]
[INFO] Apache Atlas Repository ............................ SUCCESS [07:33 min]
[INFO] Apache Atlas UI .................................... SUCCESS [02:02 min]
[INFO] Apache Atlas Web Application ....................... FAILURE [ 47.152 s]
[INFO] Apache Atlas Documentation ......................... SKIPPED
[INFO] Apache Atlas FileSystem Model ...................... SKIPPED
[INFO] Apache Atlas Plugin Classloader .................... SKIPPED
[INFO] Apache Atlas Hive Bridge Shim ...................... SKIPPED
[INFO] Apache Atlas Hive Bridge ........................... SKIPPED
[INFO] Apache Atlas Falcon Bridge Shim .................... SKIPPED
[INFO] Apache Atlas Falcon Bridge ......................... SKIPPED
[INFO] Apache Atlas Sqoop Bridge Shim ..................... SKIPPED
[INFO] Apache Atlas Sqoop Bridge .......................... SKIPPED
[INFO] Apache Atlas Storm Bridge Shim ..................... SKIPPED
[INFO] Apache Atlas Storm Bridge .......................... SKIPPED
[INFO] Apache Atlas Hbase Bridge Shim ..................... SKIPPED
[INFO] Apache Atlas Hbase Bridge .......................... SKIPPED
[INFO] Apache Atlas Kafka Bridge .......................... SKIPPED
[INFO] Apache Atlas Distribution 1.2.0-SNAPSHOT ........... SKIPPED
[INFO] ------------------------------------------------------------------------
[INFO] BUILD FAILURE
[INFO] ------------------------------------------------------------------------
[INFO] Total time: 16:34 min
[INFO] Finished at: 2018-09-23T06:56:44Z
[INFO] ------------------------------------------------------------------------
[ERROR] Failed to execute goal org.apache.maven.plugins:maven-surefire-plugin:2.18.1:test
(unit-tests) on project atlas-webapp: There are test failures.
[ERROR] 
[ERROR] Please refer to <https://builds.apache.org/job/Atlas-1.0-AllTests/ws/webapp/target/surefire-reports>
for the individual test results.
[ERROR] -> [Help 1]
[ERROR] 
[ERROR] To see the full stack trace of the errors, re-run Maven with the -e switch.
[ERROR] Re-run Maven using the -X switch to enable full debug logging.
[ERROR] 
[ERROR] For more information about the errors and possible solutions, please read the following
articles:
[ERROR] [Help 1] http://cwiki.apache.org/confluence/display/MAVEN/MojoFailureException
[ERROR] 
[ERROR] After correcting the problems, you can resume the build with the command
[ERROR]   mvn <goals> -rf :atlas-webapp
Build step 'Execute shell' marked build as failure
[CHECKSTYLE] Collecting checkstyle analysis files...
[CHECKSTYLE] Searching for all files in <https://builds.apache.org/job/Atlas-1.0-AllTests/ws/>
that match the pattern **/target/checkstyle-result.xml
[CHECKSTYLE] Parsing 20 files in <https://builds.apache.org/job/Atlas-1.0-AllTests/ws/>
[CHECKSTYLE] Successfully parsed file <https://builds.apache.org/job/Atlas-1.0-AllTests/ws/authorization/target/checkstyle-result.xml>
with 973 unique warnings and 0 duplicates.
[CHECKSTYLE] Successfully parsed file <https://builds.apache.org/job/Atlas-1.0-AllTests/ws/client/client-v1/target/checkstyle-result.xml>
with 1872 unique warnings and 0 duplicates.
[CHECKSTYLE] Successfully parsed file <https://builds.apache.org/job/Atlas-1.0-AllTests/ws/client/client-v2/target/checkstyle-result.xml>
with 2231 unique warnings and 0 duplicates.
[CHECKSTYLE] Successfully parsed file <https://builds.apache.org/job/Atlas-1.0-AllTests/ws/client/common/target/checkstyle-result.xml>
with 2728 unique warnings and 0 duplicates.
[CHECKSTYLE] Successfully parsed file <https://builds.apache.org/job/Atlas-1.0-AllTests/ws/client/target/checkstyle-result.xml>
with 2728 unique warnings and 0 duplicates.
[CHECKSTYLE] Successfully parsed file <https://builds.apache.org/job/Atlas-1.0-AllTests/ws/common/target/checkstyle-result.xml>
with 3805 unique warnings and 0 duplicates.
[CHECKSTYLE] Successfully parsed file <https://builds.apache.org/job/Atlas-1.0-AllTests/ws/dashboardv2/target/checkstyle-result.xml>
with 3805 unique warnings and 0 duplicates.
[CHECKSTYLE] Successfully parsed file <https://builds.apache.org/job/Atlas-1.0-AllTests/ws/graphdb/api/target/checkstyle-result.xml>
with 4107 unique warnings and 0 duplicates.
[CHECKSTYLE] Successfully parsed file <https://builds.apache.org/job/Atlas-1.0-AllTests/ws/graphdb/common/target/checkstyle-result.xml>
with 4333 unique warnings and 0 duplicates.
[CHECKSTYLE] Successfully parsed file <https://builds.apache.org/job/Atlas-1.0-AllTests/ws/graphdb/graphdb-impls/target/checkstyle-result.xml>
with 4333 unique warnings and 0 duplicates.
[CHECKSTYLE] Successfully parsed file <https://builds.apache.org/job/Atlas-1.0-AllTests/ws/graphdb/janus/target/checkstyle-result.xml>
with 6659 unique warnings and 0 duplicates.
[CHECKSTYLE] Successfully parsed file <https://builds.apache.org/job/Atlas-1.0-AllTests/ws/graphdb/target/checkstyle-result.xml>
with 6659 unique warnings and 0 duplicates.
[CHECKSTYLE] Successfully parsed file <https://builds.apache.org/job/Atlas-1.0-AllTests/ws/intg/target/checkstyle-result.xml>
with 18778 unique warnings and 0 duplicates.
[CHECKSTYLE] Successfully parsed file <https://builds.apache.org/job/Atlas-1.0-AllTests/ws/notification/target/checkstyle-result.xml>
with 20052 unique warnings and 0 duplicates.
[CHECKSTYLE] Successfully parsed file <https://builds.apache.org/job/Atlas-1.0-AllTests/ws/repository/target/checkstyle-result.xml>
with 39219 unique warnings and 0 duplicates.
[CHECKSTYLE] Successfully parsed file <https://builds.apache.org/job/Atlas-1.0-AllTests/ws/server-api/target/checkstyle-result.xml>
with 39420 unique warnings and 0 duplicates.
[CHECKSTYLE] Successfully parsed file <https://builds.apache.org/job/Atlas-1.0-AllTests/ws/shaded/hbase-client-shaded/target/checkstyle-result.xml>
with 39420 unique warnings and 0 duplicates.
[CHECKSTYLE] Successfully parsed file <https://builds.apache.org/job/Atlas-1.0-AllTests/ws/shaded/hbase-server-shaded/target/checkstyle-result.xml>
with 39420 unique warnings and 0 duplicates.
[CHECKSTYLE] Successfully parsed file <https://builds.apache.org/job/Atlas-1.0-AllTests/ws/target/checkstyle-result.xml>
with 39420 unique warnings and 0 duplicates.
[CHECKSTYLE] Successfully parsed file <https://builds.apache.org/job/Atlas-1.0-AllTests/ws/test-tools/target/checkstyle-result.xml>
with 39458 unique warnings and 0 duplicates.
<Git Blamer> Using GitBlamer to create author and commit information for all warnings.
<Git Blamer> GIT_COMMIT=52719937ad971b9ae25148a0e57a8ec3e94dc146, workspace=<https://builds.apache.org/job/Atlas-1.0-AllTests/ws/>
 > git rev-parse 52719937ad971b9ae25148a0e57a8ec3e94dc146^{commit} # timeout=10
[CHECKSTYLE] Computing warning deltas based on reference build #1097
[FINDBUGS] Collecting findbugs analysis files...
[FINDBUGS] Searching for all files in <https://builds.apache.org/job/Atlas-1.0-AllTests/ws/>
that match the pattern **/target/findbugs.xml
[FINDBUGS] Parsing 13 files in <https://builds.apache.org/job/Atlas-1.0-AllTests/ws/>
[FINDBUGS] Successfully parsed file <https://builds.apache.org/job/Atlas-1.0-AllTests/ws/authorization/target/findbugs.xml>
with 0 unique warnings and 0 duplicates.
[FINDBUGS] Successfully parsed file <https://builds.apache.org/job/Atlas-1.0-AllTests/ws/client/client-v1/target/findbugs.xml>
with 0 unique warnings and 0 duplicates.
[FINDBUGS] Successfully parsed file <https://builds.apache.org/job/Atlas-1.0-AllTests/ws/client/client-v2/target/findbugs.xml>
with 0 unique warnings and 0 duplicates.
[FINDBUGS] Successfully parsed file <https://builds.apache.org/job/Atlas-1.0-AllTests/ws/client/common/target/findbugs.xml>
with 0 unique warnings and 0 duplicates.
[FINDBUGS] Successfully parsed file <https://builds.apache.org/job/Atlas-1.0-AllTests/ws/common/target/findbugs.xml>
with 0 unique warnings and 0 duplicates.
[FINDBUGS] Successfully parsed file <https://builds.apache.org/job/Atlas-1.0-AllTests/ws/graphdb/api/target/findbugs.xml>
with 0 unique warnings and 0 duplicates.
[FINDBUGS] Successfully parsed file <https://builds.apache.org/job/Atlas-1.0-AllTests/ws/graphdb/common/target/findbugs.xml>
with 0 unique warnings and 0 duplicates.
[FINDBUGS] Successfully parsed file <https://builds.apache.org/job/Atlas-1.0-AllTests/ws/graphdb/janus/target/findbugs.xml>
with 0 unique warnings and 0 duplicates.
[FINDBUGS] Successfully parsed file <https://builds.apache.org/job/Atlas-1.0-AllTests/ws/intg/target/findbugs.xml>
with 0 unique warnings and 0 duplicates.
[FINDBUGS] Successfully parsed file <https://builds.apache.org/job/Atlas-1.0-AllTests/ws/notification/target/findbugs.xml>
with 0 unique warnings and 0 duplicates.
[FINDBUGS] Successfully parsed file <https://builds.apache.org/job/Atlas-1.0-AllTests/ws/repository/target/findbugs.xml>
with 0 unique warnings and 0 duplicates.
[FINDBUGS] Successfully parsed file <https://builds.apache.org/job/Atlas-1.0-AllTests/ws/server-api/target/findbugs.xml>
with 0 unique warnings and 0 duplicates.
[FINDBUGS] Successfully parsed file <https://builds.apache.org/job/Atlas-1.0-AllTests/ws/test-tools/target/findbugs.xml>
with 0 unique warnings and 0 duplicates.
<Git Blamer> Using GitBlamer to create author and commit information for all warnings.
<Git Blamer> GIT_COMMIT=52719937ad971b9ae25148a0e57a8ec3e94dc146, workspace=<https://builds.apache.org/job/Atlas-1.0-AllTests/ws/>
[FINDBUGS] Computing warning deltas based on reference build #1097
Archiving artifacts
TestNG Reports Processing: START
Looking for TestNG results report in workspace using pattern: **/target/surefire-reports/testng-results.xml,**/target/failsafe-reports/testng-results.xml
Saving reports...
Processing '/x1/jenkins/jenkins-home/jobs/Atlas-1.0-AllTests/builds/1099/testng/testng-results-1.xml'
Processing '/x1/jenkins/jenkins-home/jobs/Atlas-1.0-AllTests/builds/1099/testng/testng-results-2.xml'
Processing '/x1/jenkins/jenkins-home/jobs/Atlas-1.0-AllTests/builds/1099/testng/testng-results-3.xml'
Processing '/x1/jenkins/jenkins-home/jobs/Atlas-1.0-AllTests/builds/1099/testng/testng-results-4.xml'
Processing '/x1/jenkins/jenkins-home/jobs/Atlas-1.0-AllTests/builds/1099/testng/testng-results-5.xml'
Processing '/x1/jenkins/jenkins-home/jobs/Atlas-1.0-AllTests/builds/1099/testng/testng-results-6.xml'
Processing '/x1/jenkins/jenkins-home/jobs/Atlas-1.0-AllTests/builds/1099/testng/testng-results-7.xml'
Processing '/x1/jenkins/jenkins-home/jobs/Atlas-1.0-AllTests/builds/1099/testng/testng-results.xml'
TestNG Reports Processing: FINISH

Mime
View raw message