atlas-dev mailing list archives

Site index · List index
Message view « Date » · « Thread »
Top « Date » · « Thread »
From Apache Jenkins Server <jenk...@builds.apache.org>
Subject Build failed in Jenkins: Atlas-master-IntegrationTests #2112
Date Mon, 13 Aug 2018 21:46:14 GMT
See <https://builds.apache.org/job/Atlas-master-IntegrationTests/2112/display/redirect>

------------------------------------------
[...truncated 327.24 KB...]
    at org.eclipse.jetty.server.handler.ContextHandler.callContextInitialized (ContextHandler.java:843)
    at org.eclipse.jetty.servlet.ServletContextHandler.callContextInitialized (ServletContextHandler.java:533)
    at org.eclipse.jetty.server.handler.ContextHandler.startContext (ContextHandler.java:816)
    at org.eclipse.jetty.servlet.ServletContextHandler.startContext (ServletContextHandler.java:345)
    at org.eclipse.jetty.webapp.WebAppContext.startWebapp (WebAppContext.java:1404)
    at org.eclipse.jetty.maven.plugin.JettyWebAppContext.startWebapp (JettyWebAppContext.java:323)
    at org.eclipse.jetty.webapp.WebAppContext.startContext (WebAppContext.java:1366)
    at org.eclipse.jetty.server.handler.ContextHandler.doStart (ContextHandler.java:778)
    at org.eclipse.jetty.servlet.ServletContextHandler.doStart (ServletContextHandler.java:262)
    at org.eclipse.jetty.webapp.WebAppContext.doStart (WebAppContext.java:520)
    at org.eclipse.jetty.maven.plugin.JettyWebAppContext.doStart (JettyWebAppContext.java:398)
    at org.eclipse.jetty.util.component.AbstractLifeCycle.start (AbstractLifeCycle.java:68)
    at org.eclipse.jetty.util.component.ContainerLifeCycle.start (ContainerLifeCycle.java:131)
    at org.eclipse.jetty.util.component.ContainerLifeCycle.doStart (ContainerLifeCycle.java:113)
    at org.eclipse.jetty.server.handler.AbstractHandler.doStart (AbstractHandler.java:61)
    at org.eclipse.jetty.server.handler.ContextHandlerCollection.doStart (ContextHandlerCollection.java:161)
    at org.eclipse.jetty.util.component.AbstractLifeCycle.start (AbstractLifeCycle.java:68)
    at org.eclipse.jetty.util.component.ContainerLifeCycle.start (ContainerLifeCycle.java:131)
    at org.eclipse.jetty.util.component.ContainerLifeCycle.doStart (ContainerLifeCycle.java:113)
    at org.eclipse.jetty.server.handler.AbstractHandler.doStart (AbstractHandler.java:61)
    at org.eclipse.jetty.util.component.AbstractLifeCycle.start (AbstractLifeCycle.java:68)
    at org.eclipse.jetty.util.component.ContainerLifeCycle.start (ContainerLifeCycle.java:131)
    at org.eclipse.jetty.server.Server.start (Server.java:422)
    at org.eclipse.jetty.util.component.ContainerLifeCycle.doStart (ContainerLifeCycle.java:105)
    at org.eclipse.jetty.server.handler.AbstractHandler.doStart (AbstractHandler.java:61)
    at org.eclipse.jetty.server.Server.doStart (Server.java:389)
    at org.eclipse.jetty.util.component.AbstractLifeCycle.start (AbstractLifeCycle.java:68)
    at org.eclipse.jetty.maven.plugin.AbstractJettyMojo.startJetty (AbstractJettyMojo.java:460)
    at org.eclipse.jetty.maven.plugin.AbstractJettyMojo.execute (AbstractJettyMojo.java:328)
    at org.eclipse.jetty.maven.plugin.JettyRunWarMojo.execute (JettyRunWarMojo.java:64)
    at org.eclipse.jetty.maven.plugin.JettyDeployWar.execute (JettyDeployWar.java:65)
    at org.apache.maven.plugin.DefaultBuildPluginManager.executeMojo (DefaultBuildPluginManager.java:137)
    at org.apache.maven.lifecycle.internal.MojoExecutor.execute (MojoExecutor.java:208)
    at org.apache.maven.lifecycle.internal.MojoExecutor.execute (MojoExecutor.java:154)
    at org.apache.maven.lifecycle.internal.MojoExecutor.execute (MojoExecutor.java:146)
    at org.apache.maven.lifecycle.internal.LifecycleModuleBuilder.buildProject (LifecycleModuleBuilder.java:117)
    at org.apache.maven.lifecycle.internal.LifecycleModuleBuilder.buildProject (LifecycleModuleBuilder.java:81)
    at org.apache.maven.lifecycle.internal.builder.singlethreaded.SingleThreadedBuilder.build
(SingleThreadedBuilder.java:56)
    at org.apache.maven.lifecycle.internal.LifecycleStarter.execute (LifecycleStarter.java:128)
    at org.apache.maven.DefaultMaven.doExecute (DefaultMaven.java:305)
    at org.apache.maven.DefaultMaven.doExecute (DefaultMaven.java:192)
    at org.apache.maven.DefaultMaven.execute (DefaultMaven.java:105)
    at org.apache.maven.cli.MavenCli.execute (MavenCli.java:954)
    at org.apache.maven.cli.MavenCli.doMain (MavenCli.java:288)
    at org.apache.maven.cli.MavenCli.main (MavenCli.java:192)
    at sun.reflect.NativeMethodAccessorImpl.invoke0 (Native Method)
    at sun.reflect.NativeMethodAccessorImpl.invoke (NativeMethodAccessorImpl.java:62)
    at sun.reflect.DelegatingMethodAccessorImpl.invoke (DelegatingMethodAccessorImpl.java:43)
    at java.lang.reflect.Method.invoke (Method.java:498)
    at org.codehaus.plexus.classworlds.launcher.Launcher.launchEnhanced (Launcher.java:289)
    at org.codehaus.plexus.classworlds.launcher.Launcher.launch (Launcher.java:229)
    at org.codehaus.plexus.classworlds.launcher.Launcher.mainWithExitCode (Launcher.java:415)
    at org.codehaus.plexus.classworlds.launcher.Launcher.main (Launcher.java:356)
Caused by: java.net.BindException: Address already in use
    at sun.nio.ch.Net.bind0 (Native Method)
    at sun.nio.ch.Net.bind (Net.java:433)
    at sun.nio.ch.Net.bind (Net.java:425)
    at sun.nio.ch.ServerSocketChannelImpl.bind (ServerSocketChannelImpl.java:223)
    at sun.nio.ch.ServerSocketAdaptor.bind (ServerSocketAdaptor.java:74)
    at sun.nio.ch.ServerSocketAdaptor.bind (ServerSocketAdaptor.java:67)
    at org.apache.zookeeper.server.NIOServerCnxnFactory.configure (NIOServerCnxnFactory.java:95)
    at org.apache.zookeeper.server.ServerCnxnFactory.createFactory (ServerCnxnFactory.java:126)
    at org.apache.atlas.kafka.EmbeddedKafkaServer.startZk (EmbeddedKafkaServer.java:116)
    at org.apache.atlas.kafka.EmbeddedKafkaServer.start (EmbeddedKafkaServer.java:80)
    at org.apache.atlas.service.Services.start (Services.java:67)
    at sun.reflect.NativeMethodAccessorImpl.invoke0 (Native Method)
    at sun.reflect.NativeMethodAccessorImpl.invoke (NativeMethodAccessorImpl.java:62)
    at sun.reflect.DelegatingMethodAccessorImpl.invoke (DelegatingMethodAccessorImpl.java:43)
    at java.lang.reflect.Method.invoke (Method.java:498)
    at org.springframework.beans.factory.annotation.InitDestroyAnnotationBeanPostProcessor$LifecycleElement.invoke
(InitDestroyAnnotationBeanPostProcessor.java:366)
    at org.springframework.beans.factory.annotation.InitDestroyAnnotationBeanPostProcessor$LifecycleMetadata.invokeInitMethods
(InitDestroyAnnotationBeanPostProcessor.java:311)
    at org.springframework.beans.factory.annotation.InitDestroyAnnotationBeanPostProcessor.postProcessBeforeInitialization
(InitDestroyAnnotationBeanPostProcessor.java:134)
    at org.springframework.beans.factory.support.AbstractAutowireCapableBeanFactory.applyBeanPostProcessorsBeforeInitialization
(AbstractAutowireCapableBeanFactory.java:409)
    at org.springframework.beans.factory.support.AbstractAutowireCapableBeanFactory.initializeBean
(AbstractAutowireCapableBeanFactory.java:1626)
    at org.springframework.beans.factory.support.AbstractAutowireCapableBeanFactory.doCreateBean
(AbstractAutowireCapableBeanFactory.java:555)
    at org.springframework.beans.factory.support.AbstractAutowireCapableBeanFactory.createBean
(AbstractAutowireCapableBeanFactory.java:483)
    at org.springframework.beans.factory.support.AbstractBeanFactory$1.getObject (AbstractBeanFactory.java:312)
    at org.springframework.beans.factory.support.DefaultSingletonBeanRegistry.getSingleton
(DefaultSingletonBeanRegistry.java:230)
    at org.springframework.beans.factory.support.AbstractBeanFactory.doGetBean (AbstractBeanFactory.java:308)
    at org.springframework.beans.factory.support.AbstractBeanFactory.getBean (AbstractBeanFactory.java:197)
    at org.springframework.beans.factory.support.DefaultListableBeanFactory.preInstantiateSingletons
(DefaultListableBeanFactory.java:761)
    at org.springframework.context.support.AbstractApplicationContext.finishBeanFactoryInitialization
(AbstractApplicationContext.java:867)
    at org.springframework.context.support.AbstractApplicationContext.refresh (AbstractApplicationContext.java:543)
    at org.springframework.web.context.ContextLoader.configureAndRefreshWebApplicationContext
(ContextLoader.java:443)
    at org.springframework.web.context.ContextLoader.initWebApplicationContext (ContextLoader.java:325)
    at org.springframework.web.context.ContextLoaderListener.contextInitialized (ContextLoaderListener.java:107)
    at org.eclipse.jetty.server.handler.ContextHandler.callContextInitialized (ContextHandler.java:843)
    at org.eclipse.jetty.servlet.ServletContextHandler.callContextInitialized (ServletContextHandler.java:533)
    at org.eclipse.jetty.server.handler.ContextHandler.startContext (ContextHandler.java:816)
    at org.eclipse.jetty.servlet.ServletContextHandler.startContext (ServletContextHandler.java:345)
    at org.eclipse.jetty.webapp.WebAppContext.startWebapp (WebAppContext.java:1404)
    at org.eclipse.jetty.maven.plugin.JettyWebAppContext.startWebapp (JettyWebAppContext.java:323)
    at org.eclipse.jetty.webapp.WebAppContext.startContext (WebAppContext.java:1366)
    at org.eclipse.jetty.server.handler.ContextHandler.doStart (ContextHandler.java:778)
    at org.eclipse.jetty.servlet.ServletContextHandler.doStart (ServletContextHandler.java:262)
    at org.eclipse.jetty.webapp.WebAppContext.doStart (WebAppContext.java:520)
    at org.eclipse.jetty.maven.plugin.JettyWebAppContext.doStart (JettyWebAppContext.java:398)
    at org.eclipse.jetty.util.component.AbstractLifeCycle.start (AbstractLifeCycle.java:68)
    at org.eclipse.jetty.util.component.ContainerLifeCycle.start (ContainerLifeCycle.java:131)
    at org.eclipse.jetty.util.component.ContainerLifeCycle.doStart (ContainerLifeCycle.java:113)
    at org.eclipse.jetty.server.handler.AbstractHandler.doStart (AbstractHandler.java:61)
    at org.eclipse.jetty.server.handler.ContextHandlerCollection.doStart (ContextHandlerCollection.java:161)
    at org.eclipse.jetty.util.component.AbstractLifeCycle.start (AbstractLifeCycle.java:68)
    at org.eclipse.jetty.util.component.ContainerLifeCycle.start (ContainerLifeCycle.java:131)
    at org.eclipse.jetty.util.component.ContainerLifeCycle.doStart (ContainerLifeCycle.java:113)
    at org.eclipse.jetty.server.handler.AbstractHandler.doStart (AbstractHandler.java:61)
    at org.eclipse.jetty.util.component.AbstractLifeCycle.start (AbstractLifeCycle.java:68)
    at org.eclipse.jetty.util.component.ContainerLifeCycle.start (ContainerLifeCycle.java:131)
    at org.eclipse.jetty.server.Server.start (Server.java:422)
    at org.eclipse.jetty.util.component.ContainerLifeCycle.doStart (ContainerLifeCycle.java:105)
    at org.eclipse.jetty.server.handler.AbstractHandler.doStart (AbstractHandler.java:61)
    at org.eclipse.jetty.server.Server.doStart (Server.java:389)
    at org.eclipse.jetty.util.component.AbstractLifeCycle.start (AbstractLifeCycle.java:68)
    at org.eclipse.jetty.maven.plugin.AbstractJettyMojo.startJetty (AbstractJettyMojo.java:460)
    at org.eclipse.jetty.maven.plugin.AbstractJettyMojo.execute (AbstractJettyMojo.java:328)
    at org.eclipse.jetty.maven.plugin.JettyRunWarMojo.execute (JettyRunWarMojo.java:64)
    at org.eclipse.jetty.maven.plugin.JettyDeployWar.execute (JettyDeployWar.java:65)
    at org.apache.maven.plugin.DefaultBuildPluginManager.executeMojo (DefaultBuildPluginManager.java:137)
    at org.apache.maven.lifecycle.internal.MojoExecutor.execute (MojoExecutor.java:208)
    at org.apache.maven.lifecycle.internal.MojoExecutor.execute (MojoExecutor.java:154)
    at org.apache.maven.lifecycle.internal.MojoExecutor.execute (MojoExecutor.java:146)
    at org.apache.maven.lifecycle.internal.LifecycleModuleBuilder.buildProject (LifecycleModuleBuilder.java:117)
    at org.apache.maven.lifecycle.internal.LifecycleModuleBuilder.buildProject (LifecycleModuleBuilder.java:81)
    at org.apache.maven.lifecycle.internal.builder.singlethreaded.SingleThreadedBuilder.build
(SingleThreadedBuilder.java:56)
    at org.apache.maven.lifecycle.internal.LifecycleStarter.execute (LifecycleStarter.java:128)
    at org.apache.maven.DefaultMaven.doExecute (DefaultMaven.java:305)
    at org.apache.maven.DefaultMaven.doExecute (DefaultMaven.java:192)
    at org.apache.maven.DefaultMaven.execute (DefaultMaven.java:105)
    at org.apache.maven.cli.MavenCli.execute (MavenCli.java:954)
    at org.apache.maven.cli.MavenCli.doMain (MavenCli.java:288)
    at org.apache.maven.cli.MavenCli.main (MavenCli.java:192)
    at sun.reflect.NativeMethodAccessorImpl.invoke0 (Native Method)
    at sun.reflect.NativeMethodAccessorImpl.invoke (NativeMethodAccessorImpl.java:62)
    at sun.reflect.DelegatingMethodAccessorImpl.invoke (DelegatingMethodAccessorImpl.java:43)
    at java.lang.reflect.Method.invoke (Method.java:498)
    at org.codehaus.plexus.classworlds.launcher.Launcher.launchEnhanced (Launcher.java:289)
    at org.codehaus.plexus.classworlds.launcher.Launcher.launch (Launcher.java:229)
    at org.codehaus.plexus.classworlds.launcher.Launcher.mainWithExitCode (Launcher.java:415)
    at org.codehaus.plexus.classworlds.launcher.Launcher.main (Launcher.java:356)
[INFO] ------------------------------------------------------------------------
[INFO] Reactor Summary:
[INFO] 
[INFO] Apache Atlas Server Build Tools 1.0 ................ SUCCESS [  0.689 s]
[INFO] apache-atlas 2.0.0-SNAPSHOT ........................ SUCCESS [  4.301 s]
[INFO] Apache Atlas Test Utility Tools .................... SUCCESS [ 10.141 s]
[INFO] Apache Atlas Integration ........................... SUCCESS [ 25.749 s]
[INFO] Apache Atlas Common ................................ SUCCESS [ 10.134 s]
[INFO] Apache Atlas Client ................................ SUCCESS [  0.703 s]
[INFO] atlas-client-common ................................ SUCCESS [  8.465 s]
[INFO] atlas-client-v1 .................................... SUCCESS [  8.205 s]
[INFO] Apache Atlas Server API ............................ SUCCESS [  5.891 s]
[INFO] Apache Atlas Notification .......................... SUCCESS [ 10.596 s]
[INFO] atlas-client-v2 .................................... SUCCESS [  7.213 s]
[INFO] Apache Atlas Graph Database Projects ............... SUCCESS [  0.478 s]
[INFO] Apache Atlas Graph Database API .................... SUCCESS [  5.424 s]
[INFO] Graph Database Common Code ......................... SUCCESS [  5.670 s]
[INFO] Apache Atlas JanusGraph DB Impl .................... SUCCESS [ 19.890 s]
[INFO] Apache Atlas Graph Database Implementation Dependencies SUCCESS [  2.352 s]
[INFO] Shaded version of Apache hbase client .............. SUCCESS [  8.494 s]
[INFO] Shaded version of Apache hbase server .............. SUCCESS [ 22.492 s]
[INFO] Apache Atlas Authorization ......................... SUCCESS [  7.489 s]
[INFO] Apache Atlas Repository ............................ SUCCESS [ 40.133 s]
[INFO] Apache Atlas UI .................................... SUCCESS [01:56 min]
[INFO] Apache Atlas Web Application ....................... FAILURE [01:17 min]
[INFO] Apache Atlas Documentation ......................... SKIPPED
[INFO] Apache Atlas FileSystem Model ...................... SKIPPED
[INFO] Apache Atlas Plugin Classloader .................... SKIPPED
[INFO] Apache Atlas Hive Bridge Shim ...................... SKIPPED
[INFO] Apache Atlas Hive Bridge ........................... SKIPPED
[INFO] Apache Atlas Falcon Bridge Shim .................... SKIPPED
[INFO] Apache Atlas Falcon Bridge ......................... SKIPPED
[INFO] Apache Atlas Sqoop Bridge Shim ..................... SKIPPED
[INFO] Apache Atlas Sqoop Bridge .......................... SKIPPED
[INFO] Apache Atlas Storm Bridge Shim ..................... SKIPPED
[INFO] Apache Atlas Storm Bridge .......................... SKIPPED
[INFO] Apache Atlas Hbase Bridge Shim ..................... SKIPPED
[INFO] Apache Atlas Hbase Bridge .......................... SKIPPED
[INFO] Apache Atlas Kafka Bridge .......................... SKIPPED
[INFO] Apache Atlas Distribution 2.0.0-SNAPSHOT ........... SKIPPED
[INFO] ------------------------------------------------------------------------
[INFO] BUILD FAILURE
[INFO] ------------------------------------------------------------------------
[INFO] Total time: 06:40 min
[INFO] Finished at: 2018-08-13T21:39:51Z
[INFO] ------------------------------------------------------------------------
[ERROR] Failed to execute goal org.eclipse.jetty:jetty-maven-plugin:9.3.14.v20161028:deploy-war
(start-jetty) on project atlas-webapp: Failure: Address already in use -> [Help 1]
[ERROR] 
[ERROR] To see the full stack trace of the errors, re-run Maven with the -e switch.
[ERROR] Re-run Maven using the -X switch to enable full debug logging.
[ERROR] 
[ERROR] For more information about the errors and possible solutions, please read the following
articles:
[ERROR] [Help 1] http://cwiki.apache.org/confluence/display/MAVEN/MojoExecutionException
[ERROR] 
[ERROR] After correcting the problems, you can resume the build with the command
[ERROR]   mvn <goals> -rf :atlas-webapp
[INFO] Stopped ServerConnector@2324a50c{HTTP/1.1,[http/1.1]}{0.0.0.0:0}
[INFO] Stopped o.e.j.s.ServletContextHandler@7b2f6131{/solr,null,UNAVAILABLE}
Build step 'Execute shell' marked build as failure
[CHECKSTYLE] Collecting checkstyle analysis files...
[CHECKSTYLE] Searching for all files in <https://builds.apache.org/job/Atlas-master-IntegrationTests/ws/>
that match the pattern **/target/checkstyle-result.xml
[CHECKSTYLE] Parsing 20 files in <https://builds.apache.org/job/Atlas-master-IntegrationTests/ws/>
[CHECKSTYLE] Successfully parsed file <https://builds.apache.org/job/Atlas-master-IntegrationTests/ws/authorization/target/checkstyle-result.xml>
with 930 unique warnings and 0 duplicates.
[CHECKSTYLE] Successfully parsed file <https://builds.apache.org/job/Atlas-master-IntegrationTests/ws/client/client-v1/target/checkstyle-result.xml>
with 1829 unique warnings and 0 duplicates.
[CHECKSTYLE] Successfully parsed file <https://builds.apache.org/job/Atlas-master-IntegrationTests/ws/client/client-v2/target/checkstyle-result.xml>
with 2188 unique warnings and 0 duplicates.
[CHECKSTYLE] Successfully parsed file <https://builds.apache.org/job/Atlas-master-IntegrationTests/ws/client/common/target/checkstyle-result.xml>
with 2680 unique warnings and 0 duplicates.
[CHECKSTYLE] Successfully parsed file <https://builds.apache.org/job/Atlas-master-IntegrationTests/ws/client/target/checkstyle-result.xml>
with 2680 unique warnings and 0 duplicates.
[CHECKSTYLE] Successfully parsed file <https://builds.apache.org/job/Atlas-master-IntegrationTests/ws/common/target/checkstyle-result.xml>
with 3747 unique warnings and 0 duplicates.
[CHECKSTYLE] Successfully parsed file <https://builds.apache.org/job/Atlas-master-IntegrationTests/ws/dashboardv2/target/checkstyle-result.xml>
with 3747 unique warnings and 0 duplicates.
[CHECKSTYLE] Successfully parsed file <https://builds.apache.org/job/Atlas-master-IntegrationTests/ws/graphdb/api/target/checkstyle-result.xml>
with 4049 unique warnings and 0 duplicates.
[CHECKSTYLE] Successfully parsed file <https://builds.apache.org/job/Atlas-master-IntegrationTests/ws/graphdb/common/target/checkstyle-result.xml>
with 4275 unique warnings and 0 duplicates.
[CHECKSTYLE] Successfully parsed file <https://builds.apache.org/job/Atlas-master-IntegrationTests/ws/graphdb/graphdb-impls/target/checkstyle-result.xml>
with 4275 unique warnings and 0 duplicates.
[CHECKSTYLE] Successfully parsed file <https://builds.apache.org/job/Atlas-master-IntegrationTests/ws/graphdb/janus/target/checkstyle-result.xml>
with 6597 unique warnings and 0 duplicates.
[CHECKSTYLE] Successfully parsed file <https://builds.apache.org/job/Atlas-master-IntegrationTests/ws/graphdb/target/checkstyle-result.xml>
with 6597 unique warnings and 0 duplicates.
[CHECKSTYLE] Successfully parsed file <https://builds.apache.org/job/Atlas-master-IntegrationTests/ws/intg/target/checkstyle-result.xml>
with 18659 unique warnings and 0 duplicates.
[CHECKSTYLE] Successfully parsed file <https://builds.apache.org/job/Atlas-master-IntegrationTests/ws/notification/target/checkstyle-result.xml>
with 19904 unique warnings and 0 duplicates.
[CHECKSTYLE] Successfully parsed file <https://builds.apache.org/job/Atlas-master-IntegrationTests/ws/repository/target/checkstyle-result.xml>
with 39020 unique warnings and 0 duplicates.
[CHECKSTYLE] Successfully parsed file <https://builds.apache.org/job/Atlas-master-IntegrationTests/ws/server-api/target/checkstyle-result.xml>
with 39188 unique warnings and 0 duplicates.
[CHECKSTYLE] Successfully parsed file <https://builds.apache.org/job/Atlas-master-IntegrationTests/ws/shaded/hbase-client-shaded/target/checkstyle-result.xml>
with 39188 unique warnings and 0 duplicates.
[CHECKSTYLE] Successfully parsed file <https://builds.apache.org/job/Atlas-master-IntegrationTests/ws/shaded/hbase-server-shaded/target/checkstyle-result.xml>
with 39188 unique warnings and 0 duplicates.
[CHECKSTYLE] Successfully parsed file <https://builds.apache.org/job/Atlas-master-IntegrationTests/ws/target/checkstyle-result.xml>
with 39188 unique warnings and 0 duplicates.
[CHECKSTYLE] Successfully parsed file <https://builds.apache.org/job/Atlas-master-IntegrationTests/ws/test-tools/target/checkstyle-result.xml>
with 39226 unique warnings and 0 duplicates.
<Git Blamer> Using GitBlamer to create author and commit information for all warnings.
<Git Blamer> GIT_COMMIT=1099f1ba1169ce670fbdcf29803f8169f2ca9df4, workspace=<https://builds.apache.org/job/Atlas-master-IntegrationTests/ws/>
 > git rev-parse 1099f1ba1169ce670fbdcf29803f8169f2ca9df4^{commit} # timeout=10
[CHECKSTYLE] Computing warning deltas based on reference build #2111
[FINDBUGS] Collecting findbugs analysis files...
[FINDBUGS] Searching for all files in <https://builds.apache.org/job/Atlas-master-IntegrationTests/ws/>
that match the pattern **/target/findbugs.xml
[FINDBUGS] Parsing 13 files in <https://builds.apache.org/job/Atlas-master-IntegrationTests/ws/>
[FINDBUGS] Successfully parsed file <https://builds.apache.org/job/Atlas-master-IntegrationTests/ws/authorization/target/findbugs.xml>
with 0 unique warnings and 0 duplicates.
[FINDBUGS] Successfully parsed file <https://builds.apache.org/job/Atlas-master-IntegrationTests/ws/client/client-v1/target/findbugs.xml>
with 0 unique warnings and 0 duplicates.
[FINDBUGS] Successfully parsed file <https://builds.apache.org/job/Atlas-master-IntegrationTests/ws/client/client-v2/target/findbugs.xml>
with 0 unique warnings and 0 duplicates.
[FINDBUGS] Successfully parsed file <https://builds.apache.org/job/Atlas-master-IntegrationTests/ws/client/common/target/findbugs.xml>
with 0 unique warnings and 0 duplicates.
[FINDBUGS] Successfully parsed file <https://builds.apache.org/job/Atlas-master-IntegrationTests/ws/common/target/findbugs.xml>
with 0 unique warnings and 0 duplicates.
[FINDBUGS] Successfully parsed file <https://builds.apache.org/job/Atlas-master-IntegrationTests/ws/graphdb/api/target/findbugs.xml>
with 0 unique warnings and 0 duplicates.
[FINDBUGS] Successfully parsed file <https://builds.apache.org/job/Atlas-master-IntegrationTests/ws/graphdb/common/target/findbugs.xml>
with 0 unique warnings and 0 duplicates.
[FINDBUGS] Successfully parsed file <https://builds.apache.org/job/Atlas-master-IntegrationTests/ws/graphdb/janus/target/findbugs.xml>
with 0 unique warnings and 0 duplicates.
[FINDBUGS] Successfully parsed file <https://builds.apache.org/job/Atlas-master-IntegrationTests/ws/intg/target/findbugs.xml>
with 0 unique warnings and 0 duplicates.
[FINDBUGS] Successfully parsed file <https://builds.apache.org/job/Atlas-master-IntegrationTests/ws/notification/target/findbugs.xml>
with 0 unique warnings and 0 duplicates.
[FINDBUGS] Successfully parsed file <https://builds.apache.org/job/Atlas-master-IntegrationTests/ws/repository/target/findbugs.xml>
with 0 unique warnings and 0 duplicates.
[FINDBUGS] Successfully parsed file <https://builds.apache.org/job/Atlas-master-IntegrationTests/ws/server-api/target/findbugs.xml>
with 0 unique warnings and 0 duplicates.
[FINDBUGS] Successfully parsed file <https://builds.apache.org/job/Atlas-master-IntegrationTests/ws/test-tools/target/findbugs.xml>
with 0 unique warnings and 0 duplicates.
<Git Blamer> Using GitBlamer to create author and commit information for all warnings.
<Git Blamer> GIT_COMMIT=1099f1ba1169ce670fbdcf29803f8169f2ca9df4, workspace=<https://builds.apache.org/job/Atlas-master-IntegrationTests/ws/>
[FINDBUGS] Computing warning deltas based on reference build #2111
Archiving artifacts
[Fast Archiver] Compressed 165.50 MB of artifacts by 84.8% relative to #2111
TestNG Reports Processing: START
Looking for TestNG results report in workspace using pattern: **/target/surefire-reports/testng-results.xml,**/target/failsafe-reports/testng-results.xml
Did not find any matching files.

Mime
View raw message