atlas-dev mailing list archives

Site index · List index
Message view « Date » · « Thread »
Top « Date » · « Thread »
From Apache Jenkins Server <jenk...@builds.apache.org>
Subject Build failed in Jenkins: Atlas-0.8-UnitTests #226
Date Thu, 02 Aug 2018 23:44:00 GMT
See <https://builds.apache.org/job/Atlas-0.8-UnitTests/226/display/redirect?page=changes>

Changes:

[amestry] ATLAS-2804: Export & Import Detailed Audits.

------------------------------------------
[...truncated 195.33 KB...]
Java HotSpot(TM) 64-Bit Server VM warning: ignoring option MaxPermSize=512m; support was removed
in 8.0
Java HotSpot(TM) 64-Bit Server VM warning: ignoring option MaxPermSize=512m; support was removed
in 8.0
Running org.apache.atlas.repository.graph.Gremlin3QueryOptimizerTest
Java HotSpot(TM) 64-Bit Server VM warning: ignoring option MaxPermSize=512m; support was removed
in 8.0
Java HotSpot(TM) 64-Bit Server VM warning: ignoring option MaxPermSize=512m; support was removed
in 8.0
Running org.apache.atlas.repository.impexp.ExportServiceTest
Java HotSpot(TM) 64-Bit Server VM warning: ignoring option MaxPermSize=512m; support was removed
in 8.0
Running org.apache.atlas.repository.typestore.GraphBackedTypeStoreTest
Java HotSpot(TM) 64-Bit Server VM warning: ignoring option MaxPermSize=512m; support was removed
in 8.0
Running org.apache.atlas.repository.store.graph.v1.AtlasEntityStoreV1Test
Running org.apache.atlas.repository.store.graph.v1.AtlasEntityDefStoreV1Test
Running org.apache.atlas.repository.graph.GraphBackedRepositorySoftDeleteTest
Running org.apache.atlas.repository.graph.ReverseReferenceUpdateSoftDeleteTest
Java HotSpot(TM) 64-Bit Server VM warning: ignoring option MaxPermSize=512m; support was removed
in 8.0
Java HotSpot(TM) 64-Bit Server VM warning: ignoring option MaxPermSize=512m; support was removed
in 8.0
Java HotSpot(TM) 64-Bit Server VM warning: ignoring option MaxPermSize=512m; support was removed
in 8.0
Running org.apache.atlas.repository.graph.GraphBackedSearchIndexerMockTest
Running org.apache.atlas.repository.graph.GraphBackedRepositoryHardDeleteTest
Running org.apache.atlas.repository.clusterinfo.ClusterServiceTest
Running org.apache.atlas.repository.impexp.ZipSourceTest
Running org.apache.atlas.repository.store.graph.v1.AtlasEntityStoreV1BulkImportPercentTest
Running org.apache.atlas.repository.impexp.TypeAttributeDifferenceTest
Running org.apache.atlas.service.StoreBackedTypeCacheMetadataServiceTest
Running org.apache.atlas.repository.graph.AbstractGremlinQueryOptimizerTest
Running org.apache.atlas.repository.audit.InMemoryAuditRepositoryTest
Running org.apache.atlas.repository.graph.GraphHelperTest
Running org.apache.atlas.repository.graph.ReverseReferenceUpdateHardDeleteTest
Running org.apache.atlas.repository.impexp.ImportTransformerTest
Running org.apache.atlas.services.MetricsServiceTest
Running org.apache.atlas.repository.graph.Gremlin2QueryOptimizerTest
Running org.apache.atlas.repository.store.graph.v1.SoftDeleteHandlerV1Test
Running org.apache.atlas.repository.store.graph.v1.InverseReferenceUpdateSoftDeleteV1Test
Running org.apache.atlas.BaseRepositoryTest
Running org.apache.atlas.repository.graph.TestIntSequence
Running org.apache.atlas.repository.impexp.ImportTransformsTest
Running org.apache.atlas.repository.impexp.UniqueListTest
Running org.apache.atlas.repository.store.graph.v1.AtlasDeleteHandlerV1Test
Running org.apache.atlas.repository.impexp.ImportTransformerJSONTest
Running org.apache.atlas.repository.impexp.ZipSinkTest
Running org.apache.atlas.repository.store.graph.v1.HardDeleteHandlerV1Test
Running org.apache.atlas.TestModules
Tests run: 0, Failures: 0, Errors: 0, Skipped: 0, Time elapsed: 58.298 sec - in org.apache.atlas.repository.store.graph.v1.AtlasDeleteHandlerV1Test
Tests run: 0, Failures: 0, Errors: 0, Skipped: 0, Time elapsed: 59.109 sec - in org.apache.atlas.repository.graph.AbstractGremlinQueryOptimizerTest
Tests run: 6, Failures: 0, Errors: 0, Skipped: 0, Time elapsed: 59.393 sec - in org.apache.atlas.repository.impexp.TypeAttributeDifferenceTest
Tests run: 6, Failures: 0, Errors: 0, Skipped: 0, Time elapsed: 60.478 sec - in org.apache.atlas.repository.impexp.AtlasImportRequestTest
Tests run: 4, Failures: 0, Errors: 0, Skipped: 0, Time elapsed: 59.179 sec - in org.apache.atlas.repository.impexp.UniqueListTest
Java HotSpot(TM) 64-Bit Server VM warning: ignoring option MaxPermSize=512m; support was removed
in 8.0
Java HotSpot(TM) 64-Bit Server VM warning: ignoring option MaxPermSize=512m; support was removed
in 8.0
Tests run: 8, Failures: 0, Errors: 0, Skipped: 0, Time elapsed: 60.013 sec - in org.apache.atlas.repository.impexp.ImportTransformerTest
Java HotSpot(TM) 64-Bit Server VM warning: ignoring option MaxPermSize=512m; support was removed
in 8.0
Java HotSpot(TM) 64-Bit Server VM warning: ignoring option MaxPermSize=512m; support was removed
in 8.0
Java HotSpot(TM) 64-Bit Server VM warning: ignoring option MaxPermSize=512m; support was removed
in 8.0
Tests run: 0, Failures: 0, Errors: 0, Skipped: 0, Time elapsed: 61.113 sec - in org.apache.atlas.repository.store.graph.v1.InverseReferenceUpdateV1Test
Tests run: 3, Failures: 0, Errors: 0, Skipped: 0, Time elapsed: 60.65 sec - in org.apache.atlas.repository.audit.InMemoryAuditRepositoryTest
Java HotSpot(TM) 64-Bit Server VM warning: ignoring option MaxPermSize=512m; support was removed
in 8.0
Tests run: 8, Failures: 0, Errors: 0, Skipped: 0, Time elapsed: 60.454 sec - in org.apache.atlas.repository.impexp.ImportTransformsTest
Tests run: 33, Failures: 0, Errors: 0, Skipped: 0, Time elapsed: 61.077 sec - in org.apache.atlas.repository.graph.Gremlin2QueryOptimizerTest
Tests run: 0, Failures: 0, Errors: 0, Skipped: 0, Time elapsed: 61.751 sec - in org.apache.atlas.repository.BaseTest
Java HotSpot(TM) 64-Bit Server VM warning: ignoring option MaxPermSize=512m; support was removed
in 8.0
Java HotSpot(TM) 64-Bit Server VM warning: ignoring option MaxPermSize=512m; support was removed
in 8.0
Tests run: 0, Failures: 0, Errors: 0, Skipped: 0, Time elapsed: 60.455 sec - in org.apache.atlas.TestModules
Java HotSpot(TM) 64-Bit Server VM warning: ignoring option MaxPermSize=512m; support was removed
in 8.0
Java HotSpot(TM) 64-Bit Server VM warning: ignoring option MaxPermSize=512m; support was removed
in 8.0
Java HotSpot(TM) 64-Bit Server VM warning: ignoring option MaxPermSize=512m; support was removed
in 8.0
Running org.apache.atlas.discovery.GraphBackedDiscoveryServiceTest
Java HotSpot(TM) 64-Bit Server VM warning: ignoring option MaxPermSize=512m; support was removed
in 8.0
Running org.apache.atlas.discovery.DataSetLineageServiceTest
Running org.apache.atlas.discovery.EntityDiscoveryServiceTest
Running org.apache.atlas.query.BaseGremlinTest
Tests run: 2, Failures: 0, Errors: 0, Skipped: 0, Time elapsed: 64.112 sec - in org.apache.atlas.repository.audit.HBaseBasedAuditRepositoryHATest
Running org.apache.atlas.query.GremlinTest
Tests run: 0, Failures: 0, Errors: 0, Skipped: 0, Time elapsed: 63.964 sec - in org.apache.atlas.repository.graph.TestIntSequence
Running org.apache.atlas.query.QueryProcessorTest
Tests run: 8, Failures: 0, Errors: 0, Skipped: 0, Time elapsed: 63.657 sec - in org.apache.atlas.repository.impexp.ZipSinkTest
Running org.apache.atlas.query.LexerTest
Running org.apache.atlas.query.ExpressionTest
Java HotSpot(TM) 64-Bit Server VM warning: ignoring option MaxPermSize=512m; support was removed
in 8.0
Running org.apache.atlas.query.ParserTest
Tests run: 33, Failures: 0, Errors: 0, Skipped: 0, Time elapsed: 65.232 sec - in org.apache.atlas.repository.graph.Gremlin3QueryOptimizerTest
Tests run: 1, Failures: 0, Errors: 0, Skipped: 0, Time elapsed: 64.358 sec - in org.apache.atlas.repository.impexp.ImportTransformerJSONTest
Tests run: 9, Failures: 0, Errors: 0, Skipped: 0, Time elapsed: 65.279 sec - in org.apache.atlas.repository.store.graph.v1.AtlasEntityStoreV1BulkImportPercentTest
Java HotSpot(TM) 64-Bit Server VM warning: ignoring option MaxPermSize=512m; support was removed
in 8.0
Java HotSpot(TM) 64-Bit Server VM warning: ignoring option MaxPermSize=512m; support was removed
in 8.0
Tests run: 0, Failures: 0, Errors: 0, Skipped: 0, Time elapsed: 65.059 sec - in org.apache.atlas.BaseRepositoryTest
Running org.apache.atlas.query.LineageQueryTest
Running org.apache.atlas.util.CompiledQueryCacheKeyTest
Java HotSpot(TM) 64-Bit Server VM warning: ignoring option MaxPermSize=512m; support was removed
in 8.0
Tests run: 2, Failures: 0, Errors: 0, Skipped: 0, Time elapsed: 66.456 sec - in org.apache.atlas.repository.graph.GraphHelperMockTest
Running org.apache.atlas.utils.ObjectUpdateSynchronizerTest
Tests run: 3, Failures: 0, Errors: 0, Skipped: 0, Time elapsed: 66.569 sec - in org.apache.atlas.repository.graph.GraphBackedSearchIndexerMockTest
Tests run: 6, Failures: 0, Errors: 0, Skipped: 0, Time elapsed: 66.622 sec - in org.apache.atlas.repository.impexp.ZipSourceTest
Running org.apache.atlas.RepositoryServiceLoadingTest
Running org.apache.atlas.TestUtils
Running org.apache.atlas.utils.TestResourceFileUtils
Running org.apache.atlas.lineage.EntityLineageServiceTest
Tests run: 1, Failures: 0, Errors: 0, Skipped: 0, Time elapsed: 70.89 sec - in org.apache.atlas.services.MetricsServiceTest
Tests run: 5, Failures: 0, Errors: 0, Skipped: 0, Time elapsed: 77.643 sec - in org.apache.atlas.repository.graph.GraphBackedSearchIndexerTest
Tests run: 5, Failures: 0, Errors: 0, Skipped: 0, Time elapsed: 82.311 sec - in org.apache.atlas.repository.typestore.GraphBackedTypeStoreTest
Tests run: 1, Failures: 0, Errors: 0, Skipped: 0, Time elapsed: 89.206 sec - in org.apache.atlas.repository.store.graph.v1.AtlasEntityDefStoreV1Test
Tests run: 2, Failures: 0, Errors: 0, Skipped: 0, Time elapsed: 92.116 sec - in org.apache.atlas.repository.typestore.StoreBackedTypeCacheTest
Tests run: 5, Failures: 0, Errors: 0, Skipped: 0, Time elapsed: 91.935 sec - in org.apache.atlas.repository.graph.ReverseReferenceUpdateSoftDeleteTest
Tests run: 5, Failures: 0, Errors: 0, Skipped: 0, Time elapsed: 95.481 sec - in org.apache.atlas.repository.graph.ReverseReferenceUpdateHardDeleteTest
Tests run: 3, Failures: 0, Errors: 0, Skipped: 0, Time elapsed: 101.749 sec - in org.apache.atlas.repository.impexp.ExportImportAuditServiceTest
Tests run: 1, Failures: 0, Errors: 0, Skipped: 0, Time elapsed: 103.041 sec - in org.apache.atlas.repository.clusterinfo.ClusterServiceTest
Tests run: 5, Failures: 0, Errors: 0, Skipped: 0, Time elapsed: 110.61 sec - in org.apache.atlas.repository.store.graph.v1.InverseReferenceUpdateSoftDeleteV1Test
Tests run: 3, Failures: 0, Errors: 0, Skipped: 0, Time elapsed: 111.841 sec - in org.apache.atlas.service.StoreBackedTypeCacheMetadataServiceTest
Tests run: 0, Failures: 0, Errors: 0, Skipped: 0, Time elapsed: 48.468 sec - in org.apache.atlas.query.BaseGremlinTest
Tests run: 14, Failures: 0, Errors: 0, Skipped: 0, Time elapsed: 113.628 sec - in org.apache.atlas.repository.graph.GraphHelperTest
Tests run: 0, Failures: 0, Errors: 0, Skipped: 0, Time elapsed: 45.981 sec - in org.apache.atlas.TestUtils
Tests run: 9, Failures: 0, Errors: 0, Skipped: 0, Time elapsed: 50.535 sec - in org.apache.atlas.utils.ObjectUpdateSynchronizerTest
Tests run: 19, Failures: 0, Errors: 0, Skipped: 0, Time elapsed: 52.371 sec - in org.apache.atlas.query.ExpressionTest
Tests run: 5, Failures: 0, Errors: 0, Skipped: 0, Time elapsed: 51.644 sec - in org.apache.atlas.util.CompiledQueryCacheKeyTest
Tests run: 14, Failures: 0, Errors: 0, Skipped: 0, Time elapsed: 52.595 sec - in org.apache.atlas.query.ParserTest
Tests run: 0, Failures: 0, Errors: 0, Skipped: 0, Time elapsed: 49.916 sec - in org.apache.atlas.utils.TestResourceFileUtils
Tests run: 5, Failures: 0, Errors: 0, Skipped: 0, Time elapsed: 118.074 sec - in org.apache.atlas.repository.store.graph.v1.InverseReferenceUpdateHardDeleteV1Test
Tests run: 11, Failures: 1, Errors: 0, Skipped: 0, Time elapsed: 118.879 sec <<<
FAILURE! - in org.apache.atlas.repository.userprofile.UserProfileServiceTest
filterInternalType(org.apache.atlas.repository.userprofile.UserProfileServiceTest)  Time elapsed:
0.071 sec  <<< FAILURE!
java.lang.AssertionError: expected [7] but found [6]
	at org.testng.Assert.fail(Assert.java:94)
	at org.testng.Assert.failNotEquals(Assert.java:496)
	at org.testng.Assert.assertEquals(Assert.java:125)
	at org.testng.Assert.assertEquals(Assert.java:372)
	at org.testng.Assert.assertEquals(Assert.java:382)
	at org.apache.atlas.repository.userprofile.UserProfileServiceTest.filterInternalType(UserProfileServiceTest.java:70)

Tests run: 5, Failures: 0, Errors: 0, Skipped: 0, Time elapsed: 56.81 sec - in org.apache.atlas.query.QueryProcessorTest
Tests run: 1, Failures: 0, Errors: 0, Skipped: 0, Time elapsed: 57.124 sec - in org.apache.atlas.query.LexerTest
Tests run: 1, Failures: 0, Errors: 0, Skipped: 0, Time elapsed: 58.294 sec - in org.apache.atlas.RepositoryServiceLoadingTest
Tests run: 4, Failures: 0, Errors: 0, Skipped: 0, Time elapsed: 127.44 sec - in org.apache.atlas.repository.audit.HBaseBasedAuditRepositoryTest
Tests run: 0, Failures: 0, Errors: 0, Skipped: 0, Time elapsed: 68.793 sec - in org.apache.atlas.discovery.DataSetLineageServiceTest
Tests run: 30, Failures: 0, Errors: 0, Skipped: 0, Time elapsed: 131.819 sec - in org.apache.atlas.repository.graph.GraphBackedMetadataRepositoryTest
Tests run: 6, Failures: 0, Errors: 0, Skipped: 0, Time elapsed: 68.22 sec - in org.apache.atlas.discovery.EntityDiscoveryServiceTest
Tests run: 14, Failures: 0, Errors: 0, Skipped: 0, Time elapsed: 132.46 sec - in org.apache.atlas.repository.store.graph.AtlasTypeDefGraphStoreTest
Tests run: 21, Failures: 0, Errors: 0, Skipped: 0, Time elapsed: 136.11 sec - in org.apache.atlas.repository.graph.GraphBackedRepositoryHardDeleteTest
Tests run: 21, Failures: 0, Errors: 0, Skipped: 0, Time elapsed: 136.7 sec - in org.apache.atlas.repository.graph.GraphBackedRepositorySoftDeleteTest
Tests run: 13, Failures: 0, Errors: 0, Skipped: 0, Time elapsed: 138.206 sec - in org.apache.atlas.repository.store.graph.v1.AtlasEntityStoreV1Test
Tests run: 11, Failures: 0, Errors: 0, Skipped: 0, Time elapsed: 141.364 sec - in org.apache.atlas.repository.store.graph.v1.SoftDeleteHandlerV1Test
Tests run: 12, Failures: 1, Errors: 0, Skipped: 0, Time elapsed: 141.852 sec <<<
FAILURE! - in org.apache.atlas.repository.impexp.ImportServiceTest
postTest(org.apache.atlas.repository.impexp.ImportServiceTest)  Time elapsed: 0.946 sec  <<<
FAILURE!
java.lang.AssertionError: expected object to not be null
	at org.testng.Assert.fail(Assert.java:94)
	at org.testng.Assert.assertNotNull(Assert.java:406)
	at org.testng.Assert.assertNotNull(Assert.java:391)
	at org.apache.atlas.repository.impexp.ExportImportTestBase.assertAuditEntry(ExportImportTestBase.java:44)
	at org.apache.atlas.repository.impexp.ImportServiceTest.postTest(ImportServiceTest.java:84)

Tests run: 11, Failures: 0, Errors: 0, Skipped: 0, Time elapsed: 140.588 sec - in org.apache.atlas.repository.store.graph.v1.HardDeleteHandlerV1Test
Tests run: 12, Failures: 0, Errors: 0, Skipped: 0, Time elapsed: 143.912 sec - in org.apache.atlas.repository.impexp.ExportServiceTest
Tests run: 5, Failures: 0, Errors: 0, Skipped: 0, Time elapsed: 79.391 sec - in org.apache.atlas.query.LineageQueryTest
Tests run: 27, Failures: 0, Errors: 0, Skipped: 0, Time elapsed: 148.288 sec - in org.apache.atlas.service.DefaultMetadataServiceTest
Tests run: 21, Failures: 0, Errors: 0, Skipped: 0, Time elapsed: 85.024 sec - in org.apache.atlas.query.GremlinTest
Tests run: 23, Failures: 0, Errors: 0, Skipped: 0, Time elapsed: 85.252 sec - in org.apache.atlas.lineage.EntityLineageServiceTest
Tests run: 338, Failures: 0, Errors: 0, Skipped: 0, Time elapsed: 215.866 sec - in org.apache.atlas.discovery.GraphBackedDiscoveryServiceTest
Tests run: 2, Failures: 0, Errors: 0, Skipped: 0, Time elapsed: 329.414 sec - in org.apache.atlas.repository.graph.GraphRepoMapperScaleTest

Results :

Failed tests: 
  ImportServiceTest.postTest:84->ExportImportTestBase.assertAuditEntry:44 expected object
to not be null
  UserProfileServiceTest.filterInternalType:70 expected [7] but found [6]

Tests run: 823, Failures: 2, Errors: 0, Skipped: 0

[INFO] ------------------------------------------------------------------------
[INFO] Reactor Summary:
[INFO] 
[INFO] Apache Atlas Server Build Tools 1.0 ................ SUCCESS [  0.537 s]
[INFO] apache-atlas 0.8.3-SNAPSHOT ........................ SUCCESS [  1.853 s]
[INFO] Apache Atlas Integration ........................... SUCCESS [ 10.872 s]
[INFO] Apache Atlas Common ................................ SUCCESS [  1.997 s]
[INFO] Apache Atlas Typesystem ............................ SUCCESS [ 33.057 s]
[INFO] Apache Atlas Client ................................ SUCCESS [  0.177 s]
[INFO] atlas-client-common ................................ SUCCESS [  0.758 s]
[INFO] atlas-client-v1 .................................... SUCCESS [  3.696 s]
[INFO] Apache Atlas Server API ............................ SUCCESS [  0.880 s]
[INFO] Apache Atlas Notification .......................... SUCCESS [ 14.698 s]
[INFO] atlas-client-v2 .................................... SUCCESS [  0.625 s]
[INFO] Apache Atlas Graph Database Projects ............... SUCCESS [  0.100 s]
[INFO] Apache Atlas Graph Database API .................... SUCCESS [  0.793 s]
[INFO] Graph Database Common Code ......................... SUCCESS [  0.758 s]
[INFO] Apache Atlas Titan 1.0.0 GraphDB Impl .............. SUCCESS [ 28.821 s]
[INFO] Shaded version of Apache hbase client .............. SUCCESS [  7.963 s]
[INFO] Apache Atlas Titan 0.5.4 Graph DB Impl ............. SUCCESS [01:07 min]
[INFO] Apache Atlas Graph Database Implementation Dependencies SUCCESS [  0.128 s]
[INFO] Shaded version of Apache hbase server .............. SUCCESS [ 21.358 s]
[INFO] Apache Atlas Repository ............................ FAILURE [06:15 min]
[INFO] Apache Atlas Authorization ......................... SKIPPED
[INFO] Apache Atlas Business Catalog ...................... SKIPPED
[INFO] Apache Atlas UI .................................... SKIPPED
[INFO] Apache Atlas Web Application ....................... SKIPPED
[INFO] Apache Atlas Documentation ......................... SKIPPED
[INFO] Apache Atlas FileSystem Model ...................... SKIPPED
[INFO] Apache Atlas Plugin Classloader .................... SKIPPED
[INFO] Apache Atlas Hive Bridge Shim ...................... SKIPPED
[INFO] Apache Atlas Hive Bridge ........................... SKIPPED
[INFO] Apache Atlas Falcon Bridge Shim .................... SKIPPED
[INFO] Apache Atlas Falcon Bridge ......................... SKIPPED
[INFO] Apache Atlas Sqoop Bridge Shim ..................... SKIPPED
[INFO] Apache Atlas Sqoop Bridge .......................... SKIPPED
[INFO] Apache Atlas Storm Bridge Shim ..................... SKIPPED
[INFO] Apache Atlas Storm Bridge .......................... SKIPPED
[INFO] Apache Atlas Hbase Bridge Shim ..................... SKIPPED
[INFO] Apache Atlas Hbase Bridge .......................... SKIPPED
[INFO] Apache Atlas Migration Exporter .................... SKIPPED
[INFO] Apache Atlas Distribution 0.8.3-SNAPSHOT ........... SKIPPED
[INFO] ------------------------------------------------------------------------
[INFO] BUILD FAILURE
[INFO] ------------------------------------------------------------------------
[INFO] Total time: 09:33 min
[INFO] Finished at: 2018-08-02T23:43:54Z
[INFO] ------------------------------------------------------------------------
[ERROR] Failed to execute goal org.apache.maven.plugins:maven-surefire-plugin:2.18.1:test
(default-test) on project atlas-repository: There are test failures.
[ERROR] 
[ERROR] Please refer to <https://builds.apache.org/job/Atlas-0.8-UnitTests/ws/repository/target/surefire-reports>
for the individual test results.
[ERROR] -> [Help 1]
[ERROR] 
[ERROR] To see the full stack trace of the errors, re-run Maven with the -e switch.
[ERROR] Re-run Maven using the -X switch to enable full debug logging.
[ERROR] 
[ERROR] For more information about the errors and possible solutions, please read the following
articles:
[ERROR] [Help 1] http://cwiki.apache.org/confluence/display/MAVEN/MojoFailureException
[ERROR] 
[ERROR] After correcting the problems, you can resume the build with the command
[ERROR]   mvn <goals> -rf :atlas-repository
Build step 'Execute shell' marked build as failure
[CHECKSTYLE] Collecting checkstyle analysis files...
[CHECKSTYLE] Searching for all files in <https://builds.apache.org/job/Atlas-0.8-UnitTests/ws/>
that match the pattern **/target/checkstyle-result.xml
[CHECKSTYLE] No files found. Configuration error?
<Git Blamer> Using GitBlamer to create author and commit information for all warnings.
<Git Blamer> GIT_COMMIT=44dd6a1a7d33bbe8d428a2e9feba36a9b0ac3b79, workspace=<https://builds.apache.org/job/Atlas-0.8-UnitTests/ws/>
[CHECKSTYLE] Computing warning deltas based on reference build #223
[FINDBUGS] Collecting findbugs analysis files...
[FINDBUGS] Searching for all files in <https://builds.apache.org/job/Atlas-0.8-UnitTests/ws/>
that match the pattern **/target/findbugs.xml
[FINDBUGS] No files found. Configuration error?
<Git Blamer> Using GitBlamer to create author and commit information for all warnings.
<Git Blamer> GIT_COMMIT=44dd6a1a7d33bbe8d428a2e9feba36a9b0ac3b79, workspace=<https://builds.apache.org/job/Atlas-0.8-UnitTests/ws/>
[FINDBUGS] Computing warning deltas based on reference build #223
Archiving artifacts
TestNG Reports Processing: START
Looking for TestNG results report in workspace using pattern: **/target/surefire-reports/testng-results.xml,**/target/failsafe-reports/testng-results.xml
Saving reports...
Processing '/x1/jenkins/jenkins-home/jobs/Atlas-0.8-UnitTests/builds/226/testng/testng-results-1.xml'
Processing '/x1/jenkins/jenkins-home/jobs/Atlas-0.8-UnitTests/builds/226/testng/testng-results-2.xml'
Processing '/x1/jenkins/jenkins-home/jobs/Atlas-0.8-UnitTests/builds/226/testng/testng-results-3.xml'
Processing '/x1/jenkins/jenkins-home/jobs/Atlas-0.8-UnitTests/builds/226/testng/testng-results-4.xml'
Processing '/x1/jenkins/jenkins-home/jobs/Atlas-0.8-UnitTests/builds/226/testng/testng-results-5.xml'
Processing '/x1/jenkins/jenkins-home/jobs/Atlas-0.8-UnitTests/builds/226/testng/testng-results-6.xml'
Processing '/x1/jenkins/jenkins-home/jobs/Atlas-0.8-UnitTests/builds/226/testng/testng-results.xml'
TestNG Reports Processing: FINISH

Mime
View raw message