atlas-dev mailing list archives

Site index · List index
Message view « Date » · « Thread »
Top « Date » · « Thread »
From Apache Jenkins Server <jenk...@builds.apache.org>
Subject Build failed in Jenkins: PreCommit-ATLAS-Build-Test #579-branch-0.8-ATLAS-2823-branch-0.8.patch
Date Thu, 16 Aug 2018 01:24:26 GMT
See <https://builds.apache.org/job/PreCommit-ATLAS-Build-Test/579/display/redirect>

------------------------------------------
[...truncated 440.67 KB...]
127.0.0.1 - - [16/Aug/2018:01:23:11 +0000] "GET /api/atlas/v2/search/fulltext?offset=1&query=dbokZXVEV82l&limit=10
HTTP/1.1" 200 - "-" "Java/1.8.0_172"
127.0.0.1 - - [16/Aug/2018:01:23:11 +0000] "GET /api/atlas/v2/search/fulltext?offset=0&query=dbokZXVEV82l&limit=1
HTTP/1.1" 200 - "-" "Java/1.8.0_172"
127.0.0.1 - - [16/Aug/2018:01:23:11 +0000] "GET /api/atlas/v2/search/fulltext?offset=2&query=dbokZXVEV82l&limit=1
HTTP/1.1" 200 - "-" "Java/1.8.0_172"
127.0.0.1 - - [16/Aug/2018:01:23:11 +0000] "GET /api/atlas/v2/types/typedef/name/tableType
HTTP/1.1" 200 - "-" "Java/1.8.0_172"
127.0.0.1 - - [16/Aug/2018:01:23:11 +0000] "GET /api/atlas/v2/types/typedef/name/serdeType
HTTP/1.1" 200 - "-" "Java/1.8.0_172"
127.0.0.1 - - [16/Aug/2018:01:23:11 +0000] "GET /api/atlas/v2/types/typedef/name/classification
HTTP/1.1" 200 - "-" "Java/1.8.0_172"
127.0.0.1 - - [16/Aug/2018:01:23:11 +0000] "GET /api/atlas/v2/types/typedef/name/pii_Tag HTTP/1.1"
200 - "-" "Java/1.8.0_172"
127.0.0.1 - - [16/Aug/2018:01:23:11 +0000] "GET /api/atlas/v2/types/typedef/name/phi_Tag HTTP/1.1"
200 - "-" "Java/1.8.0_172"
127.0.0.1 - - [16/Aug/2018:01:23:11 +0000] "GET /api/atlas/v2/types/typedef/name/pci_Tag HTTP/1.1"
200 - "-" "Java/1.8.0_172"
127.0.0.1 - - [16/Aug/2018:01:23:11 +0000] "GET /api/atlas/v2/types/typedef/name/sox_Tag HTTP/1.1"
200 - "-" "Java/1.8.0_172"
127.0.0.1 - - [16/Aug/2018:01:23:11 +0000] "GET /api/atlas/v2/types/typedef/name/sec_Tag HTTP/1.1"
200 - "-" "Java/1.8.0_172"
127.0.0.1 - - [16/Aug/2018:01:23:11 +0000] "GET /api/atlas/v2/types/typedef/name/finance_Tag
HTTP/1.1" 200 - "-" "Java/1.8.0_172"
127.0.0.1 - - [16/Aug/2018:01:23:11 +0000] "GET /api/atlas/v2/types/typedef/name/Factw0tKVwzJ4s
HTTP/1.1" 404 - "-" "Java/1.8.0_172"
127.0.0.1 - - [16/Aug/2018:01:23:11 +0000] "GET /api/atlas/v2/types/typedef/name/ETLhKsBn21BBm
HTTP/1.1" 404 - "-" "Java/1.8.0_172"
127.0.0.1 - - [16/Aug/2018:01:23:11 +0000] "GET /api/atlas/v2/types/typedef/name/DimensiongarPIBKuyX
HTTP/1.1" 404 - "-" "Java/1.8.0_172"
127.0.0.1 - - [16/Aug/2018:01:23:11 +0000] "GET /api/atlas/v2/types/typedef/name/MetricTiOmjmB9Tl
HTTP/1.1" 404 - "-" "Java/1.8.0_172"
127.0.0.1 - - [16/Aug/2018:01:23:11 +0000] "GET /api/atlas/v2/types/typedef/name/hive_db_v1
HTTP/1.1" 200 - "-" "Java/1.8.0_172"
127.0.0.1 - - [16/Aug/2018:01:23:11 +0000] "GET /api/atlas/v2/types/typedef/name/hive_column_v1
HTTP/1.1" 200 - "-" "Java/1.8.0_172"
127.0.0.1 - - [16/Aug/2018:01:23:11 +0000] "GET /api/atlas/v2/types/typedef/name/hive_table_v1
HTTP/1.1" 200 - "-" "Java/1.8.0_172"
127.0.0.1 - - [16/Aug/2018:01:23:11 +0000] "GET /api/atlas/v2/types/typedef/name/hive_process_v1
HTTP/1.1" 200 - "-" "Java/1.8.0_172"
127.0.0.1 - - [16/Aug/2018:01:23:11 +0000] "POST /api/atlas/types HTTP/1.1" 201 - "-" "Java/1.8.0_172"
127.0.0.1 - - [16/Aug/2018:01:23:11 +0000] "GET /api/atlas/v2/types/typedef/name/Fact_Tag
HTTP/1.1" 200 - "-" "Java/1.8.0_172"
127.0.0.1 - - [16/Aug/2018:01:23:11 +0000] "GET /api/atlas/v2/types/typedef/name/ETL_Tag HTTP/1.1"
200 - "-" "Java/1.8.0_172"
127.0.0.1 - - [16/Aug/2018:01:23:11 +0000] "GET /api/atlas/v2/types/typedef/name/Dimension_Tag
HTTP/1.1" 200 - "-" "Java/1.8.0_172"
127.0.0.1 - - [16/Aug/2018:01:23:11 +0000] "GET /api/atlas/v2/types/typedef/name/Metric_Tag
HTTP/1.1" 200 - "-" "Java/1.8.0_172"
127.0.0.1 - - [16/Aug/2018:01:23:11 +0000] "POST /api/atlas/types HTTP/1.1" 201 - "-" "Java/1.8.0_172"
127.0.0.1 - - [16/Aug/2018:01:23:12 +0000] "POST /api/atlas/entities HTTP/1.1" 201 - "-" "Java/1.8.0_172"
127.0.0.1 - - [16/Aug/2018:01:23:12 +0000] "POST /api/atlas/entities HTTP/1.1" 201 - "-" "Java/1.8.0_172"
127.0.0.1 - - [16/Aug/2018:01:23:12 +0000] "POST /api/atlas/entities HTTP/1.1" 201 - "-" "Java/1.8.0_172"
127.0.0.1 - - [16/Aug/2018:01:23:12 +0000] "POST /api/atlas/entities HTTP/1.1" 201 - "-" "Java/1.8.0_172"
127.0.0.1 - - [16/Aug/2018:01:23:12 +0000] "POST /api/atlas/entities HTTP/1.1" 201 - "-" "Java/1.8.0_172"
127.0.0.1 - - [16/Aug/2018:01:23:12 +0000] "POST /api/atlas/entities HTTP/1.1" 201 - "-" "Java/1.8.0_172"
127.0.0.1 - - [16/Aug/2018:01:23:12 +0000] "POST /api/atlas/entities HTTP/1.1" 201 - "-" "Java/1.8.0_172"
127.0.0.1 - - [16/Aug/2018:01:23:12 +0000] "POST /api/atlas/entities HTTP/1.1" 201 - "-" "Java/1.8.0_172"
127.0.0.1 - - [16/Aug/2018:01:23:12 +0000] "GET /api/atlas/v2/types/typedef/name/tableType
HTTP/1.1" 200 - "-" "Java/1.8.0_172"
127.0.0.1 - - [16/Aug/2018:01:23:12 +0000] "GET /api/atlas/v2/types/typedef/name/serdeType
HTTP/1.1" 200 - "-" "Java/1.8.0_172"
127.0.0.1 - - [16/Aug/2018:01:23:12 +0000] "GET /api/atlas/v2/types/typedef/name/classification
HTTP/1.1" 200 - "-" "Java/1.8.0_172"
127.0.0.1 - - [16/Aug/2018:01:23:12 +0000] "GET /api/atlas/v2/types/typedef/name/pii_Tag HTTP/1.1"
200 - "-" "Java/1.8.0_172"
127.0.0.1 - - [16/Aug/2018:01:23:12 +0000] "GET /api/atlas/v2/types/typedef/name/phi_Tag HTTP/1.1"
200 - "-" "Java/1.8.0_172"
127.0.0.1 - - [16/Aug/2018:01:23:12 +0000] "GET /api/atlas/v2/types/typedef/name/pci_Tag HTTP/1.1"
200 - "-" "Java/1.8.0_172"
127.0.0.1 - - [16/Aug/2018:01:23:12 +0000] "GET /api/atlas/v2/types/typedef/name/sox_Tag HTTP/1.1"
200 - "-" "Java/1.8.0_172"
127.0.0.1 - - [16/Aug/2018:01:23:12 +0000] "GET /api/atlas/v2/types/typedef/name/sec_Tag HTTP/1.1"
200 - "-" "Java/1.8.0_172"
127.0.0.1 - - [16/Aug/2018:01:23:12 +0000] "GET /api/atlas/v2/types/typedef/name/finance_Tag
HTTP/1.1" 200 - "-" "Java/1.8.0_172"
127.0.0.1 - - [16/Aug/2018:01:23:12 +0000] "GET /api/atlas/v2/types/typedef/name/FactQ2bmx08Vqh
HTTP/1.1" 404 - "-" "Java/1.8.0_172"
127.0.0.1 - - [16/Aug/2018:01:23:12 +0000] "GET /api/atlas/v2/types/typedef/name/ETLoXLgY1PV9u
HTTP/1.1" 404 - "-" "Java/1.8.0_172"
127.0.0.1 - - [16/Aug/2018:01:23:12 +0000] "GET /api/atlas/v2/types/typedef/name/DimensionurWQnXvyoH
HTTP/1.1" 404 - "-" "Java/1.8.0_172"
127.0.0.1 - - [16/Aug/2018:01:23:12 +0000] "GET /api/atlas/v2/types/typedef/name/MetriccaPauBwTEz
HTTP/1.1" 404 - "-" "Java/1.8.0_172"
127.0.0.1 - - [16/Aug/2018:01:23:12 +0000] "GET /api/atlas/v2/types/typedef/name/hive_db_v1
HTTP/1.1" 200 - "-" "Java/1.8.0_172"
127.0.0.1 - - [16/Aug/2018:01:23:12 +0000] "GET /api/atlas/v2/types/typedef/name/hive_column_v1
HTTP/1.1" 200 - "-" "Java/1.8.0_172"
127.0.0.1 - - [16/Aug/2018:01:23:12 +0000] "GET /api/atlas/v2/types/typedef/name/hive_table_v1
HTTP/1.1" 200 - "-" "Java/1.8.0_172"
127.0.0.1 - - [16/Aug/2018:01:23:12 +0000] "GET /api/atlas/v2/types/typedef/name/hive_process_v1
HTTP/1.1" 200 - "-" "Java/1.8.0_172"
127.0.0.1 - - [16/Aug/2018:01:23:12 +0000] "POST /api/atlas/types HTTP/1.1" 201 - "-" "Java/1.8.0_172"
127.0.0.1 - - [16/Aug/2018:01:23:12 +0000] "POST /api/atlas/entities HTTP/1.1" 201 - "-" "Java/1.8.0_172"
127.0.0.1 - - [16/Aug/2018:01:23:12 +0000] "POST /api/atlas/entities HTTP/1.1" 201 - "-" "Java/1.8.0_172"
127.0.0.1 - - [16/Aug/2018:01:23:12 +0000] "POST /api/atlas/entities HTTP/1.1" 201 - "-" "Java/1.8.0_172"
127.0.0.1 - - [16/Aug/2018:01:23:12 +0000] "POST /api/atlas/entities HTTP/1.1" 201 - "-" "Java/1.8.0_172"
127.0.0.1 - - [16/Aug/2018:01:23:12 +0000] "POST /api/atlas/entities HTTP/1.1" 201 - "-" "Java/1.8.0_172"
127.0.0.1 - - [16/Aug/2018:01:23:12 +0000] "POST /api/atlas/entities HTTP/1.1" 201 - "-" "Java/1.8.0_172"
127.0.0.1 - - [16/Aug/2018:01:23:12 +0000] "POST /api/atlas/entities HTTP/1.1" 201 - "-" "Java/1.8.0_172"
127.0.0.1 - - [16/Aug/2018:01:23:12 +0000] "POST /api/atlas/entities HTTP/1.1" 201 - "-" "Java/1.8.0_172"
127.0.0.1 - - [16/Aug/2018:01:23:12 +0000] "GET /api/atlas/lineage/hive/table/sales_fact_monthly_mvdKjRQtOz6a/inputs/graph
HTTP/1.1" 200 - "-" "Java/1.8.0_172"
127.0.0.1 - - [16/Aug/2018:01:23:15 +0000] "GET /api/atlas/entities?type=hive_table_v1&property=qualifiedName&value=sales_fact_monthly_mvdKjRQtOz6a
HTTP/1.1" 200 - "-" "Java/1.8.0_172"
127.0.0.1 - - [16/Aug/2018:01:23:15 +0000] "GET /api/atlas/lineage/5df32ebe-60bc-43d5-a501-279e5e1a2dbb/inputs/graph
HTTP/1.1" 200 - "-" "Java/1.8.0_172"
127.0.0.1 - - [16/Aug/2018:01:23:16 +0000] "GET /api/atlas/lineage/hive/table/sales_factgfPhaKajvu/outputs/graph
HTTP/1.1" 200 - "-" "Java/1.8.0_172"
127.0.0.1 - - [16/Aug/2018:01:23:18 +0000] "GET /api/atlas/entities?type=hive_table_v1&property=qualifiedName&value=sales_factgfPhaKajvu
HTTP/1.1" 200 - "-" "Java/1.8.0_172"
127.0.0.1 - - [16/Aug/2018:01:23:18 +0000] "GET /api/atlas/lineage/b2efe799-9c29-4204-8c2e-22652007ba78/outputs/graph
HTTP/1.1" 200 - "-" "Java/1.8.0_172"
127.0.0.1 - - [16/Aug/2018:01:23:19 +0000] "GET /api/atlas/lineage/hive/table/sales_factgfPhaKajvu/schema
HTTP/1.1" 200 - "-" "Java/1.8.0_172"
127.0.0.1 - - [16/Aug/2018:01:23:20 +0000] "GET /api/atlas/lineage/hive/table/SalestsrXS0cqZI/schema
HTTP/1.1" 404 - "-" "Java/1.8.0_172"
127.0.0.1 - - [16/Aug/2018:01:23:20 +0000] "GET /api/atlas/entities?type=hive_table_v1&property=qualifiedName&value=sales_factgfPhaKajvu
HTTP/1.1" 200 - "-" "Java/1.8.0_172"
127.0.0.1 - - [16/Aug/2018:01:23:20 +0000] "GET /api/atlas/lineage/b2efe799-9c29-4204-8c2e-22652007ba78/schema
HTTP/1.1" 200 - "-" "Java/1.8.0_172"
127.0.0.1 - - [16/Aug/2018:01:23:21 +0000] "GET /api/atlas/lineage/hive/table/blah/schema
HTTP/1.1" 404 - "-" "Java/1.8.0_172"
127.0.0.1 - - [16/Aug/2018:01:23:21 +0000] "GET /api/atlas/entities?type=hive_table_v1&property=qualifiedName&value=sales_fact_monthly_mvAsnGGgseLh
HTTP/1.1" 200 - "-" "Java/1.8.0_172"
127.0.0.1 - - [16/Aug/2018:01:23:21 +0000] "GET /api/atlas/v2/lineage/dc0be5dd-9b60-4343-915b-1a670b22ef13?depth=5&direction=INPUT
HTTP/1.1" 200 - "-" "Java/1.8.0_172"
127.0.0.1 - - [16/Aug/2018:01:23:22 +0000] "GET /api/atlas/entities?type=hive_table_v1&property=qualifiedName&value=sales_fact_monthly_mvAsnGGgseLh
HTTP/1.1" 200 - "-" "Java/1.8.0_172"
127.0.0.1 - - [16/Aug/2018:01:23:22 +0000] "GET /api/atlas/v2/lineage/dc0be5dd-9b60-4343-915b-1a670b22ef13?depth=5&direction=BOTH
HTTP/1.1" 200 - "-" "Java/1.8.0_172"
127.0.0.1 - - [16/Aug/2018:01:23:24 +0000] "GET /api/atlas/entities?type=hive_table_v1&property=qualifiedName&value=sales_factHUgAOULhd0
HTTP/1.1" 200 - "-" "Java/1.8.0_172"
127.0.0.1 - - [16/Aug/2018:01:23:24 +0000] "GET /api/atlas/v2/lineage/431e170d-e90d-406a-b05d-e5452943ed23?depth=5&direction=OUTPUT
HTTP/1.1" 200 - "-" "Java/1.8.0_172"
127.0.0.1 - - [16/Aug/2018:01:23:29 +0000] "GET /api/atlas/admin/status HTTP/1.1" 200 - "-"
"Java/1.8.0_172"
127.0.0.1 - - [16/Aug/2018:01:23:29 +0000] "POST /api/atlas/admin/import HTTP/1.1" 200 - "-"
"Java/1.8.0_172"
127.0.0.1 - - [16/Aug/2018:01:23:30 +0000] "POST /api/atlas/admin/export HTTP/1.1" 200 - "-"
"Java/1.8.0_172"
127.0.0.1 - - [16/Aug/2018:01:23:31 +0000] "GET /api/atlas/admin/status HTTP/1.1" 200 - "-"
"Java/1.8.0_172"
127.0.0.1 - - [16/Aug/2018:01:23:31 +0000] "GET /api/atlas/v1/taxonomies HTTP/1.1" 403 493
"-" "Java/1.8.0_172"
127.0.0.1 - - [16/Aug/2018:01:23:31 +0000] "GET /api/atlas/admin/session HTTP/1.1" 200 - "-"
"Java/1.8.0_172"
127.0.0.1 - - [16/Aug/2018:01:23:31 +0000] "GET /api/atlas/admin/session HTTP/1.1" 401 317
"-" "Java/1.8.0_172"
Tests run: 134, Failures: 4, Errors: 0, Skipped: 0, Time elapsed: 168.593 sec <<<
FAILURE! - in TestSuite
testCompleteUpdate(org.apache.atlas.web.integration.EntityJerseyResourceIT)  Time elapsed:
0.164 sec  <<< FAILURE!
java.lang.AssertionError: Maps do not have the same size:10 != 8
	at org.testng.Assert.fail(Assert.java:94)
	at org.testng.Assert.assertEquals(Assert.java:828)
	at org.apache.atlas.web.integration.EntityJerseyResourceIT.testCompleteUpdate(EntityJerseyResourceIT.java:989)

testPartialUpdateByGuid(org.apache.atlas.web.integration.EntityJerseyResourceIT)  Time elapsed:
0.128 sec  <<< FAILURE!
java.lang.AssertionError: expected: {Id='(type: hive_column, id: d91c4c18-f371-48ef-8800-d329463b1016)',
traits=[], values={owner=user1, replicatedToCluster=null, replicatedFromCluster=null, qualifiedName=default.table.col1@col1iD8rhW2qVy,
name=col1iD8rhW2qVy, description=col1, comment=col1 comment, position=0, type=string, table=(type:
hive_table, id: bc3d757c-e73c-4487-9c93-37a90b3c9734)}}; found: {Id='(type: hive_column, id:
<unassigned>)', traits=[], values={owner=user1, qualifiedName=default.table.col1@col1iD8rhW2qVy,
name=col1iD8rhW2qVy, description=col1, comment=col1 comment, position=0, type=string, table=(type:
hive_table, id: bc3d757c-e73c-4487-9c93-37a90b3c9734)}} expected [true] but found [false]
	at org.testng.Assert.fail(Assert.java:94)
	at org.testng.Assert.failNotEquals(Assert.java:496)
	at org.testng.Assert.assertTrue(Assert.java:42)
	at org.apache.atlas.web.integration.EntityJerseyResourceIT.testPartialUpdateByGuid(EntityJerseyResourceIT.java:880)

testPartialUpdateByUniqueAttributes(org.apache.atlas.web.integration.EntityJerseyResourceIT)
 Time elapsed: 0.139 sec  <<< FAILURE!
java.lang.AssertionError: Maps do not have the same size:10 != 8
	at org.testng.Assert.fail(Assert.java:94)
	at org.testng.Assert.assertEquals(Assert.java:828)
	at org.apache.atlas.web.integration.EntityJerseyResourceIT.testPartialUpdateByUniqueAttributes(EntityJerseyResourceIT.java:932)

testDiscoveryWithSearchParameters(org.apache.atlas.web.integration.BasicSearchIT)  Time elapsed:
0.304 sec  <<< FAILURE!
java.lang.AssertionError:  expected [3] but found [21]
	at org.testng.Assert.fail(Assert.java:94)
	at org.testng.Assert.failNotEquals(Assert.java:496)
	at org.testng.Assert.assertEquals(Assert.java:125)
	at org.testng.Assert.assertEquals(Assert.java:372)
	at org.apache.atlas.web.integration.BasicSearchIT.testDiscoveryWithSearchParameters(BasicSearchIT.java:127)


Results :

Failed tests: 
org.apache.atlas.web.integration.BasicSearchIT.testDiscoveryWithSearchParameters(org.apache.atlas.web.integration.BasicSearchIT)
  Run 1: BasicSearchIT.testDiscoveryWithSearchParameters:127  expected [3] but found [21]
  Run 2: PASS
  Run 3: PASS

  EntityJerseyResourceIT.testCompleteUpdate:989 Maps do not have the same size:10 != 8
  EntityJerseyResourceIT.testPartialUpdateByGuid:880 expected: {Id='(type: hive_column, id:
d91c4c18-f371-48ef-8800-d329463b1016)', traits=[], values={owner=user1, replicatedToCluster=null,
replicatedFromCluster=null, qualifiedName=default.table.col1@col1iD8rhW2qVy, name=col1iD8rhW2qVy,
description=col1, comment=col1 comment, position=0, type=string, table=(type: hive_table,
id: bc3d757c-e73c-4487-9c93-37a90b3c9734)}}; found: {Id='(type: hive_column, id: <unassigned>)',
traits=[], values={owner=user1, qualifiedName=default.table.col1@col1iD8rhW2qVy, name=col1iD8rhW2qVy,
description=col1, comment=col1 comment, position=0, type=string, table=(type: hive_table,
id: bc3d757c-e73c-4487-9c93-37a90b3c9734)}} expected [true] but found [false]
  EntityJerseyResourceIT.testPartialUpdateByUniqueAttributes:932 Maps do not have the same
size:10 != 8

Tests run: 132, Failures: 4, Errors: 0, Skipped: 0

[INFO] 
[INFO] --- jetty-maven-plugin:9.2.12.v20150709:stop (stop-jetty) @ atlas-webapp ---
[INFO] Waiting 10 seconds for jetty to stop
[INFO] Stopped ServerConnector@7610de27{HTTP/1.1}{0.0.0.0:31000}
[INFO] Closing Spring root WebApplicationContext
[INFO] Shutting down log4j
[INFO] Not cleaning cached beans: no such field javax.el.BeanELResolver.properties
[INFO] Stopped o.e.j.m.p.JettyWebAppContext@6bbf8b86{/,<https://builds.apache.org/job/PreCommit-ATLAS-Build-Test/ws/webapp/target/atlas-webapp-0.8.3-SNAPSHOT/,UNAVAILABLE}{/home/jenkins/jenkins-slave/workspace/PreCommit-ATLAS-Build-Test/webapp/target/atlas-webapp-0.8.3-SNAPSHOT.war}>
[INFO] Server reports itself as stopped
[INFO] 
[INFO] --- maven-source-plugin:2.4:jar-no-fork (attach-sources) @ atlas-webapp ---
[INFO] Building jar: <https://builds.apache.org/job/PreCommit-ATLAS-Build-Test/ws/webapp/target/atlas-webapp-0.8.3-SNAPSHOT-sources.jar>
log4j:WARN No appenders could be found for logger (org.apache.zookeeper.ClientCnxn).
log4j:WARN Please initialize the log4j system properly.
log4j:WARN See http://logging.apache.org/log4j/1.2/faq.html#noconfig for more info.
[INFO] 
[INFO] --- maven-source-plugin:2.4:test-jar-no-fork (attach-sources) @ atlas-webapp ---
[INFO] Building jar: <https://builds.apache.org/job/PreCommit-ATLAS-Build-Test/ws/webapp/target/atlas-webapp-0.8.3-SNAPSHOT-test-sources.jar>
[INFO] 
[INFO] --- maven-failsafe-plugin:2.18.1:verify (verify) @ atlas-webapp ---
[INFO] Failsafe report directory: <https://builds.apache.org/job/PreCommit-ATLAS-Build-Test/ws/webapp/target/failsafe-reports>
[INFO] ------------------------------------------------------------------------
[INFO] Reactor Summary:
[INFO] 
[INFO] Apache Atlas Server Build Tools 1.0 ................ SUCCESS [  0.780 s]
[INFO] apache-atlas 0.8.3-SNAPSHOT ........................ SUCCESS [  3.698 s]
[INFO] Apache Atlas Integration ........................... SUCCESS [ 14.151 s]
[INFO] Apache Atlas Common ................................ SUCCESS [  2.116 s]
[INFO] Apache Atlas Typesystem ............................ SUCCESS [ 36.339 s]
[INFO] Apache Atlas Client ................................ SUCCESS [  0.145 s]
[INFO] atlas-client-common ................................ SUCCESS [  0.695 s]
[INFO] atlas-client-v1 .................................... SUCCESS [  3.488 s]
[INFO] Apache Atlas Server API ............................ SUCCESS [  0.843 s]
[INFO] Apache Atlas Notification .......................... SUCCESS [ 12.249 s]
[INFO] atlas-client-v2 .................................... SUCCESS [  0.646 s]
[INFO] Apache Atlas Graph Database Projects ............... SUCCESS [  0.129 s]
[INFO] Apache Atlas Graph Database API .................... SUCCESS [  0.561 s]
[INFO] Graph Database Common Code ......................... SUCCESS [  0.635 s]
[INFO] Apache Atlas Titan 1.0.0 GraphDB Impl .............. SUCCESS [ 29.746 s]
[INFO] Shaded version of Apache hbase client .............. SUCCESS [  7.512 s]
[INFO] Apache Atlas Titan 0.5.4 Graph DB Impl ............. SUCCESS [01:02 min]
[INFO] Apache Atlas Graph Database Implementation Dependencies SUCCESS [  0.206 s]
[INFO] Shaded version of Apache hbase server .............. SUCCESS [ 21.817 s]
[INFO] Apache Atlas Repository ............................ SUCCESS [07:26 min]
[INFO] Apache Atlas Authorization ......................... SUCCESS [  1.682 s]
[INFO] Apache Atlas Business Catalog ...................... SUCCESS [  5.695 s]
[INFO] Apache Atlas UI .................................... SUCCESS [01:29 min]
[INFO] Apache Atlas Web Application ....................... FAILURE [07:50 min]
[INFO] Apache Atlas Documentation ......................... SKIPPED
[INFO] Apache Atlas FileSystem Model ...................... SKIPPED
[INFO] Apache Atlas Plugin Classloader .................... SKIPPED
[INFO] Apache Atlas Hive Bridge Shim ...................... SKIPPED
[INFO] Apache Atlas Hive Bridge ........................... SKIPPED
[INFO] Apache Atlas Falcon Bridge Shim .................... SKIPPED
[INFO] Apache Atlas Falcon Bridge ......................... SKIPPED
[INFO] Apache Atlas Sqoop Bridge Shim ..................... SKIPPED
[INFO] Apache Atlas Sqoop Bridge .......................... SKIPPED
[INFO] Apache Atlas Storm Bridge Shim ..................... SKIPPED
[INFO] Apache Atlas Storm Bridge .......................... SKIPPED
[INFO] Apache Atlas Hbase Bridge Shim ..................... SKIPPED
[INFO] Apache Atlas Hbase Bridge .......................... SKIPPED
[INFO] Apache Atlas Migration Exporter .................... SKIPPED
[INFO] Apache Atlas Distribution 0.8.3-SNAPSHOT ........... SKIPPED
[INFO] ------------------------------------------------------------------------
[INFO] BUILD FAILURE
[INFO] ------------------------------------------------------------------------
[INFO] Total time: 20:14 min
[INFO] Finished at: 2018-08-16T01:23:35Z
[INFO] ------------------------------------------------------------------------
[ERROR] Failed to execute goal org.apache.maven.plugins:maven-failsafe-plugin:2.18.1:verify
(verify) on project atlas-webapp: There are test failures.
[ERROR] 
[ERROR] Please refer to <https://builds.apache.org/job/PreCommit-ATLAS-Build-Test/ws/webapp/target/failsafe-reports>
for the individual test results.
[ERROR] -> [Help 1]
[ERROR] 
[ERROR] To see the full stack trace of the errors, re-run Maven with the -e switch.
[ERROR] Re-run Maven using the -X switch to enable full debug logging.
[ERROR] 
[ERROR] For more information about the errors and possible solutions, please read the following
articles:
[ERROR] [Help 1] http://cwiki.apache.org/confluence/display/MAVEN/MojoFailureException
[ERROR] 
[ERROR] After correcting the problems, you can resume the build with the command
[ERROR]   mvn <goals> -rf :atlas-webapp




{color:red}-1 overall{color}.  

    {color:green}+1 @author{color}.  The patch does not contain any @author tags.

Console output: https://builds.apache.org/job/PreCommit-ATLAS-Build-Test/579//console

This message is automatically generated.


======================================================================
======================================================================
    Adding comment to Jira.
======================================================================
======================================================================




======================================================================
======================================================================
    Finished build.
======================================================================
======================================================================


+ EXIT_CODE=1
+ '[' -d <https://builds.apache.org/job/PreCommit-ATLAS-Build-Test/ws/../atlas_patchprocess_16800>
']'
+ '[' -d <https://builds.apache.org/job/PreCommit-ATLAS-Build-Test/ws/atlas_patchprocess_16800>
']'
+ mv <https://builds.apache.org/job/PreCommit-ATLAS-Build-Test/ws/atlas_patchprocess_16800>
<https://builds.apache.org/job/PreCommit-ATLAS-Build-Test/ws/patchprocess>
+ rm -f <https://builds.apache.org/job/PreCommit-ATLAS-Build-Test/ws/../atlas_patchprocess_16800>
+ exit 1
Build step 'Execute shell' marked build as failure
Set build name.
New build name is '#579-branch-0.8-ATLAS-2823-branch-0.8.patch'
Archiving artifacts
[Fast Archiver] Compressed 203.50 MB of artifacts by 17.0% relative to #576

Mime
View raw message