atlas-dev mailing list archives

Site index · List index
Message view « Date » · « Thread »
Top « Date » · « Thread »
From Apache Jenkins Server <jenk...@builds.apache.org>
Subject Build failed in Jenkins: PreCommit-ATLAS-Build-Test #590-branch-0.8-ATLAS-2355-branch-0.8.patch
Date Thu, 16 Aug 2018 17:40:04 GMT
See <https://builds.apache.org/job/PreCommit-ATLAS-Build-Test/590/display/redirect>

------------------------------------------
[...truncated 65.44 MB...]
Aug 16, 2018 5:39:01 PM com.sun.jersey.server.impl.application.WebApplicationImpl _initiate
INFO: Initiating Jersey application, version 'Jersey: 1.19.3 10/24/2016 03:43 PM'
[INFO] Started o.e.j.m.p.JettyWebAppContext@657d8138{/,<https://builds.apache.org/job/PreCommit-ATLAS-Build-Test/ws/webapp/target/atlas-webapp-0.8.3-SNAPSHOT/,AVAILABLE}{/home/jenkins/jenkins-slave/workspace/PreCommit-ATLAS-Build-Test/webapp/target/atlas-webapp-0.8.3-SNAPSHOT.war}>
[INFO] Started ServerConnector@6f54396a{HTTP/1.1}{0.0.0.0:31000}
[INFO] Started @2222916ms
[INFO] Started Jetty Server
[INFO] 
[INFO] --- maven-failsafe-plugin:2.18.1:integration-test (integration-test) @ storm-bridge
---
[WARNING] useSystemClassloader setting has no effect when not forking
[INFO] Failsafe report directory: <https://builds.apache.org/job/PreCommit-ATLAS-Build-Test/ws/addons/storm-bridge/target/failsafe-reports>
Running org.apache.atlas.storm.hook.StormAtlasHookIT
2018-08-16 17:39:03,332 DEBUG - [main-SendThread(localhost:19026):] ~ ==> InMemoryJAASConfiguration.getAppConfigurationEntry(Client)
(InMemoryJAASConfiguration:208)
2018-08-16 17:39:03,334 DEBUG - [main-SendThread(localhost:19026):] ~ <== InMemoryJAASConfiguration.getAppConfigurationEntry(Client):
{} (InMemoryJAASConfiguration:238)
2018-08-16 17:39:04,202 DEBUG - [main-SendThread(localhost:19026):] ~ ==> InMemoryJAASConfiguration.getAppConfigurationEntry(Client)
(InMemoryJAASConfiguration:208)
2018-08-16 17:39:04,204 DEBUG - [main-SendThread(localhost:19026):] ~ <== InMemoryJAASConfiguration.getAppConfigurationEntry(Client):
{} (InMemoryJAASConfiguration:238)
2018-08-16 17:39:05,511 DEBUG - [main-SendThread(localhost:19026):] ~ ==> InMemoryJAASConfiguration.getAppConfigurationEntry(Client)
(InMemoryJAASConfiguration:208)
2018-08-16 17:39:05,512 DEBUG - [main-SendThread(localhost:19026):] ~ <== InMemoryJAASConfiguration.getAppConfigurationEntry(Client):
{} (InMemoryJAASConfiguration:238)
2018-08-16 17:39:05,634 DEBUG - [main-SendThread(localhost:19026):] ~ ==> InMemoryJAASConfiguration.getAppConfigurationEntry(Client)
(InMemoryJAASConfiguration:208)
2018-08-16 17:39:05,636 DEBUG - [main-SendThread(localhost:19026):] ~ <== InMemoryJAASConfiguration.getAppConfigurationEntry(Client):
{} (InMemoryJAASConfiguration:238)
2018-08-16 17:39:07,125 DEBUG - [main-SendThread(localhost:19026):] ~ ==> InMemoryJAASConfiguration.getAppConfigurationEntry(Client)
(InMemoryJAASConfiguration:208)
2018-08-16 17:39:07,126 DEBUG - [main-SendThread(localhost:19026):] ~ <== InMemoryJAASConfiguration.getAppConfigurationEntry(Client):
{} (InMemoryJAASConfiguration:238)
2018-08-16 17:39:07,269 DEBUG - [main-SendThread(localhost:19026):] ~ ==> InMemoryJAASConfiguration.getAppConfigurationEntry(Client)
(InMemoryJAASConfiguration:208)
2018-08-16 17:39:07,270 DEBUG - [main-SendThread(localhost:19026):] ~ <== InMemoryJAASConfiguration.getAppConfigurationEntry(Client):
{} (InMemoryJAASConfiguration:238)
2018-08-16 17:39:08,301 DEBUG - [main:] ~ ==> InMemoryJAASConfiguration.getAppConfigurationEntry(Server)
(InMemoryJAASConfiguration:208)
2018-08-16 17:39:08,303 DEBUG - [main:] ~ <== InMemoryJAASConfiguration.getAppConfigurationEntry(Server):
{} (InMemoryJAASConfiguration:238)
2018-08-16 17:39:08,429 DEBUG - [main-SendThread(localhost:19026):] ~ ==> InMemoryJAASConfiguration.getAppConfigurationEntry(Client)
(InMemoryJAASConfiguration:208)
2018-08-16 17:39:08,430 DEBUG - [main-SendThread(localhost:19026):] ~ <== InMemoryJAASConfiguration.getAppConfigurationEntry(Client):
{} (InMemoryJAASConfiguration:238)
2018-08-16 17:39:08,812 DEBUG - [main-SendThread(localhost:19026):] ~ ==> InMemoryJAASConfiguration.getAppConfigurationEntry(Client)
(InMemoryJAASConfiguration:208)
2018-08-16 17:39:08,814 DEBUG - [main-SendThread(localhost:19026):] ~ <== InMemoryJAASConfiguration.getAppConfigurationEntry(Client):
{} (InMemoryJAASConfiguration:238)
2018-08-16 17:39:08,854 DEBUG - [main-SendThread(localhost:2000):] ~ ==> InMemoryJAASConfiguration.getAppConfigurationEntry(Client)
(InMemoryJAASConfiguration:208)
2018-08-16 17:39:08,855 DEBUG - [main-SendThread(localhost:2000):] ~ <== InMemoryJAASConfiguration.getAppConfigurationEntry(Client):
{} (InMemoryJAASConfiguration:238)
2018-08-16 17:39:08,907 DEBUG - [main-SendThread(localhost:2000):] ~ ==> InMemoryJAASConfiguration.getAppConfigurationEntry(Client)
(InMemoryJAASConfiguration:208)
2018-08-16 17:39:08,910 DEBUG - [main-SendThread(localhost:2000):] ~ <== InMemoryJAASConfiguration.getAppConfigurationEntry(Client):
{} (InMemoryJAASConfiguration:238)
2018-08-16 17:39:08,962 DEBUG - [main-SendThread(localhost:2000):] ~ ==> InMemoryJAASConfiguration.getAppConfigurationEntry(Client)
(InMemoryJAASConfiguration:208)
2018-08-16 17:39:08,963 DEBUG - [main-SendThread(localhost:2000):] ~ <== InMemoryJAASConfiguration.getAppConfigurationEntry(Client):
{} (InMemoryJAASConfiguration:238)
2018-08-16 17:39:09,055 DEBUG - [main-SendThread(localhost:2000):] ~ ==> InMemoryJAASConfiguration.getAppConfigurationEntry(Client)
(InMemoryJAASConfiguration:208)
2018-08-16 17:39:09,056 DEBUG - [main-SendThread(localhost:2000):] ~ <== InMemoryJAASConfiguration.getAppConfigurationEntry(Client):
{} (InMemoryJAASConfiguration:238)
2018-08-16 17:39:09,058 DEBUG - [main-SendThread(localhost:2000):] ~ ==> InMemoryJAASConfiguration.getAppConfigurationEntry(Client)
(InMemoryJAASConfiguration:208)
2018-08-16 17:39:09,059 DEBUG - [main-SendThread(localhost:2000):] ~ <== InMemoryJAASConfiguration.getAppConfigurationEntry(Client):
{} (InMemoryJAASConfiguration:238)
2018-08-16 17:39:09,300 DEBUG - [main-SendThread(localhost:2000):] ~ ==> InMemoryJAASConfiguration.getAppConfigurationEntry(Client)
(InMemoryJAASConfiguration:208)
2018-08-16 17:39:09,301 DEBUG - [main-SendThread(localhost:2000):] ~ <== InMemoryJAASConfiguration.getAppConfigurationEntry(Client):
{} (InMemoryJAASConfiguration:238)
2018-08-16 17:39:09,310 DEBUG - [main-SendThread(localhost:2000):] ~ ==> InMemoryJAASConfiguration.getAppConfigurationEntry(Client)
(InMemoryJAASConfiguration:208)
2018-08-16 17:39:09,311 DEBUG - [main-SendThread(localhost:2000):] ~ <== InMemoryJAASConfiguration.getAppConfigurationEntry(Client):
{} (InMemoryJAASConfiguration:238)
2018-08-16 17:39:09,314 DEBUG - [main-SendThread(localhost:2000):] ~ ==> InMemoryJAASConfiguration.getAppConfigurationEntry(Client)
(InMemoryJAASConfiguration:208)
2018-08-16 17:39:09,315 DEBUG - [main-SendThread(localhost:2000):] ~ <== InMemoryJAASConfiguration.getAppConfigurationEntry(Client):
{} (InMemoryJAASConfiguration:238)
2018-08-16 17:39:09,326 DEBUG - [main-SendThread(localhost:2000):] ~ ==> InMemoryJAASConfiguration.getAppConfigurationEntry(Client)
(InMemoryJAASConfiguration:208)
2018-08-16 17:39:09,327 DEBUG - [main-SendThread(localhost:2000):] ~ <== InMemoryJAASConfiguration.getAppConfigurationEntry(Client):
{} (InMemoryJAASConfiguration:238)
2018-08-16 17:39:09,417 DEBUG - [main-SendThread(localhost:2000):] ~ ==> InMemoryJAASConfiguration.getAppConfigurationEntry(Client)
(InMemoryJAASConfiguration:208)
2018-08-16 17:39:09,418 DEBUG - [main-SendThread(localhost:2000):] ~ <== InMemoryJAASConfiguration.getAppConfigurationEntry(Client):
{} (InMemoryJAASConfiguration:238)
2018-08-16 17:39:09,426 DEBUG - [main-SendThread(localhost:2000):] ~ ==> InMemoryJAASConfiguration.getAppConfigurationEntry(Client)
(InMemoryJAASConfiguration:208)
2018-08-16 17:39:09,427 DEBUG - [main-SendThread(localhost:2000):] ~ <== InMemoryJAASConfiguration.getAppConfigurationEntry(Client):
{} (InMemoryJAASConfiguration:238)
2018-08-16 17:39:09,483 DEBUG - [main-SendThread(localhost:2000):] ~ ==> InMemoryJAASConfiguration.getAppConfigurationEntry(Client)
(InMemoryJAASConfiguration:208)
2018-08-16 17:39:09,485 DEBUG - [main-SendThread(localhost:2000):] ~ <== InMemoryJAASConfiguration.getAppConfigurationEntry(Client):
{} (InMemoryJAASConfiguration:238)
2018-08-16 17:39:09,495 DEBUG - [main-SendThread(localhost:2000):] ~ ==> InMemoryJAASConfiguration.getAppConfigurationEntry(Client)
(InMemoryJAASConfiguration:208)
2018-08-16 17:39:09,496 DEBUG - [main-SendThread(localhost:2000):] ~ <== InMemoryJAASConfiguration.getAppConfigurationEntry(Client):
{} (InMemoryJAASConfiguration:238)
2018-08-16 17:39:10,372 DEBUG - [main-SendThread(localhost:2000):] ~ ==> InMemoryJAASConfiguration.getAppConfigurationEntry(Client)
(InMemoryJAASConfiguration:208)
2018-08-16 17:39:10,374 DEBUG - [main-SendThread(localhost:2000):] ~ <== InMemoryJAASConfiguration.getAppConfigurationEntry(Client):
{} (InMemoryJAASConfiguration:238)
2018-08-16 17:39:10,384 DEBUG - [main-SendThread(localhost:19026):] ~ ==> InMemoryJAASConfiguration.getAppConfigurationEntry(Client)
(InMemoryJAASConfiguration:208)
2018-08-16 17:39:10,386 DEBUG - [main-SendThread(localhost:19026):] ~ <== InMemoryJAASConfiguration.getAppConfigurationEntry(Client):
{} (InMemoryJAASConfiguration:238)
2018-08-16 17:39:10,429 DEBUG - [main-SendThread(localhost:2000):] ~ ==> InMemoryJAASConfiguration.getAppConfigurationEntry(Client)
(InMemoryJAASConfiguration:208)
2018-08-16 17:39:10,430 DEBUG - [main-SendThread(localhost:2000):] ~ <== InMemoryJAASConfiguration.getAppConfigurationEntry(Client):
{} (InMemoryJAASConfiguration:238)
2018-08-16 17:39:11,369 DEBUG - [main-SendThread(localhost:19026):] ~ ==> InMemoryJAASConfiguration.getAppConfigurationEntry(Client)
(InMemoryJAASConfiguration:208)
2018-08-16 17:39:11,371 DEBUG - [main-SendThread(localhost:19026):] ~ <== InMemoryJAASConfiguration.getAppConfigurationEntry(Client):
{} (InMemoryJAASConfiguration:238)
Tests run: 1, Failures: 1, Errors: 0, Skipped: 0, Time elapsed: 8.846 sec <<< FAILURE!
- in org.apache.atlas.storm.hook.StormAtlasHookIT
testAddEntities(org.apache.atlas.storm.hook.StormAtlasHookIT)  Time elapsed: 1.124 sec  <<<
FAILURE!
java.lang.RuntimeException: Atlas hook is unable to process the topology.
	at java.net.URLClassLoader.findClass(URLClassLoader.java:381)
	at java.lang.ClassLoader.loadClass(ClassLoader.java:424)
	at sun.misc.Launcher$AppClassLoader.loadClass(Launcher.java:349)
	at java.lang.ClassLoader.loadClass(ClassLoader.java:357)
	at java.lang.Class.forName0(Native Method)
	at java.lang.Class.forName(Class.java:348)
	at org.apache.storm.shade.org.apache.commons.io.input.ClassLoaderObjectInputStream.resolveClass(ClassLoaderObjectInputStream.java:68)
	at java.io.ObjectInputStream.readNonProxyDesc(ObjectInputStream.java:1866)
	at java.io.ObjectInputStream.readClassDesc(ObjectInputStream.java:1749)
	at java.io.ObjectInputStream.readOrdinaryObject(ObjectInputStream.java:2040)
	at java.io.ObjectInputStream.readObject0(ObjectInputStream.java:1571)
	at java.io.ObjectInputStream.readObject(ObjectInputStream.java:431)
	at org.apache.storm.utils.Utils.javaDeserialize(Utils.java:175)
	at org.apache.atlas.storm.hook.StormAtlasHook.addTopologyInputs(StormAtlasHook.java:143)
	at org.apache.atlas.storm.hook.StormAtlasHook.addTopologyDataSets(StormAtlasHook.java:130)
	at org.apache.atlas.storm.hook.StormAtlasHook.notify(StormAtlasHook.java:87)
	at sun.reflect.NativeMethodAccessorImpl.invoke0(Native Method)
	at sun.reflect.NativeMethodAccessorImpl.invoke(NativeMethodAccessorImpl.java:62)
	at sun.reflect.DelegatingMethodAccessorImpl.invoke(DelegatingMethodAccessorImpl.java:43)
	at java.lang.reflect.Method.invoke(Method.java:498)
	at clojure.lang.Reflector.invokeMatchingMethod(Reflector.java:93)
	at clojure.lang.Reflector.invokeInstanceMethod(Reflector.java:28)
	at org.apache.storm.LocalCluster$submit_hook.invoke(LocalCluster.clj:45)
	at org.apache.storm.LocalCluster$_submitTopology.invoke(LocalCluster.clj:52)
	at org.apache.storm.LocalCluster.submitTopology(Unknown Source)
	at org.apache.atlas.storm.hook.StormTestUtil.submitTopology(StormTestUtil.java:67)
	at org.apache.atlas.storm.hook.StormAtlasHookIT.testAddEntities(StormAtlasHookIT.java:75)


Results :

Failed tests: 
  StormAtlasHookIT.testAddEntities:75 » Runtime Atlas hook is unable to process ...

Tests run: 1, Failures: 1, Errors: 0, Skipped: 0

[INFO] 
[INFO] --- jetty-maven-plugin:9.2.12.v20150709:stop (stop-jetty) @ storm-bridge ---
[INFO] Waiting 10 seconds for jetty to stop
[INFO] Stopped ServerConnector@6f54396a{HTTP/1.1}{0.0.0.0:31000}
[INFO] Closing Spring root WebApplicationContext
2018-08-16 17:39:12,057 DEBUG - [ShutdownMonitor:] ~ ==> AtlasAuthorizationFilter destroy
(AtlasAuthorizationFilter:78)
2018-08-16 17:39:12,058 DEBUG - [ShutdownMonitor:] ~ ==> +SimpleAtlasAuthorizer cleanUp
(SimpleAtlasAuthorizer:327)
2018-08-16 17:39:12,059 DEBUG - [ShutdownMonitor:] ~ <== +SimpleAtlasAuthorizer cleanUp
(SimpleAtlasAuthorizer:338)
2018-08-16 17:39:12,060 INFO  - [ShutdownMonitor:] ~ Stopping service org.apache.atlas.notification.NotificationHookConsumer
(Services:69)
2018-08-16 17:39:12,060 INFO  - [ShutdownMonitor:] ~ ==> stopConsumerThreads() (NotificationHookConsumer:185)
2018-08-16 17:39:12,061 INFO  - [ShutdownMonitor:] ~ ==> HookConsumer shutdown() (NotificationHookConsumer$HookConsumer:560)
2018-08-16 17:39:12,062 INFO  - [ShutdownMonitor:] ~ [atlas-hook-consumer-thread], Shutting
down (Logging$class:68)
2018-08-16 17:39:12,063 INFO  - [NotificationHookConsumer thread-0:] ~ closing NotificationConsumer
(NotificationHookConsumer$HookConsumer:325)
2018-08-16 17:39:12,069 INFO  - [NotificationHookConsumer thread-0:] ~ <== HookConsumer
doWork() (NotificationHookConsumer$HookConsumer:329)
2018-08-16 17:39:12,070 INFO  - [ShutdownMonitor:] ~ [atlas-hook-consumer-thread], Shutdown
completed (Logging$class:68)
2018-08-16 17:39:12,071 INFO  - [ShutdownMonitor:] ~ <== HookConsumer shutdown() (NotificationHookConsumer$HookConsumer:575)
2018-08-16 17:39:12,071 INFO  - [ShutdownMonitor:] ~ <== stopConsumerThreads() (NotificationHookConsumer:194)
2018-08-16 17:39:12,071 INFO  - [NotificationHookConsumer thread-0:] ~ [atlas-hook-consumer-thread],
Stopped  (Logging$class:68)
2018-08-16 17:39:12,072 INFO  - [ShutdownMonitor:] ~ ==> KafkaNotification.close() (KafkaNotification:163)
2018-08-16 17:39:12,073 INFO  - [ShutdownMonitor:] ~ <== KafkaNotification.close() (KafkaNotification:171)
2018-08-16 17:39:12,073 INFO  - [ShutdownMonitor:] ~ Stopping service org.apache.atlas.kafka.KafkaNotification
(Services:69)
2018-08-16 17:39:12,073 INFO  - [ShutdownMonitor:] ~ ==> KafkaNotification.stop() (KafkaNotification:135)
2018-08-16 17:39:12,073 INFO  - [ShutdownMonitor:] ~ <== KafkaNotification.stop() (KafkaNotification:137)
2018-08-16 17:39:12,075 INFO  - [ShutdownMonitor:] ~ Stopping service org.apache.atlas.kafka.EmbeddedKafkaServer
(Services:69)
2018-08-16 17:39:12,075 INFO  - [ShutdownMonitor:] ~ ==> EmbeddedKafkaServer.stop(isEmbedded=true)
(EmbeddedKafkaServer:91)
2018-08-16 17:39:12,536 DEBUG - [main-SendThread(localhost:19026):] ~ ==> InMemoryJAASConfiguration.getAppConfigurationEntry(Client)
(InMemoryJAASConfiguration:208)
2018-08-16 17:39:12,537 DEBUG - [main-SendThread(localhost:19026):] ~ <== InMemoryJAASConfiguration.getAppConfigurationEntry(Client):
{} (InMemoryJAASConfiguration:238)
2018-08-16 17:39:12,639 INFO  - [ShutdownMonitor:] ~ <== EmbeddedKafka.stop(isEmbedded=true)
(EmbeddedKafkaServer:101)
2018-08-16 17:39:12,639 INFO  - [ShutdownMonitor:] ~ Stopping service org.apache.atlas.web.service.ActiveInstanceElectorService
(Services:69)
2018-08-16 17:39:12,639 INFO  - [ShutdownMonitor:] ~ HA is not enabled, no need to stop leader
election service (ActiveInstanceElectorService:126)
[INFO] Shutting down log4j
[INFO] Not cleaning cached beans: no such field javax.el.BeanELResolver.properties
[INFO] Stopped o.e.j.m.p.JettyWebAppContext@657d8138{/,<https://builds.apache.org/job/PreCommit-ATLAS-Build-Test/ws/webapp/target/atlas-webapp-0.8.3-SNAPSHOT/,UNAVAILABLE}{/home/jenkins/jenkins-slave/workspace/PreCommit-ATLAS-Build-Test/webapp/target/atlas-webapp-0.8.3-SNAPSHOT.war}>
[INFO] Server reports itself as stopped
[INFO] 
[INFO] --- maven-source-plugin:2.4:jar-no-fork (attach-sources) @ storm-bridge ---
[INFO] Building jar: <https://builds.apache.org/job/PreCommit-ATLAS-Build-Test/ws/addons/storm-bridge/target/storm-bridge-0.8.3-SNAPSHOT-sources.jar>
log4j:WARN No appenders could be found for logger (org.apache.atlas.security.InMemoryJAASConfiguration).
log4j:WARN Please initialize the log4j system properly.
log4j:WARN See http://logging.apache.org/log4j/1.2/faq.html#noconfig for more info.
[INFO] 
[INFO] --- maven-source-plugin:2.4:test-jar-no-fork (attach-sources) @ storm-bridge ---
[INFO] Building jar: <https://builds.apache.org/job/PreCommit-ATLAS-Build-Test/ws/addons/storm-bridge/target/storm-bridge-0.8.3-SNAPSHOT-test-sources.jar>
[INFO] 
[INFO] --- maven-failsafe-plugin:2.18.1:verify (verify) @ storm-bridge ---
[INFO] Failsafe report directory: <https://builds.apache.org/job/PreCommit-ATLAS-Build-Test/ws/addons/storm-bridge/target/failsafe-reports>
[INFO] ------------------------------------------------------------------------
[INFO] Reactor Summary:
[INFO] 
[INFO] Apache Atlas Server Build Tools 1.0 ................ SUCCESS [  1.480 s]
[INFO] apache-atlas 0.8.3-SNAPSHOT ........................ SUCCESS [  4.338 s]
[INFO] Apache Atlas Integration ........................... SUCCESS [ 17.623 s]
[INFO] Apache Atlas Common ................................ SUCCESS [  2.485 s]
[INFO] Apache Atlas Typesystem ............................ SUCCESS [ 46.044 s]
[INFO] Apache Atlas Client ................................ SUCCESS [  0.168 s]
[INFO] atlas-client-common ................................ SUCCESS [  0.911 s]
[INFO] atlas-client-v1 .................................... SUCCESS [  3.964 s]
[INFO] Apache Atlas Server API ............................ SUCCESS [  0.995 s]
[INFO] Apache Atlas Notification .......................... SUCCESS [ 12.961 s]
[INFO] atlas-client-v2 .................................... SUCCESS [  0.947 s]
[INFO] Apache Atlas Graph Database Projects ............... SUCCESS [  0.174 s]
[INFO] Apache Atlas Graph Database API .................... SUCCESS [  0.617 s]
[INFO] Graph Database Common Code ......................... SUCCESS [  0.722 s]
[INFO] Apache Atlas Titan 1.0.0 GraphDB Impl .............. SUCCESS [ 30.811 s]
[INFO] Shaded version of Apache hbase client .............. SUCCESS [  8.028 s]
[INFO] Apache Atlas Titan 0.5.4 Graph DB Impl ............. SUCCESS [01:06 min]
[INFO] Apache Atlas Graph Database Implementation Dependencies SUCCESS [  0.299 s]
[INFO] Shaded version of Apache hbase server .............. SUCCESS [ 24.044 s]
[INFO] Apache Atlas Repository ............................ SUCCESS [08:58 min]
[INFO] Apache Atlas Authorization ......................... SUCCESS [  1.862 s]
[INFO] Apache Atlas Business Catalog ...................... SUCCESS [  6.825 s]
[INFO] Apache Atlas UI .................................... SUCCESS [01:36 min]
[INFO] Apache Atlas Web Application ....................... SUCCESS [08:41 min]
[INFO] Apache Atlas Documentation ......................... SUCCESS [  4.795 s]
[INFO] Apache Atlas FileSystem Model ...................... SUCCESS [  2.043 s]
[INFO] Apache Atlas Plugin Classloader .................... SUCCESS [  2.700 s]
[INFO] Apache Atlas Hive Bridge Shim ...................... SUCCESS [  2.081 s]
[INFO] Apache Atlas Hive Bridge ........................... SUCCESS [08:37 min]
[INFO] Apache Atlas Falcon Bridge Shim .................... SUCCESS [  2.633 s]
[INFO] Apache Atlas Falcon Bridge ......................... SUCCESS [01:40 min]
[INFO] Apache Atlas Sqoop Bridge Shim ..................... SUCCESS [  0.531 s]
[INFO] Apache Atlas Sqoop Bridge .......................... SUCCESS [01:47 min]
[INFO] Apache Atlas Storm Bridge Shim ..................... SUCCESS [  1.013 s]
[INFO] Apache Atlas Storm Bridge .......................... FAILURE [01:40 min]
[INFO] Apache Atlas Hbase Bridge Shim ..................... SKIPPED
[INFO] Apache Atlas Hbase Bridge .......................... SKIPPED
[INFO] Apache Atlas Migration Exporter .................... SKIPPED
[INFO] Apache Atlas Distribution 0.8.3-SNAPSHOT ........... SKIPPED
[INFO] ------------------------------------------------------------------------
[INFO] BUILD FAILURE
[INFO] ------------------------------------------------------------------------
[INFO] Total time: 37:11 min
[INFO] Finished at: 2018-08-16T17:39:12Z
[INFO] ------------------------------------------------------------------------
[ERROR] Failed to execute goal org.apache.maven.plugins:maven-failsafe-plugin:2.18.1:verify
(verify) on project storm-bridge: There are test failures.
[ERROR] 
[ERROR] Please refer to <https://builds.apache.org/job/PreCommit-ATLAS-Build-Test/ws/addons/storm-bridge/target/failsafe-reports>
for the individual test results.
[ERROR] -> [Help 1]
[ERROR] 
[ERROR] To see the full stack trace of the errors, re-run Maven with the -e switch.
[ERROR] Re-run Maven using the -X switch to enable full debug logging.
[ERROR] 
[ERROR] For more information about the errors and possible solutions, please read the following
articles:
[ERROR] [Help 1] http://cwiki.apache.org/confluence/display/MAVEN/MojoFailureException
[ERROR] 
[ERROR] After correcting the problems, you can resume the build with the command
[ERROR]   mvn <goals> -rf :storm-bridge




{color:red}-1 overall{color}.  

    {color:green}+1 @author{color}.  The patch does not contain any @author tags.

Console output: https://builds.apache.org/job/PreCommit-ATLAS-Build-Test/590//console

This message is automatically generated.


======================================================================
======================================================================
    Adding comment to Jira.
======================================================================
======================================================================




======================================================================
======================================================================
    Finished build.
======================================================================
======================================================================


+ EXIT_CODE=1
+ '[' -d <https://builds.apache.org/job/PreCommit-ATLAS-Build-Test/ws/../atlas_patchprocess_21649>
']'
+ '[' -d <https://builds.apache.org/job/PreCommit-ATLAS-Build-Test/ws/atlas_patchprocess_21649>
']'
+ mv <https://builds.apache.org/job/PreCommit-ATLAS-Build-Test/ws/atlas_patchprocess_21649>
<https://builds.apache.org/job/PreCommit-ATLAS-Build-Test/ws/patchprocess>
+ rm -f <https://builds.apache.org/job/PreCommit-ATLAS-Build-Test/ws/../atlas_patchprocess_21649>
+ exit 1
Build step 'Execute shell' marked build as failure
Set build name.
New build name is '#590-branch-0.8-ATLAS-2355-branch-0.8.patch'
Archiving artifacts
[Fast Archiver] Compressed 203.51 MB of artifacts by 16.6% relative to #588

Mime
View raw message