atlas-dev mailing list archives

Site index · List index
Message view « Date » · « Thread »
Top « Date » · « Thread »
From Apache Jenkins Server <jenk...@builds.apache.org>
Subject Build failed in Jenkins: Atlas-1.0-AllTests #888
Date Mon, 27 Aug 2018 16:00:21 GMT
See <https://builds.apache.org/job/Atlas-1.0-AllTests/888/display/redirect>

------------------------------------------
[...truncated 212.74 KB...]
Running org.apache.atlas.repository.store.graph.v2.InverseReferenceUpdateHardDeleteV2Test
Running org.apache.atlas.TestModules
Running org.apache.atlas.repository.store.graph.v2.AtlasRelationshipStoreHardDeleteV2Test
Running org.apache.atlas.query.DSLParsingTest
Running org.apache.atlas.repository.store.graph.v2.InverseReferenceUpdateV2Test
Running org.apache.atlas.repository.store.graph.v2.AtlasEntityDefStoreV2Test
Running org.apache.atlas.repository.migration.MigrationProgressServiceTest
Running org.apache.atlas.utils.TestResourceFileUtils
Running org.apache.atlas.repository.store.graph.v2.AtlasComplexAttributesTest
Running org.apache.atlas.repository.store.graph.v2.AtlasRelationshipDefStoreV2Test
Running org.apache.atlas.repository.tagpropagation.ClassificationPropagationTest
Running org.apache.atlas.repository.migration.ComplexAttributesTest
Running org.apache.atlas.repository.migration.PathTest
Running org.apache.atlas.query.DSLQueriesTest
Running org.apache.atlas.repository.migration.TypesWithCollectionsFinderTest
Running org.apache.atlas.repository.migration.HiveParititionTest
Running org.apache.atlas.repository.store.graph.v2.AtlasEntityStoreV2Test
Running org.apache.atlas.repository.migration.TypesWithClassificationTest
Running org.apache.atlas.repository.store.graph.v2.AtlasRelationshipStoreSoftDeleteV2Test
Tests run: 0, Failures: 0, Errors: 0, Skipped: 0, Time elapsed: 3.462 sec - in org.apache.atlas.TestModules
Tests run: 20, Failures: 0, Errors: 0, Skipped: 0, Time elapsed: 3.953 sec - in org.apache.atlas.glossary.PaginationHelperTest
Tests run: 0, Failures: 0, Errors: 0, Skipped: 0, Time elapsed: 3.203 sec - in org.apache.atlas.utils.TestResourceFileUtils
Tests run: 0, Failures: 0, Errors: 0, Skipped: 0, Time elapsed: 4.364 sec - in org.apache.atlas.repository.store.graph.v2.AtlasRelationshipStoreV2Test
Tests run: 0, Failures: 0, Errors: 0, Skipped: 0, Time elapsed: 3.822 sec - in org.apache.atlas.repository.store.graph.v2.InverseReferenceUpdateV2Test
Tests run: 6, Failures: 0, Errors: 0, Skipped: 0, Time elapsed: 4.645 sec - in org.apache.atlas.repository.audit.InMemoryAuditRepositoryTest
Running org.apache.atlas.repository.userprofile.UserProfileServiceTest
Running org.apache.atlas.repository.impexp.ZipSinkTest
Running org.apache.atlas.repository.impexp.AtlasImportRequestTest
Running org.apache.atlas.repository.migration.HiveStocksTest
Running org.apache.atlas.repository.impexp.ExportServiceTest
Tests run: 9, Failures: 0, Errors: 0, Skipped: 0, Time elapsed: 8.147 sec - in org.apache.atlas.repository.store.graph.v2.AtlasEntityStoreV2BulkImportPercentTest
Running org.apache.atlas.repository.impexp.ImportServiceTest
Tests run: 9, Failures: 0, Errors: 0, Skipped: 0, Time elapsed: 8.864 sec - in org.apache.atlas.utils.ObjectUpdateSynchronizerTest
Tests run: 8, Failures: 0, Errors: 0, Skipped: 0, Time elapsed: 8.714 sec - in org.apache.atlas.query.DSLParsingTest
Tests run: 1, Failures: 0, Errors: 0, Skipped: 0, Time elapsed: 10.01 sec - in org.apache.atlas.repository.migration.TypesDefScrubberTest
Running org.apache.atlas.repository.impexp.ImportTransformerTest
Running org.apache.atlas.repository.impexp.TypeAttributeDifferenceTest
Running org.apache.atlas.repository.impexp.ImportTransformsTest
Tests run: 4, Failures: 0, Errors: 0, Skipped: 0, Time elapsed: 12.405 sec - in org.apache.atlas.repository.migration.MigrationProgressServiceTest
Tests run: 8, Failures: 0, Errors: 0, Skipped: 0, Time elapsed: 2.96 sec - in org.apache.atlas.repository.impexp.ImportTransformerTest
Running org.apache.atlas.repository.impexp.UniqueListTest
Tests run: 6, Failures: 0, Errors: 0, Skipped: 0, Time elapsed: 7.611 sec - in org.apache.atlas.repository.impexp.AtlasImportRequestTest
Tests run: 8, Failures: 0, Errors: 0, Skipped: 0, Time elapsed: 8.472 sec - in org.apache.atlas.repository.impexp.ZipSinkTest
Running org.apache.atlas.repository.impexp.ImportTransformerJSONTest
Tests run: 4, Failures: 0, Errors: 0, Skipped: 0, Time elapsed: 2.316 sec - in org.apache.atlas.repository.impexp.UniqueListTest
Running org.apache.atlas.repository.impexp.ZipSourceTest
Tests run: 6, Failures: 0, Errors: 0, Skipped: 0, Time elapsed: 5.906 sec - in org.apache.atlas.repository.impexp.TypeAttributeDifferenceTest
Tests run: 3, Failures: 0, Errors: 0, Skipped: 0, Time elapsed: 6.405 sec - in org.apache.atlas.repository.impexp.ImportTransformsTest
Tests run: 1, Failures: 0, Errors: 0, Skipped: 0, Time elapsed: 6.553 sec - in org.apache.atlas.repository.impexp.ImportTransformerJSONTest
Tests run: 6, Failures: 0, Errors: 0, Skipped: 0, Time elapsed: 6.151 sec - in org.apache.atlas.repository.impexp.ZipSourceTest
Tests run: 39, Failures: 0, Errors: 0, Skipped: 0, Time elapsed: 30.821 sec - in org.apache.atlas.query.GremlinQueryComposerTest
Tests run: 6, Failures: 0, Errors: 0, Skipped: 0, Time elapsed: 41.953 sec - in org.apache.atlas.repository.audit.CassandraAuditRepositoryTest
Tests run: 1, Failures: 0, Errors: 0, Skipped: 0, Time elapsed: 50.907 sec - in org.apache.atlas.services.MetricsServiceTest
Tests run: 10, Failures: 0, Errors: 0, Skipped: 0, Time elapsed: 72.838 sec - in org.apache.atlas.repository.store.graph.v2.AtlasRelationshipDefStoreV2Test
Tests run: 1, Failures: 0, Errors: 0, Skipped: 0, Time elapsed: 73.82 sec - in org.apache.atlas.repository.store.graph.v2.AtlasEntityDefStoreV2Test
Tests run: 1, Failures: 0, Errors: 0, Skipped: 0, Time elapsed: 99.538 sec - in org.apache.atlas.repository.migration.RelationshipCacheGeneratorTest
Tests run: 4, Failures: 0, Errors: 0, Skipped: 0, Time elapsed: 104.994 sec - in org.apache.atlas.repository.store.graph.v2.AtlasRelationshipStoreHardDeleteV2Test
Tests run: 4, Failures: 0, Errors: 0, Skipped: 0, Time elapsed: 105.556 sec - in org.apache.atlas.repository.store.graph.v2.AtlasRelationshipStoreSoftDeleteV2Test
Tests run: 1, Failures: 0, Errors: 0, Skipped: 0, Time elapsed: 106.979 sec - in org.apache.atlas.repository.migration.TypesWithCollectionsFinderTest
Tests run: 5, Failures: 0, Errors: 0, Skipped: 0, Time elapsed: 110.047 sec - in org.apache.atlas.repository.store.graph.v2.InverseReferenceUpdateSoftDeleteV2Test
Tests run: 7, Failures: 0, Errors: 0, Skipped: 0, Time elapsed: 115.721 sec - in org.apache.atlas.repository.store.graph.v2.AtlasComplexAttributesTest
Tests run: 5, Failures: 4, Errors: 0, Skipped: 0, Time elapsed: 109.028 sec <<< FAILURE!
- in org.apache.atlas.repository.store.graph.v2.InverseReferenceUpdateHardDeleteV2Test
testInverseReferenceAutoUpdate_Map(org.apache.atlas.repository.store.graph.v2.InverseReferenceUpdateHardDeleteV2Test)
 Time elapsed: 4.041 sec  <<< FAILURE!
java.lang.AssertionError: expected [null] but found [AtlasObjectId{guid='feb764d8-7b1f-48a3-a843-4906a5aa933d',
typeName='A', uniqueAttributes={}}]
	at org.testng.Assert.fail(Assert.java:94)
	at org.testng.Assert.failNotSame(Assert.java:492)
	at org.testng.Assert.assertNull(Assert.java:428)
	at org.testng.Assert.assertNull(Assert.java:417)
	at org.apache.atlas.repository.store.graph.v2.InverseReferenceUpdateV2Test.verifyReferenceValue(InverseReferenceUpdateV2Test.java:362)
	at org.apache.atlas.repository.store.graph.v2.InverseReferenceUpdateHardDeleteV2Test.verify_testInverseReferenceAutoUpdate_Map(InverseReferenceUpdateHardDeleteV2Test.java:72)

testInverseReferenceAutoUpdate_NonCompositeManyToOne(org.apache.atlas.repository.store.graph.v2.InverseReferenceUpdateHardDeleteV2Test)
 Time elapsed: 2.054 sec  <<< FAILURE!
java.lang.AssertionError: expected [null] but found [AtlasObjectId{guid='0c33f4e3-6d4c-497d-bf9b-5976eab48521',
typeName='B', uniqueAttributes={}}]
	at org.testng.Assert.fail(Assert.java:94)
	at org.testng.Assert.failNotSame(Assert.java:492)
	at org.testng.Assert.assertNull(Assert.java:428)
	at org.testng.Assert.assertNull(Assert.java:417)
	at org.apache.atlas.repository.store.graph.v2.InverseReferenceUpdateV2Test.verifyReferenceValue(InverseReferenceUpdateV2Test.java:362)
	at org.apache.atlas.repository.store.graph.v2.InverseReferenceUpdateHardDeleteV2Test.verify_testInverseReferenceAutoUpdate_NonCompositeManyToOne(InverseReferenceUpdateHardDeleteV2Test.java:49)

testInverseReferenceAutoUpdate_NonComposite_OneToMany(org.apache.atlas.repository.store.graph.v2.InverseReferenceUpdateHardDeleteV2Test)
 Time elapsed: 0.884 sec  <<< FAILURE!
java.lang.AssertionError: expected [1] but found [2]
	at org.testng.Assert.fail(Assert.java:94)
	at org.testng.Assert.failNotEquals(Assert.java:496)
	at org.testng.Assert.assertEquals(Assert.java:125)
	at org.testng.Assert.assertEquals(Assert.java:372)
	at org.testng.Assert.assertEquals(Assert.java:382)
	at org.apache.atlas.repository.store.graph.v2.InverseReferenceUpdateV2Test.verifyReferenceList(InverseReferenceUpdateV2Test.java:375)
	at org.apache.atlas.repository.store.graph.v2.InverseReferenceUpdateHardDeleteV2Test.verify_testInverseReferenceAutoUpdate_NonComposite_OneToMany(InverseReferenceUpdateHardDeleteV2Test.java:43)

testInverseReferenceAutoUpdate_NonComposite_OneToOne(org.apache.atlas.repository.store.graph.v2.InverseReferenceUpdateHardDeleteV2Test)
 Time elapsed: 1.559 sec  <<< FAILURE!
java.lang.AssertionError: expected [null] but found [AtlasObjectId{guid='d116e60b-45fe-47ec-870f-683f303bcc9b',
typeName='B', uniqueAttributes={}}]
	at org.testng.Assert.fail(Assert.java:94)
	at org.testng.Assert.failNotSame(Assert.java:492)
	at org.testng.Assert.assertNull(Assert.java:428)
	at org.testng.Assert.assertNull(Assert.java:417)
	at org.apache.atlas.repository.store.graph.v2.InverseReferenceUpdateV2Test.verifyReferenceValue(InverseReferenceUpdateV2Test.java:362)
	at org.apache.atlas.repository.store.graph.v2.InverseReferenceUpdateHardDeleteV2Test.verify_testInverseReferenceAutoUpdate_NonComposite_OneToOne(InverseReferenceUpdateHardDeleteV2Test.java:59)

Tests run: 12, Failures: 0, Errors: 0, Skipped: 0, Time elapsed: 119.162 sec - in org.apache.atlas.repository.userprofile.UserProfileServiceTest
Tests run: 12, Failures: 0, Errors: 0, Skipped: 0, Time elapsed: 121.905 sec - in org.apache.atlas.repository.impexp.ExportServiceTest
Tests run: 18, Failures: 0, Errors: 0, Skipped: 0, Time elapsed: 130.12 sec - in org.apache.atlas.repository.store.graph.AtlasTypeDefGraphStoreTest
Tests run: 1, Failures: 0, Errors: 0, Skipped: 0, Time elapsed: 127.946 sec - in org.apache.atlas.repository.migration.PathTest
Tests run: 1, Failures: 0, Errors: 0, Skipped: 0, Time elapsed: 128.69 sec - in org.apache.atlas.repository.migration.TypesWithClassificationTest
Tests run: 1, Failures: 0, Errors: 0, Skipped: 0, Time elapsed: 129.158 sec - in org.apache.atlas.repository.migration.HiveParititionTest
Tests run: 1, Failures: 0, Errors: 0, Skipped: 0, Time elapsed: 131.968 sec - in org.apache.atlas.repository.migration.ComplexAttributesTest
Tests run: 16, Failures: 1, Errors: 0, Skipped: 0, Time elapsed: 133.016 sec <<<
FAILURE! - in org.apache.atlas.repository.store.graph.v2.AtlasEntityStoreV2Test
testMapOfPrimitivesUpdate(org.apache.atlas.repository.store.graph.v2.AtlasEntityStoreV2Test)
 Time elapsed: 0.128 sec  <<< FAILURE!
java.lang.AssertionError: expected [1] but found [2]
	at org.testng.Assert.fail(Assert.java:94)
	at org.testng.Assert.failNotEquals(Assert.java:496)
	at org.testng.Assert.assertEquals(Assert.java:125)
	at org.testng.Assert.assertEquals(Assert.java:372)
	at org.testng.Assert.assertEquals(Assert.java:382)
	at org.apache.atlas.repository.store.graph.v2.AtlasEntityTestBase.validateMutationResponse(AtlasEntityTestBase.java:144)
	at org.apache.atlas.repository.store.graph.v2.AtlasEntityStoreV2Test.testMapOfPrimitivesUpdate(AtlasEntityStoreV2Test.java:404)

Tests run: 1, Failures: 0, Errors: 0, Skipped: 0, Time elapsed: 129.27 sec - in org.apache.atlas.repository.migration.HiveStocksTest
Tests run: 35, Failures: 0, Errors: 0, Skipped: 0, Time elapsed: 141.291 sec - in org.apache.atlas.glossary.GlossaryServiceTest
Tests run: 14, Failures: 0, Errors: 0, Skipped: 0, Time elapsed: 158.873 sec - in org.apache.atlas.repository.impexp.ImportServiceTest
Tests run: 11, Failures: 0, Errors: 0, Skipped: 0, Time elapsed: 190.429 sec - in org.apache.atlas.repository.tagpropagation.ClassificationPropagationTest
Tests run: 246, Failures: 0, Errors: 0, Skipped: 0, Time elapsed: 448.568 sec - in org.apache.atlas.query.DSLQueriesTest

Results :

Failed tests: 
  AtlasEntityStoreV2Test.testMapOfPrimitivesUpdate:404->AtlasEntityTestBase.validateMutationResponse:144
expected [1] but found [2]
  InverseReferenceUpdateHardDeleteV2Test>InverseReferenceUpdateV2Test.testInverseReferenceAutoUpdate_Map:354->verify_testInverseReferenceAutoUpdate_Map:72->InverseReferenceUpdateV2Test.verifyReferenceValue:362
expected [null] but found [AtlasObjectId{guid='feb764d8-7b1f-48a3-a843-4906a5aa933d', typeName='A',
uniqueAttributes={}}]
  InverseReferenceUpdateHardDeleteV2Test>InverseReferenceUpdateV2Test.testInverseReferenceAutoUpdate_NonCompositeManyToOne:201->verify_testInverseReferenceAutoUpdate_NonCompositeManyToOne:49->InverseReferenceUpdateV2Test.verifyReferenceValue:362
expected [null] but found [AtlasObjectId{guid='0c33f4e3-6d4c-497d-bf9b-5976eab48521', typeName='B',
uniqueAttributes={}}]
  InverseReferenceUpdateHardDeleteV2Test>InverseReferenceUpdateV2Test.testInverseReferenceAutoUpdate_NonComposite_OneToMany:141->verify_testInverseReferenceAutoUpdate_NonComposite_OneToMany:43->InverseReferenceUpdateV2Test.verifyReferenceList:375
expected [1] but found [2]
  InverseReferenceUpdateHardDeleteV2Test>InverseReferenceUpdateV2Test.testInverseReferenceAutoUpdate_NonComposite_OneToOne:255->verify_testInverseReferenceAutoUpdate_NonComposite_OneToOne:59->InverseReferenceUpdateV2Test.verifyReferenceValue:362
expected [null] but found [AtlasObjectId{guid='d116e60b-45fe-47ec-870f-683f303bcc9b', typeName='B',
uniqueAttributes={}}]

Tests run: 552, Failures: 5, Errors: 0, Skipped: 0

[INFO] ------------------------------------------------------------------------
[INFO] Reactor Summary:
[INFO] 
[INFO] Apache Atlas Server Build Tools 1.0 ................ SUCCESS [  0.893 s]
[INFO] apache-atlas 1.1.0-SNAPSHOT ........................ SUCCESS [  4.879 s]
[INFO] Apache Atlas Test Utility Tools .................... SUCCESS [ 12.611 s]
[INFO] Apache Atlas Integration ........................... SUCCESS [01:00 min]
[INFO] Apache Atlas Common ................................ SUCCESS [  9.718 s]
[INFO] Apache Atlas Client ................................ SUCCESS [  0.740 s]
[INFO] atlas-client-common ................................ SUCCESS [  7.363 s]
[INFO] atlas-client-v1 .................................... SUCCESS [  8.882 s]
[INFO] Apache Atlas Server API ............................ SUCCESS [  6.169 s]
[INFO] Apache Atlas Notification .......................... SUCCESS [ 24.120 s]
[INFO] atlas-client-v2 .................................... SUCCESS [  6.501 s]
[INFO] Apache Atlas Graph Database Projects ............... SUCCESS [  0.483 s]
[INFO] Apache Atlas Graph Database API .................... SUCCESS [  5.287 s]
[INFO] Graph Database Common Code ......................... SUCCESS [  7.043 s]
[INFO] Apache Atlas JanusGraph DB Impl .................... SUCCESS [02:38 min]
[INFO] Apache Atlas Graph Database Implementation Dependencies SUCCESS [  2.552 s]
[INFO] Shaded version of Apache hbase client .............. SUCCESS [  9.322 s]
[INFO] Shaded version of Apache hbase server .............. SUCCESS [ 24.119 s]
[INFO] Apache Atlas Authorization ......................... SUCCESS [ 12.298 s]
[INFO] Apache Atlas Repository ............................ FAILURE [07:44 min]
[INFO] Apache Atlas UI .................................... SKIPPED
[INFO] Apache Atlas Web Application ....................... SKIPPED
[INFO] Apache Atlas Documentation ......................... SKIPPED
[INFO] Apache Atlas FileSystem Model ...................... SKIPPED
[INFO] Apache Atlas Plugin Classloader .................... SKIPPED
[INFO] Apache Atlas Hive Bridge Shim ...................... SKIPPED
[INFO] Apache Atlas Hive Bridge ........................... SKIPPED
[INFO] Apache Atlas Falcon Bridge Shim .................... SKIPPED
[INFO] Apache Atlas Falcon Bridge ......................... SKIPPED
[INFO] Apache Atlas Sqoop Bridge Shim ..................... SKIPPED
[INFO] Apache Atlas Sqoop Bridge .......................... SKIPPED
[INFO] Apache Atlas Storm Bridge Shim ..................... SKIPPED
[INFO] Apache Atlas Storm Bridge .......................... SKIPPED
[INFO] Apache Atlas Hbase Bridge Shim ..................... SKIPPED
[INFO] Apache Atlas Hbase Bridge .......................... SKIPPED
[INFO] Apache Atlas Kafka Bridge .......................... SKIPPED
[INFO] Apache Atlas Distribution 1.1.0-SNAPSHOT ........... SKIPPED
[INFO] ------------------------------------------------------------------------
[INFO] BUILD FAILURE
[INFO] ------------------------------------------------------------------------
[INFO] Total time: 13:48 min
[INFO] Finished at: 2018-08-27T15:53:58Z
[INFO] ------------------------------------------------------------------------
[ERROR] Failed to execute goal org.apache.maven.plugins:maven-surefire-plugin:2.18.1:test
(default-test) on project atlas-repository: There are test failures.
[ERROR] 
[ERROR] Please refer to <https://builds.apache.org/job/Atlas-1.0-AllTests/ws/repository/target/surefire-reports>
for the individual test results.
[ERROR] -> [Help 1]
[ERROR] 
[ERROR] To see the full stack trace of the errors, re-run Maven with the -e switch.
[ERROR] Re-run Maven using the -X switch to enable full debug logging.
[ERROR] 
[ERROR] For more information about the errors and possible solutions, please read the following
articles:
[ERROR] [Help 1] http://cwiki.apache.org/confluence/display/MAVEN/MojoFailureException
[ERROR] 
[ERROR] After correcting the problems, you can resume the build with the command
[ERROR]   mvn <goals> -rf :atlas-repository
Build step 'Execute shell' marked build as failure
[CHECKSTYLE] Collecting checkstyle analysis files...
[CHECKSTYLE] Searching for all files in <https://builds.apache.org/job/Atlas-1.0-AllTests/ws/>
that match the pattern **/target/checkstyle-result.xml
[CHECKSTYLE] Parsing 18 files in <https://builds.apache.org/job/Atlas-1.0-AllTests/ws/>
[CHECKSTYLE] Successfully parsed file <https://builds.apache.org/job/Atlas-1.0-AllTests/ws/authorization/target/checkstyle-result.xml>
with 973 unique warnings and 0 duplicates.
[CHECKSTYLE] Successfully parsed file <https://builds.apache.org/job/Atlas-1.0-AllTests/ws/client/client-v1/target/checkstyle-result.xml>
with 1872 unique warnings and 0 duplicates.
[CHECKSTYLE] Successfully parsed file <https://builds.apache.org/job/Atlas-1.0-AllTests/ws/client/client-v2/target/checkstyle-result.xml>
with 2231 unique warnings and 0 duplicates.
[CHECKSTYLE] Successfully parsed file <https://builds.apache.org/job/Atlas-1.0-AllTests/ws/client/common/target/checkstyle-result.xml>
with 2723 unique warnings and 0 duplicates.
[CHECKSTYLE] Successfully parsed file <https://builds.apache.org/job/Atlas-1.0-AllTests/ws/client/target/checkstyle-result.xml>
with 2723 unique warnings and 0 duplicates.
[CHECKSTYLE] Successfully parsed file <https://builds.apache.org/job/Atlas-1.0-AllTests/ws/common/target/checkstyle-result.xml>
with 3800 unique warnings and 0 duplicates.
[CHECKSTYLE] Successfully parsed file <https://builds.apache.org/job/Atlas-1.0-AllTests/ws/graphdb/api/target/checkstyle-result.xml>
with 4102 unique warnings and 0 duplicates.
[CHECKSTYLE] Successfully parsed file <https://builds.apache.org/job/Atlas-1.0-AllTests/ws/graphdb/common/target/checkstyle-result.xml>
with 4328 unique warnings and 0 duplicates.
[CHECKSTYLE] Successfully parsed file <https://builds.apache.org/job/Atlas-1.0-AllTests/ws/graphdb/graphdb-impls/target/checkstyle-result.xml>
with 4328 unique warnings and 0 duplicates.
[CHECKSTYLE] Successfully parsed file <https://builds.apache.org/job/Atlas-1.0-AllTests/ws/graphdb/janus/target/checkstyle-result.xml>
with 6654 unique warnings and 0 duplicates.
[CHECKSTYLE] Successfully parsed file <https://builds.apache.org/job/Atlas-1.0-AllTests/ws/graphdb/target/checkstyle-result.xml>
with 6654 unique warnings and 0 duplicates.
[CHECKSTYLE] Successfully parsed file <https://builds.apache.org/job/Atlas-1.0-AllTests/ws/intg/target/checkstyle-result.xml>
with 18753 unique warnings and 0 duplicates.
[CHECKSTYLE] Successfully parsed file <https://builds.apache.org/job/Atlas-1.0-AllTests/ws/notification/target/checkstyle-result.xml>
with 20027 unique warnings and 0 duplicates.
[CHECKSTYLE] Successfully parsed file <https://builds.apache.org/job/Atlas-1.0-AllTests/ws/server-api/target/checkstyle-result.xml>
with 20195 unique warnings and 0 duplicates.
[CHECKSTYLE] Successfully parsed file <https://builds.apache.org/job/Atlas-1.0-AllTests/ws/shaded/hbase-client-shaded/target/checkstyle-result.xml>
with 20195 unique warnings and 0 duplicates.
[CHECKSTYLE] Successfully parsed file <https://builds.apache.org/job/Atlas-1.0-AllTests/ws/shaded/hbase-server-shaded/target/checkstyle-result.xml>
with 20195 unique warnings and 0 duplicates.
[CHECKSTYLE] Successfully parsed file <https://builds.apache.org/job/Atlas-1.0-AllTests/ws/target/checkstyle-result.xml>
with 20195 unique warnings and 0 duplicates.
[CHECKSTYLE] Successfully parsed file <https://builds.apache.org/job/Atlas-1.0-AllTests/ws/test-tools/target/checkstyle-result.xml>
with 20233 unique warnings and 0 duplicates.
<Git Blamer> Using GitBlamer to create author and commit information for all warnings.
<Git Blamer> GIT_COMMIT=5c0a2023ab72f5b02b603d9f94e1590bacfedfbb, workspace=<https://builds.apache.org/job/Atlas-1.0-AllTests/ws/>
 > git rev-parse 5c0a2023ab72f5b02b603d9f94e1590bacfedfbb^{commit} # timeout=10
[CHECKSTYLE] Computing warning deltas based on reference build #883
[FINDBUGS] Collecting findbugs analysis files...
[FINDBUGS] Searching for all files in <https://builds.apache.org/job/Atlas-1.0-AllTests/ws/>
that match the pattern **/target/findbugs.xml
[FINDBUGS] Parsing 12 files in <https://builds.apache.org/job/Atlas-1.0-AllTests/ws/>
[FINDBUGS] Successfully parsed file <https://builds.apache.org/job/Atlas-1.0-AllTests/ws/authorization/target/findbugs.xml>
with 0 unique warnings and 0 duplicates.
[FINDBUGS] Successfully parsed file <https://builds.apache.org/job/Atlas-1.0-AllTests/ws/client/client-v1/target/findbugs.xml>
with 0 unique warnings and 0 duplicates.
[FINDBUGS] Successfully parsed file <https://builds.apache.org/job/Atlas-1.0-AllTests/ws/client/client-v2/target/findbugs.xml>
with 0 unique warnings and 0 duplicates.
[FINDBUGS] Successfully parsed file <https://builds.apache.org/job/Atlas-1.0-AllTests/ws/client/common/target/findbugs.xml>
with 0 unique warnings and 0 duplicates.
[FINDBUGS] Successfully parsed file <https://builds.apache.org/job/Atlas-1.0-AllTests/ws/common/target/findbugs.xml>
with 0 unique warnings and 0 duplicates.
[FINDBUGS] Successfully parsed file <https://builds.apache.org/job/Atlas-1.0-AllTests/ws/graphdb/api/target/findbugs.xml>
with 0 unique warnings and 0 duplicates.
[FINDBUGS] Successfully parsed file <https://builds.apache.org/job/Atlas-1.0-AllTests/ws/graphdb/common/target/findbugs.xml>
with 0 unique warnings and 0 duplicates.
[FINDBUGS] Successfully parsed file <https://builds.apache.org/job/Atlas-1.0-AllTests/ws/graphdb/janus/target/findbugs.xml>
with 0 unique warnings and 0 duplicates.
[FINDBUGS] Successfully parsed file <https://builds.apache.org/job/Atlas-1.0-AllTests/ws/intg/target/findbugs.xml>
with 0 unique warnings and 0 duplicates.
[FINDBUGS] Successfully parsed file <https://builds.apache.org/job/Atlas-1.0-AllTests/ws/notification/target/findbugs.xml>
with 0 unique warnings and 0 duplicates.
[FINDBUGS] Successfully parsed file <https://builds.apache.org/job/Atlas-1.0-AllTests/ws/server-api/target/findbugs.xml>
with 0 unique warnings and 0 duplicates.
[FINDBUGS] Successfully parsed file <https://builds.apache.org/job/Atlas-1.0-AllTests/ws/test-tools/target/findbugs.xml>
with 0 unique warnings and 0 duplicates.
<Git Blamer> Using GitBlamer to create author and commit information for all warnings.
<Git Blamer> GIT_COMMIT=5c0a2023ab72f5b02b603d9f94e1590bacfedfbb, workspace=<https://builds.apache.org/job/Atlas-1.0-AllTests/ws/>
[FINDBUGS] Computing warning deltas based on reference build #883
Archiving artifacts
TestNG Reports Processing: START
Looking for TestNG results report in workspace using pattern: **/target/surefire-reports/testng-results.xml,**/target/failsafe-reports/testng-results.xml
Saving reports...
Processing '/x1/jenkins/jenkins-home/jobs/Atlas-1.0-AllTests/builds/888/testng/testng-results-1.xml'
Processing '/x1/jenkins/jenkins-home/jobs/Atlas-1.0-AllTests/builds/888/testng/testng-results-2.xml'
Processing '/x1/jenkins/jenkins-home/jobs/Atlas-1.0-AllTests/builds/888/testng/testng-results-3.xml'
Processing '/x1/jenkins/jenkins-home/jobs/Atlas-1.0-AllTests/builds/888/testng/testng-results-4.xml'
Processing '/x1/jenkins/jenkins-home/jobs/Atlas-1.0-AllTests/builds/888/testng/testng-results-5.xml'
Processing '/x1/jenkins/jenkins-home/jobs/Atlas-1.0-AllTests/builds/888/testng/testng-results-6.xml'
Processing '/x1/jenkins/jenkins-home/jobs/Atlas-1.0-AllTests/builds/888/testng/testng-results.xml'
TestNG Reports Processing: FINISH

Mime
View raw message