atlas-dev mailing list archives

Site index · List index
Message view « Date » · « Thread »
Top « Date » · « Thread »
From Apache Jenkins Server <jenk...@builds.apache.org>
Subject Build failed in Jenkins: Atlas-1.0-IntegrationTests #871
Date Sat, 25 Aug 2018 09:33:07 GMT
See <https://builds.apache.org/job/Atlas-1.0-IntegrationTests/871/display/redirect>

------------------------------------------
[...truncated 197.98 KB...]
[INFO] --- maven-resources-plugin:2.7:resources (default-resources) @ atlas-repository ---
[INFO] Using 'UTF-8' encoding to copy filtered resources.
[INFO] skip non existing resourceDirectory <https://builds.apache.org/job/Atlas-1.0-IntegrationTests/ws/repository/src/main/resources>
[INFO] Copying 2 resources to META-INF
[INFO] Copying 3 resources
[INFO] 
[INFO] --- maven-compiler-plugin:3.7.0:compile (default-compile) @ atlas-repository ---
[INFO] Changes detected - recompiling the module!
[INFO] Compiling 131 source files to <https://builds.apache.org/job/Atlas-1.0-IntegrationTests/ws/repository/target/classes>
[INFO] <https://builds.apache.org/job/Atlas-1.0-IntegrationTests/ws/repository/src/main/java/org/apache/atlas/repository/converters/AtlasInstanceConverter.java>:
Some input files use or override a deprecated API.
[INFO] <https://builds.apache.org/job/Atlas-1.0-IntegrationTests/ws/repository/src/main/java/org/apache/atlas/repository/converters/AtlasInstanceConverter.java>:
Recompile with -Xlint:deprecation for details.
[INFO] <https://builds.apache.org/job/Atlas-1.0-IntegrationTests/ws/repository/src/main/java/org/apache/atlas/repository/store/graph/v2/AtlasStructDefStoreV2.java>:
Some input files use unchecked or unsafe operations.
[INFO] <https://builds.apache.org/job/Atlas-1.0-IntegrationTests/ws/repository/src/main/java/org/apache/atlas/repository/store/graph/v2/AtlasStructDefStoreV2.java>:
Recompile with -Xlint:unchecked for details.
[INFO] -------------------------------------------------------------
[ERROR] COMPILATION ERROR : 
[INFO] -------------------------------------------------------------
[ERROR] <https://builds.apache.org/job/Atlas-1.0-IntegrationTests/ws/repository/src/main/java/org/apache/atlas/repository/store/graph/v2/EntityGraphMapper.java>:[149,55]
cannot find symbol
  symbol:   variable SUPER_TYPES_PROPERTY_KEY
  location: class org.apache.atlas.repository.store.graph.v2.EntityGraphMapper
[ERROR] <https://builds.apache.org/job/Atlas-1.0-IntegrationTests/ws/repository/src/main/java/org/apache/atlas/repository/store/graph/v2/EntityGraphMapper.java>:[152,51]
cannot find symbol
  symbol:   variable GUID_PROPERTY_KEY
  location: class org.apache.atlas.repository.store.graph.v2.EntityGraphMapper
[ERROR] <https://builds.apache.org/job/Atlas-1.0-IntegrationTests/ws/repository/src/main/java/org/apache/atlas/repository/store/graph/v2/EntityGraphMapper.java>:[153,51]
cannot find symbol
  symbol:   variable VERSION_PROPERTY_KEY
  location: class org.apache.atlas.repository.store.graph.v2.EntityGraphMapper
[ERROR] <https://builds.apache.org/job/Atlas-1.0-IntegrationTests/ws/repository/src/main/java/org/apache/atlas/repository/store/graph/v2/EntityGraphMapper.java>:[164,58]
cannot find symbol
  symbol:   variable TIMESTAMP_PROPERTY_KEY
  location: class org.apache.atlas.repository.store.graph.v2.EntityGraphMapper
[ERROR] <https://builds.apache.org/job/Atlas-1.0-IntegrationTests/ws/repository/src/main/java/org/apache/atlas/repository/store/graph/v2/EntityGraphMapper.java>:[168,58]
cannot find symbol
  symbol:   variable MODIFICATION_TIMESTAMP_PROPERTY_KEY
  location: class org.apache.atlas.repository.store.graph.v2.EntityGraphMapper
[ERROR] <https://builds.apache.org/job/Atlas-1.0-IntegrationTests/ws/repository/src/main/java/org/apache/atlas/repository/store/graph/v2/EntityGraphMapper.java>:[172,58]
cannot find symbol
  symbol:   variable CREATED_BY_KEY
  location: class org.apache.atlas.repository.store.graph.v2.EntityGraphMapper
[ERROR] <https://builds.apache.org/job/Atlas-1.0-IntegrationTests/ws/repository/src/main/java/org/apache/atlas/repository/store/graph/v2/EntityGraphMapper.java>:[176,58]
cannot find symbol
  symbol:   variable MODIFIED_BY_KEY
  location: class org.apache.atlas.repository.store.graph.v2.EntityGraphMapper
[ERROR] <https://builds.apache.org/job/Atlas-1.0-IntegrationTests/ws/repository/src/main/java/org/apache/atlas/repository/store/graph/v2/EntityGraphMapper.java>:[180,58]
cannot find symbol
  symbol:   variable HOME_ID_KEY
  location: class org.apache.atlas.repository.store.graph.v2.EntityGraphMapper
[ERROR] <https://builds.apache.org/job/Atlas-1.0-IntegrationTests/ws/repository/src/main/java/org/apache/atlas/repository/store/graph/v2/EntityGraphMapper.java>:[184,58]
cannot find symbol
  symbol:   variable IS_PROXY_KEY
  location: class org.apache.atlas.repository.store.graph.v2.EntityGraphMapper
[ERROR] <https://builds.apache.org/job/Atlas-1.0-IntegrationTests/ws/repository/src/main/java/org/apache/atlas/repository/store/graph/v2/EntityGraphMapper.java>:[261,51]
cannot find symbol
  symbol:   variable ENTITY_TYPE_PROPERTY_KEY
  location: class org.apache.atlas.repository.store.graph.v2.EntityGraphMapper
[ERROR] <https://builds.apache.org/job/Atlas-1.0-IntegrationTests/ws/repository/src/main/java/org/apache/atlas/repository/store/graph/v2/EntityGraphMapper.java>:[263,51]
cannot find symbol
  symbol:   variable TIMESTAMP_PROPERTY_KEY
  location: class org.apache.atlas.repository.store.graph.v2.EntityGraphMapper
[ERROR] <https://builds.apache.org/job/Atlas-1.0-IntegrationTests/ws/repository/src/main/java/org/apache/atlas/repository/store/graph/v2/EntityGraphMapper.java>:[264,51]
cannot find symbol
  symbol:   variable MODIFICATION_TIMESTAMP_PROPERTY_KEY
  location: class org.apache.atlas.repository.store.graph.v2.EntityGraphMapper
[ERROR] <https://builds.apache.org/job/Atlas-1.0-IntegrationTests/ws/repository/src/main/java/org/apache/atlas/repository/store/graph/v2/EntityGraphMapper.java>:[265,51]
cannot find symbol
  symbol:   variable CREATED_BY_KEY
  location: class org.apache.atlas.repository.store.graph.v2.EntityGraphMapper
[ERROR] <https://builds.apache.org/job/Atlas-1.0-IntegrationTests/ws/repository/src/main/java/org/apache/atlas/repository/store/graph/v2/EntityGraphMapper.java>:[266,51]
cannot find symbol
  symbol:   variable MODIFIED_BY_KEY
  location: class org.apache.atlas.repository.store.graph.v2.EntityGraphMapper
[ERROR] <https://builds.apache.org/job/Atlas-1.0-IntegrationTests/ws/repository/src/main/java/org/apache/atlas/repository/store/graph/v2/EntityGraphMapper.java>:[284,51]
cannot find symbol
  symbol:   variable SUPER_TYPES_PROPERTY_KEY
  location: class org.apache.atlas.repository.store.graph.v2.EntityGraphMapper
[ERROR] <https://builds.apache.org/job/Atlas-1.0-IntegrationTests/ws/repository/src/main/java/org/apache/atlas/repository/store/graph/v2/EntityGraphMapper.java>:[285,51]
cannot find symbol
  symbol:   variable CLASSIFICATION_ENTITY_GUID
  location: class org.apache.atlas.repository.store.graph.v2.EntityGraphMapper
[ERROR] <https://builds.apache.org/job/Atlas-1.0-IntegrationTests/ws/repository/src/main/java/org/apache/atlas/repository/store/graph/v2/EntityGraphMapper.java>:[286,51]
cannot find symbol
  symbol:   variable CLASSIFICATION_ENTITY_STATUS
  location: class org.apache.atlas.repository.store.graph.v2.EntityGraphMapper
[ERROR] <https://builds.apache.org/job/Atlas-1.0-IntegrationTests/ws/repository/src/main/java/org/apache/atlas/repository/store/graph/v2/EntityGraphMapper.java>:[613,52]
cannot find symbol
  symbol:   variable RELATIONSHIP_GUID_PROPERTY_KEY
  location: class org.apache.atlas.repository.store.graph.v2.EntityGraphMapper
[ERROR] <https://builds.apache.org/job/Atlas-1.0-IntegrationTests/ws/repository/src/main/java/org/apache/atlas/repository/store/graph/v2/EntityGraphMapper.java>:[802,71]
cannot find symbol
  symbol:   variable RELATIONSHIP_GUID_PROPERTY_KEY
  location: class org.apache.atlas.repository.store.graph.v2.EntityGraphMapper
[ERROR] <https://builds.apache.org/job/Atlas-1.0-IntegrationTests/ws/repository/src/main/java/org/apache/atlas/repository/store/graph/v2/EntityGraphMapper.java>:[1717,71]
cannot find symbol
  symbol:   variable CLASSIFICATION_VALIDITY_PERIODS_KEY
  location: class org.apache.atlas.repository.store.graph.v2.EntityGraphMapper
[ERROR] <https://builds.apache.org/job/Atlas-1.0-IntegrationTests/ws/repository/src/main/java/org/apache/atlas/repository/store/graph/v2/EntityGraphMapper.java>:[1723,71]
cannot find symbol
  symbol:   variable CLASSIFICATION_VERTEX_PROPAGATE_KEY
  location: class org.apache.atlas.repository.store.graph.v2.EntityGraphMapper
[INFO] 21 errors 
[INFO] -------------------------------------------------------------
[INFO] ------------------------------------------------------------------------
[INFO] Reactor Summary:
[INFO] 
[INFO] Apache Atlas Server Build Tools 1.0 ................ SUCCESS [  0.758 s]
[INFO] apache-atlas 1.1.0-SNAPSHOT ........................ SUCCESS [  4.498 s]
[INFO] Apache Atlas Test Utility Tools .................... SUCCESS [ 12.226 s]
[INFO] Apache Atlas Integration ........................... SUCCESS [ 26.410 s]
[INFO] Apache Atlas Common ................................ SUCCESS [  9.828 s]
[INFO] Apache Atlas Client ................................ SUCCESS [  0.718 s]
[INFO] atlas-client-common ................................ SUCCESS [  8.588 s]
[INFO] atlas-client-v1 .................................... SUCCESS [  7.085 s]
[INFO] Apache Atlas Server API ............................ SUCCESS [  5.866 s]
[INFO] Apache Atlas Notification .......................... SUCCESS [ 10.264 s]
[INFO] atlas-client-v2 .................................... SUCCESS [  7.058 s]
[INFO] Apache Atlas Graph Database Projects ............... SUCCESS [  0.548 s]
[INFO] Apache Atlas Graph Database API .................... SUCCESS [  5.369 s]
[INFO] Graph Database Common Code ......................... SUCCESS [  5.829 s]
[INFO] Apache Atlas JanusGraph DB Impl .................... SUCCESS [ 19.082 s]
[INFO] Apache Atlas Graph Database Implementation Dependencies SUCCESS [  2.517 s]
[INFO] Shaded version of Apache hbase client .............. SUCCESS [  8.780 s]
[INFO] Shaded version of Apache hbase server .............. SUCCESS [ 21.652 s]
[INFO] Apache Atlas Authorization ......................... SUCCESS [  8.143 s]
[INFO] Apache Atlas Repository ............................ FAILURE [  9.386 s]
[INFO] Apache Atlas UI .................................... SKIPPED
[INFO] Apache Atlas Web Application ....................... SKIPPED
[INFO] Apache Atlas Documentation ......................... SKIPPED
[INFO] Apache Atlas FileSystem Model ...................... SKIPPED
[INFO] Apache Atlas Plugin Classloader .................... SKIPPED
[INFO] Apache Atlas Hive Bridge Shim ...................... SKIPPED
[INFO] Apache Atlas Hive Bridge ........................... SKIPPED
[INFO] Apache Atlas Falcon Bridge Shim .................... SKIPPED
[INFO] Apache Atlas Falcon Bridge ......................... SKIPPED
[INFO] Apache Atlas Sqoop Bridge Shim ..................... SKIPPED
[INFO] Apache Atlas Sqoop Bridge .......................... SKIPPED
[INFO] Apache Atlas Storm Bridge Shim ..................... SKIPPED
[INFO] Apache Atlas Storm Bridge .......................... SKIPPED
[INFO] Apache Atlas Hbase Bridge Shim ..................... SKIPPED
[INFO] Apache Atlas Hbase Bridge .......................... SKIPPED
[INFO] Apache Atlas Kafka Bridge .......................... SKIPPED
[INFO] Apache Atlas Distribution 1.1.0-SNAPSHOT ........... SKIPPED
[INFO] ------------------------------------------------------------------------
[INFO] BUILD FAILURE
[INFO] ------------------------------------------------------------------------
[INFO] Total time: 02:56 min
[INFO] Finished at: 2018-08-25T09:28:05Z
[INFO] ------------------------------------------------------------------------
[ERROR] Failed to execute goal org.apache.maven.plugins:maven-compiler-plugin:3.7.0:compile
(default-compile) on project atlas-repository: Compilation failure: Compilation failure: 
[ERROR] <https://builds.apache.org/job/Atlas-1.0-IntegrationTests/ws/repository/src/main/java/org/apache/atlas/repository/store/graph/v2/EntityGraphMapper.java>:[149,55]
cannot find symbol
[ERROR]   symbol:   variable SUPER_TYPES_PROPERTY_KEY
[ERROR]   location: class org.apache.atlas.repository.store.graph.v2.EntityGraphMapper
[ERROR] <https://builds.apache.org/job/Atlas-1.0-IntegrationTests/ws/repository/src/main/java/org/apache/atlas/repository/store/graph/v2/EntityGraphMapper.java>:[152,51]
cannot find symbol
[ERROR]   symbol:   variable GUID_PROPERTY_KEY
[ERROR]   location: class org.apache.atlas.repository.store.graph.v2.EntityGraphMapper
[ERROR] <https://builds.apache.org/job/Atlas-1.0-IntegrationTests/ws/repository/src/main/java/org/apache/atlas/repository/store/graph/v2/EntityGraphMapper.java>:[153,51]
cannot find symbol
[ERROR]   symbol:   variable VERSION_PROPERTY_KEY
[ERROR]   location: class org.apache.atlas.repository.store.graph.v2.EntityGraphMapper
[ERROR] <https://builds.apache.org/job/Atlas-1.0-IntegrationTests/ws/repository/src/main/java/org/apache/atlas/repository/store/graph/v2/EntityGraphMapper.java>:[164,58]
cannot find symbol
[ERROR]   symbol:   variable TIMESTAMP_PROPERTY_KEY
[ERROR]   location: class org.apache.atlas.repository.store.graph.v2.EntityGraphMapper
[ERROR] <https://builds.apache.org/job/Atlas-1.0-IntegrationTests/ws/repository/src/main/java/org/apache/atlas/repository/store/graph/v2/EntityGraphMapper.java>:[168,58]
cannot find symbol
[ERROR]   symbol:   variable MODIFICATION_TIMESTAMP_PROPERTY_KEY
[ERROR]   location: class org.apache.atlas.repository.store.graph.v2.EntityGraphMapper
[ERROR] <https://builds.apache.org/job/Atlas-1.0-IntegrationTests/ws/repository/src/main/java/org/apache/atlas/repository/store/graph/v2/EntityGraphMapper.java>:[172,58]
cannot find symbol
[ERROR]   symbol:   variable CREATED_BY_KEY
[ERROR]   location: class org.apache.atlas.repository.store.graph.v2.EntityGraphMapper
[ERROR] <https://builds.apache.org/job/Atlas-1.0-IntegrationTests/ws/repository/src/main/java/org/apache/atlas/repository/store/graph/v2/EntityGraphMapper.java>:[176,58]
cannot find symbol
[ERROR]   symbol:   variable MODIFIED_BY_KEY
[ERROR]   location: class org.apache.atlas.repository.store.graph.v2.EntityGraphMapper
[ERROR] <https://builds.apache.org/job/Atlas-1.0-IntegrationTests/ws/repository/src/main/java/org/apache/atlas/repository/store/graph/v2/EntityGraphMapper.java>:[180,58]
cannot find symbol
[ERROR]   symbol:   variable HOME_ID_KEY
[ERROR]   location: class org.apache.atlas.repository.store.graph.v2.EntityGraphMapper
[ERROR] <https://builds.apache.org/job/Atlas-1.0-IntegrationTests/ws/repository/src/main/java/org/apache/atlas/repository/store/graph/v2/EntityGraphMapper.java>:[184,58]
cannot find symbol
[ERROR]   symbol:   variable IS_PROXY_KEY
[ERROR]   location: class org.apache.atlas.repository.store.graph.v2.EntityGraphMapper
[ERROR] <https://builds.apache.org/job/Atlas-1.0-IntegrationTests/ws/repository/src/main/java/org/apache/atlas/repository/store/graph/v2/EntityGraphMapper.java>:[261,51]
cannot find symbol
[ERROR]   symbol:   variable ENTITY_TYPE_PROPERTY_KEY
[ERROR]   location: class org.apache.atlas.repository.store.graph.v2.EntityGraphMapper
[ERROR] <https://builds.apache.org/job/Atlas-1.0-IntegrationTests/ws/repository/src/main/java/org/apache/atlas/repository/store/graph/v2/EntityGraphMapper.java>:[263,51]
cannot find symbol
[ERROR]   symbol:   variable TIMESTAMP_PROPERTY_KEY
[ERROR]   location: class org.apache.atlas.repository.store.graph.v2.EntityGraphMapper
[ERROR] <https://builds.apache.org/job/Atlas-1.0-IntegrationTests/ws/repository/src/main/java/org/apache/atlas/repository/store/graph/v2/EntityGraphMapper.java>:[264,51]
cannot find symbol
[ERROR]   symbol:   variable MODIFICATION_TIMESTAMP_PROPERTY_KEY
[ERROR]   location: class org.apache.atlas.repository.store.graph.v2.EntityGraphMapper
[ERROR] <https://builds.apache.org/job/Atlas-1.0-IntegrationTests/ws/repository/src/main/java/org/apache/atlas/repository/store/graph/v2/EntityGraphMapper.java>:[265,51]
cannot find symbol
[ERROR]   symbol:   variable CREATED_BY_KEY
[ERROR]   location: class org.apache.atlas.repository.store.graph.v2.EntityGraphMapper
[ERROR] <https://builds.apache.org/job/Atlas-1.0-IntegrationTests/ws/repository/src/main/java/org/apache/atlas/repository/store/graph/v2/EntityGraphMapper.java>:[266,51]
cannot find symbol
[ERROR]   symbol:   variable MODIFIED_BY_KEY
[ERROR]   location: class org.apache.atlas.repository.store.graph.v2.EntityGraphMapper
[ERROR] <https://builds.apache.org/job/Atlas-1.0-IntegrationTests/ws/repository/src/main/java/org/apache/atlas/repository/store/graph/v2/EntityGraphMapper.java>:[284,51]
cannot find symbol
[ERROR]   symbol:   variable SUPER_TYPES_PROPERTY_KEY
[ERROR]   location: class org.apache.atlas.repository.store.graph.v2.EntityGraphMapper
[ERROR] <https://builds.apache.org/job/Atlas-1.0-IntegrationTests/ws/repository/src/main/java/org/apache/atlas/repository/store/graph/v2/EntityGraphMapper.java>:[285,51]
cannot find symbol
[ERROR]   symbol:   variable CLASSIFICATION_ENTITY_GUID
[ERROR]   location: class org.apache.atlas.repository.store.graph.v2.EntityGraphMapper
[ERROR] <https://builds.apache.org/job/Atlas-1.0-IntegrationTests/ws/repository/src/main/java/org/apache/atlas/repository/store/graph/v2/EntityGraphMapper.java>:[286,51]
cannot find symbol
[ERROR]   symbol:   variable CLASSIFICATION_ENTITY_STATUS
[ERROR]   location: class org.apache.atlas.repository.store.graph.v2.EntityGraphMapper
[ERROR] <https://builds.apache.org/job/Atlas-1.0-IntegrationTests/ws/repository/src/main/java/org/apache/atlas/repository/store/graph/v2/EntityGraphMapper.java>:[613,52]
cannot find symbol
[ERROR]   symbol:   variable RELATIONSHIP_GUID_PROPERTY_KEY
[ERROR]   location: class org.apache.atlas.repository.store.graph.v2.EntityGraphMapper
[ERROR] <https://builds.apache.org/job/Atlas-1.0-IntegrationTests/ws/repository/src/main/java/org/apache/atlas/repository/store/graph/v2/EntityGraphMapper.java>:[802,71]
cannot find symbol
[ERROR]   symbol:   variable RELATIONSHIP_GUID_PROPERTY_KEY
[ERROR]   location: class org.apache.atlas.repository.store.graph.v2.EntityGraphMapper
[ERROR] <https://builds.apache.org/job/Atlas-1.0-IntegrationTests/ws/repository/src/main/java/org/apache/atlas/repository/store/graph/v2/EntityGraphMapper.java>:[1717,71]
cannot find symbol
[ERROR]   symbol:   variable CLASSIFICATION_VALIDITY_PERIODS_KEY
[ERROR]   location: class org.apache.atlas.repository.store.graph.v2.EntityGraphMapper
[ERROR] <https://builds.apache.org/job/Atlas-1.0-IntegrationTests/ws/repository/src/main/java/org/apache/atlas/repository/store/graph/v2/EntityGraphMapper.java>:[1723,71]
cannot find symbol
[ERROR]   symbol:   variable CLASSIFICATION_VERTEX_PROPAGATE_KEY
[ERROR]   location: class org.apache.atlas.repository.store.graph.v2.EntityGraphMapper
[ERROR] -> [Help 1]
[ERROR] 
[ERROR] To see the full stack trace of the errors, re-run Maven with the -e switch.
[ERROR] Re-run Maven using the -X switch to enable full debug logging.
[ERROR] 
[ERROR] For more information about the errors and possible solutions, please read the following
articles:
[ERROR] [Help 1] http://cwiki.apache.org/confluence/display/MAVEN/MojoFailureException
[ERROR] 
[ERROR] After correcting the problems, you can resume the build with the command
[ERROR]   mvn <goals> -rf :atlas-repository
Build step 'Execute shell' marked build as failure
[CHECKSTYLE] Collecting checkstyle analysis files...
[CHECKSTYLE] Searching for all files in <https://builds.apache.org/job/Atlas-1.0-IntegrationTests/ws/>
that match the pattern **/target/checkstyle-result.xml
[CHECKSTYLE] Parsing 18 files in <https://builds.apache.org/job/Atlas-1.0-IntegrationTests/ws/>
[CHECKSTYLE] Successfully parsed file <https://builds.apache.org/job/Atlas-1.0-IntegrationTests/ws/authorization/target/checkstyle-result.xml>
with 973 unique warnings and 0 duplicates.
[CHECKSTYLE] Successfully parsed file <https://builds.apache.org/job/Atlas-1.0-IntegrationTests/ws/client/client-v1/target/checkstyle-result.xml>
with 1872 unique warnings and 0 duplicates.
[CHECKSTYLE] Successfully parsed file <https://builds.apache.org/job/Atlas-1.0-IntegrationTests/ws/client/client-v2/target/checkstyle-result.xml>
with 2231 unique warnings and 0 duplicates.
[CHECKSTYLE] Successfully parsed file <https://builds.apache.org/job/Atlas-1.0-IntegrationTests/ws/client/common/target/checkstyle-result.xml>
with 2723 unique warnings and 0 duplicates.
[CHECKSTYLE] Successfully parsed file <https://builds.apache.org/job/Atlas-1.0-IntegrationTests/ws/client/target/checkstyle-result.xml>
with 2723 unique warnings and 0 duplicates.
[CHECKSTYLE] Successfully parsed file <https://builds.apache.org/job/Atlas-1.0-IntegrationTests/ws/common/target/checkstyle-result.xml>
with 3800 unique warnings and 0 duplicates.
[CHECKSTYLE] Successfully parsed file <https://builds.apache.org/job/Atlas-1.0-IntegrationTests/ws/graphdb/api/target/checkstyle-result.xml>
with 4102 unique warnings and 0 duplicates.
[CHECKSTYLE] Successfully parsed file <https://builds.apache.org/job/Atlas-1.0-IntegrationTests/ws/graphdb/common/target/checkstyle-result.xml>
with 4328 unique warnings and 0 duplicates.
[CHECKSTYLE] Successfully parsed file <https://builds.apache.org/job/Atlas-1.0-IntegrationTests/ws/graphdb/graphdb-impls/target/checkstyle-result.xml>
with 4328 unique warnings and 0 duplicates.
[CHECKSTYLE] Successfully parsed file <https://builds.apache.org/job/Atlas-1.0-IntegrationTests/ws/graphdb/janus/target/checkstyle-result.xml>
with 6654 unique warnings and 0 duplicates.
[CHECKSTYLE] Successfully parsed file <https://builds.apache.org/job/Atlas-1.0-IntegrationTests/ws/graphdb/target/checkstyle-result.xml>
with 6654 unique warnings and 0 duplicates.
[CHECKSTYLE] Successfully parsed file <https://builds.apache.org/job/Atlas-1.0-IntegrationTests/ws/intg/target/checkstyle-result.xml>
with 18755 unique warnings and 0 duplicates.
[CHECKSTYLE] Successfully parsed file <https://builds.apache.org/job/Atlas-1.0-IntegrationTests/ws/notification/target/checkstyle-result.xml>
with 20029 unique warnings and 0 duplicates.
[CHECKSTYLE] Successfully parsed file <https://builds.apache.org/job/Atlas-1.0-IntegrationTests/ws/server-api/target/checkstyle-result.xml>
with 20197 unique warnings and 0 duplicates.
[CHECKSTYLE] Successfully parsed file <https://builds.apache.org/job/Atlas-1.0-IntegrationTests/ws/shaded/hbase-client-shaded/target/checkstyle-result.xml>
with 20197 unique warnings and 0 duplicates.
[CHECKSTYLE] Successfully parsed file <https://builds.apache.org/job/Atlas-1.0-IntegrationTests/ws/shaded/hbase-server-shaded/target/checkstyle-result.xml>
with 20197 unique warnings and 0 duplicates.
[CHECKSTYLE] Successfully parsed file <https://builds.apache.org/job/Atlas-1.0-IntegrationTests/ws/target/checkstyle-result.xml>
with 20197 unique warnings and 0 duplicates.
[CHECKSTYLE] Successfully parsed file <https://builds.apache.org/job/Atlas-1.0-IntegrationTests/ws/test-tools/target/checkstyle-result.xml>
with 20235 unique warnings and 0 duplicates.
<Git Blamer> Using GitBlamer to create author and commit information for all warnings.
<Git Blamer> GIT_COMMIT=bcf904d8d4b762b78bd5e150e7e76845434c8525, workspace=<https://builds.apache.org/job/Atlas-1.0-IntegrationTests/ws/>
 > git rev-parse bcf904d8d4b762b78bd5e150e7e76845434c8525^{commit} # timeout=10
[CHECKSTYLE] Computing warning deltas based on reference build #866
[FINDBUGS] Collecting findbugs analysis files...
[FINDBUGS] Searching for all files in <https://builds.apache.org/job/Atlas-1.0-IntegrationTests/ws/>
that match the pattern **/target/findbugs.xml
[FINDBUGS] Parsing 12 files in <https://builds.apache.org/job/Atlas-1.0-IntegrationTests/ws/>
[FINDBUGS] Successfully parsed file <https://builds.apache.org/job/Atlas-1.0-IntegrationTests/ws/authorization/target/findbugs.xml>
with 0 unique warnings and 0 duplicates.
[FINDBUGS] Successfully parsed file <https://builds.apache.org/job/Atlas-1.0-IntegrationTests/ws/client/client-v1/target/findbugs.xml>
with 0 unique warnings and 0 duplicates.
[FINDBUGS] Successfully parsed file <https://builds.apache.org/job/Atlas-1.0-IntegrationTests/ws/client/client-v2/target/findbugs.xml>
with 0 unique warnings and 0 duplicates.
[FINDBUGS] Successfully parsed file <https://builds.apache.org/job/Atlas-1.0-IntegrationTests/ws/client/common/target/findbugs.xml>
with 0 unique warnings and 0 duplicates.
[FINDBUGS] Successfully parsed file <https://builds.apache.org/job/Atlas-1.0-IntegrationTests/ws/common/target/findbugs.xml>
with 0 unique warnings and 0 duplicates.
[FINDBUGS] Successfully parsed file <https://builds.apache.org/job/Atlas-1.0-IntegrationTests/ws/graphdb/api/target/findbugs.xml>
with 0 unique warnings and 0 duplicates.
[FINDBUGS] Successfully parsed file <https://builds.apache.org/job/Atlas-1.0-IntegrationTests/ws/graphdb/common/target/findbugs.xml>
with 0 unique warnings and 0 duplicates.
[FINDBUGS] Successfully parsed file <https://builds.apache.org/job/Atlas-1.0-IntegrationTests/ws/graphdb/janus/target/findbugs.xml>
with 0 unique warnings and 0 duplicates.
[FINDBUGS] Successfully parsed file <https://builds.apache.org/job/Atlas-1.0-IntegrationTests/ws/intg/target/findbugs.xml>
with 0 unique warnings and 0 duplicates.
[FINDBUGS] Successfully parsed file <https://builds.apache.org/job/Atlas-1.0-IntegrationTests/ws/notification/target/findbugs.xml>
with 0 unique warnings and 0 duplicates.
[FINDBUGS] Successfully parsed file <https://builds.apache.org/job/Atlas-1.0-IntegrationTests/ws/server-api/target/findbugs.xml>
with 0 unique warnings and 0 duplicates.
[FINDBUGS] Successfully parsed file <https://builds.apache.org/job/Atlas-1.0-IntegrationTests/ws/test-tools/target/findbugs.xml>
with 0 unique warnings and 0 duplicates.
<Git Blamer> Using GitBlamer to create author and commit information for all warnings.
<Git Blamer> GIT_COMMIT=bcf904d8d4b762b78bd5e150e7e76845434c8525, workspace=<https://builds.apache.org/job/Atlas-1.0-IntegrationTests/ws/>
[FINDBUGS] Computing warning deltas based on reference build #866
Archiving artifacts
TestNG Reports Processing: START
Looking for TestNG results report in workspace using pattern: **/target/surefire-reports/testng-results.xml,**/target/failsafe-reports/testng-results.xml
Did not find any matching files.

Mime
View raw message