atlas-dev mailing list archives

Site index · List index
Message view « Date » · « Thread »
Top « Date » · « Thread »
From Apache Jenkins Server <jenk...@builds.apache.org>
Subject Build failed in Jenkins: Atlas-master-IntegrationTests #2177
Date Mon, 20 Aug 2018 19:17:44 GMT
See <https://builds.apache.org/job/Atlas-master-IntegrationTests/2177/display/redirect>

------------------------------------------
[...truncated 781.85 KB...]
    at org.apache.maven.DefaultMaven.doExecute (DefaultMaven.java:192)
    at org.apache.maven.DefaultMaven.execute (DefaultMaven.java:105)
    at org.apache.maven.cli.MavenCli.execute (MavenCli.java:954)
    at org.apache.maven.cli.MavenCli.doMain (MavenCli.java:288)
    at org.apache.maven.cli.MavenCli.main (MavenCli.java:192)
    at sun.reflect.NativeMethodAccessorImpl.invoke0 (Native Method)
    at sun.reflect.NativeMethodAccessorImpl.invoke (NativeMethodAccessorImpl.java:62)
    at sun.reflect.DelegatingMethodAccessorImpl.invoke (DelegatingMethodAccessorImpl.java:43)
    at java.lang.reflect.Method.invoke (Method.java:498)
    at org.codehaus.plexus.classworlds.launcher.Launcher.launchEnhanced (Launcher.java:289)
    at org.codehaus.plexus.classworlds.launcher.Launcher.launch (Launcher.java:229)
    at org.codehaus.plexus.classworlds.launcher.Launcher.mainWithExitCode (Launcher.java:415)
    at org.codehaus.plexus.classworlds.launcher.Launcher.main (Launcher.java:356)
[INFO] Started ServerConnector@4b4b6363{HTTP/1.1,[http/1.1]}{0.0.0.0:31000}
[INFO] Started @1960540ms
[INFO] Started Jetty Server
[INFO] 
[INFO] --- maven-failsafe-plugin:2.18.1:integration-test (integration-test) @ hbase-bridge
---
[WARNING] useSystemClassloader setting has no effect when not forking
[INFO] Failsafe report directory: <https://builds.apache.org/job/Atlas-master-IntegrationTests/ws/addons/hbase-bridge/target/failsafe-reports>
Running org.apache.atlas.hbase.HBaseAtlasHookIT
127.0.0.1 - - [20/Aug/2018:19:06:20 +0000] "GET //localhost:31000/api/atlas/v2/entity/uniqueAttribute/type/hbase_namespace?attr:qualifiedName=test_namespace@primary
HTTP/1.1" 503 383 "-" "Java/1.8.0_172"
127.0.0.1 - - [20/Aug/2018:19:06:25 +0000] "GET //localhost:31000/api/atlas/v2/entity/uniqueAttribute/type/hbase_namespace?attr:qualifiedName=test_namespace@primary
HTTP/1.1" 503 383 "-" "Java/1.8.0_172"
127.0.0.1 - - [20/Aug/2018:19:06:30 +0000] "GET //localhost:31000/api/atlas/v2/entity/uniqueAttribute/type/hbase_namespace?attr:qualifiedName=test_namespace@primary
HTTP/1.1" 503 383 "-" "Java/1.8.0_172"
127.0.0.1 - - [20/Aug/2018:19:06:37 +0000] "GET //localhost:31000/api/atlas/v2/entity/uniqueAttribute/type/hbase_namespace?attr:qualifiedName=test_namespace@primary
HTTP/1.1" 503 383 "-" "Java/1.8.0_172"
127.0.0.1 - - [20/Aug/2018:19:06:47 +0000] "GET //localhost:31000/api/atlas/v2/entity/uniqueAttribute/type/hbase_namespace?attr:qualifiedName=test_namespace@primary
HTTP/1.1" 503 383 "-" "Java/1.8.0_172"
127.0.0.1 - - [20/Aug/2018:19:06:52 +0000] "GET //localhost:31000/api/atlas/v2/entity/uniqueAttribute/type/hbase_namespace?attr:qualifiedName=test_namespace@primary
HTTP/1.1" 503 383 "-" "Java/1.8.0_172"
127.0.0.1 - - [20/Aug/2018:19:06:57 +0000] "GET //localhost:31000/api/atlas/v2/entity/uniqueAttribute/type/hbase_namespace?attr:qualifiedName=test_namespace@primary
HTTP/1.1" 503 383 "-" "Java/1.8.0_172"
127.0.0.1 - - [20/Aug/2018:19:07:02 +0000] "GET //localhost:31000/api/atlas/v2/entity/uniqueAttribute/type/hbase_namespace?attr:qualifiedName=test_namespace@primary
HTTP/1.1" 503 383 "-" "Java/1.8.0_172"
127.0.0.1 - - [20/Aug/2018:19:07:12 +0000] "GET //localhost:31000/api/atlas/v2/entity/uniqueAttribute/type/hbase_namespace?attr:qualifiedName=test_namespace@primary
HTTP/1.1" 503 383 "-" "Java/1.8.0_172"
127.0.0.1 - - [20/Aug/2018:19:07:17 +0000] "GET //localhost:31000/api/atlas/v2/entity/uniqueAttribute/type/hbase_namespace?attr:qualifiedName=test_namespace@primary
HTTP/1.1" 503 383 "-" "Java/1.8.0_172"
127.0.0.1 - - [20/Aug/2018:19:07:22 +0000] "GET //localhost:31000/api/atlas/v2/entity/uniqueAttribute/type/hbase_namespace?attr:qualifiedName=test_namespace@primary
HTTP/1.1" 503 383 "-" "Java/1.8.0_172"
127.0.0.1 - - [20/Aug/2018:19:07:27 +0000] "GET //localhost:31000/api/atlas/v2/entity/uniqueAttribute/type/hbase_namespace?attr:qualifiedName=test_namespace@primary
HTTP/1.1" 503 383 "-" "Java/1.8.0_172"
127.0.0.1 - - [20/Aug/2018:19:07:37 +0000] "GET //localhost:31000/api/atlas/v2/entity/uniqueAttribute/type/hbase_namespace?attr:qualifiedName=test_namespace@primary
HTTP/1.1" 503 383 "-" "Java/1.8.0_172"
127.0.0.1 - - [20/Aug/2018:19:07:42 +0000] "GET //localhost:31000/api/atlas/v2/entity/uniqueAttribute/type/hbase_namespace?attr:qualifiedName=test_namespace@primary
HTTP/1.1" 503 383 "-" "Java/1.8.0_172"
127.0.0.1 - - [20/Aug/2018:19:07:47 +0000] "GET //localhost:31000/api/atlas/v2/entity/uniqueAttribute/type/hbase_namespace?attr:qualifiedName=test_namespace@primary
HTTP/1.1" 503 383 "-" "Java/1.8.0_172"
127.0.0.1 - - [20/Aug/2018:19:07:52 +0000] "GET //localhost:31000/api/atlas/v2/entity/uniqueAttribute/type/hbase_namespace?attr:qualifiedName=test_namespace@primary
HTTP/1.1" 503 383 "-" "Java/1.8.0_172"
127.0.0.1 - - [20/Aug/2018:19:07:59 +0000] "GET //localhost:31000/api/atlas/v2/entity/uniqueAttribute/type/hbase_table?attr:qualifiedName=test_namespace1:test_table@primary
HTTP/1.1" 503 379 "-" "Java/1.8.0_172"
127.0.0.1 - - [20/Aug/2018:19:08:04 +0000] "GET //localhost:31000/api/atlas/v2/entity/uniqueAttribute/type/hbase_table?attr:qualifiedName=test_namespace1:test_table@primary
HTTP/1.1" 503 379 "-" "Java/1.8.0_172"
127.0.0.1 - - [20/Aug/2018:19:08:09 +0000] "GET //localhost:31000/api/atlas/v2/entity/uniqueAttribute/type/hbase_table?attr:qualifiedName=test_namespace1:test_table@primary
HTTP/1.1" 503 379 "-" "Java/1.8.0_172"
127.0.0.1 - - [20/Aug/2018:19:08:14 +0000] "GET //localhost:31000/api/atlas/v2/entity/uniqueAttribute/type/hbase_table?attr:qualifiedName=test_namespace1:test_table@primary
HTTP/1.1" 503 379 "-" "Java/1.8.0_172"
127.0.0.1 - - [20/Aug/2018:19:08:24 +0000] "GET //localhost:31000/api/atlas/v2/entity/uniqueAttribute/type/hbase_table?attr:qualifiedName=test_namespace1:test_table@primary
HTTP/1.1" 503 379 "-" "Java/1.8.0_172"
127.0.0.1 - - [20/Aug/2018:19:08:29 +0000] "GET //localhost:31000/api/atlas/v2/entity/uniqueAttribute/type/hbase_table?attr:qualifiedName=test_namespace1:test_table@primary
HTTP/1.1" 503 379 "-" "Java/1.8.0_172"
127.0.0.1 - - [20/Aug/2018:19:08:34 +0000] "GET //localhost:31000/api/atlas/v2/entity/uniqueAttribute/type/hbase_table?attr:qualifiedName=test_namespace1:test_table@primary
HTTP/1.1" 503 379 "-" "Java/1.8.0_172"
127.0.0.1 - - [20/Aug/2018:19:08:39 +0000] "GET //localhost:31000/api/atlas/v2/entity/uniqueAttribute/type/hbase_table?attr:qualifiedName=test_namespace1:test_table@primary
HTTP/1.1" 503 379 "-" "Java/1.8.0_172"
127.0.0.1 - - [20/Aug/2018:19:08:49 +0000] "GET //localhost:31000/api/atlas/v2/entity/uniqueAttribute/type/hbase_table?attr:qualifiedName=test_namespace1:test_table@primary
HTTP/1.1" 503 379 "-" "Java/1.8.0_172"
127.0.0.1 - - [20/Aug/2018:19:08:55 +0000] "GET //localhost:31000/api/atlas/v2/entity/uniqueAttribute/type/hbase_table?attr:qualifiedName=test_namespace1:test_table@primary
HTTP/1.1" 503 379 "-" "Java/1.8.0_172"
127.0.0.1 - - [20/Aug/2018:19:09:00 +0000] "GET //localhost:31000/api/atlas/v2/entity/uniqueAttribute/type/hbase_table?attr:qualifiedName=test_namespace1:test_table@primary
HTTP/1.1" 503 379 "-" "Java/1.8.0_172"
127.0.0.1 - - [20/Aug/2018:19:09:05 +0000] "GET //localhost:31000/api/atlas/v2/entity/uniqueAttribute/type/hbase_table?attr:qualifiedName=test_namespace1:test_table@primary
HTTP/1.1" 503 379 "-" "Java/1.8.0_172"
127.0.0.1 - - [20/Aug/2018:19:09:15 +0000] "GET //localhost:31000/api/atlas/v2/entity/uniqueAttribute/type/hbase_table?attr:qualifiedName=test_namespace1:test_table@primary
HTTP/1.1" 503 379 "-" "Java/1.8.0_172"
127.0.0.1 - - [20/Aug/2018:19:09:20 +0000] "GET //localhost:31000/api/atlas/v2/entity/uniqueAttribute/type/hbase_table?attr:qualifiedName=test_namespace1:test_table@primary
HTTP/1.1" 503 379 "-" "Java/1.8.0_172"
127.0.0.1 - - [20/Aug/2018:19:09:25 +0000] "GET //localhost:31000/api/atlas/v2/entity/uniqueAttribute/type/hbase_table?attr:qualifiedName=test_namespace1:test_table@primary
HTTP/1.1" 503 379 "-" "Java/1.8.0_172"
127.0.0.1 - - [20/Aug/2018:19:09:30 +0000] "GET //localhost:31000/api/atlas/v2/entity/uniqueAttribute/type/hbase_table?attr:qualifiedName=test_namespace1:test_table@primary
HTTP/1.1" 503 379 "-" "Java/1.8.0_172"
Tests run: 2, Failures: 2, Errors: 0, Skipped: 0, Time elapsed: 219.213 sec <<< FAILURE!
- in org.apache.atlas.hbase.HBaseAtlasHookIT
testCreateNamesapce(org.apache.atlas.hbase.HBaseAtlasHookIT)  Time elapsed: 97.353 sec  <<<
FAILURE!
java.lang.AssertionError: Assertions failed. Failing after waiting for timeout 80000 msecs
	at org.apache.atlas.AtlasBaseClient.callAPIWithResource(AtlasBaseClient.java:399)
	at org.apache.atlas.AtlasBaseClient.callAPIWithResource(AtlasBaseClient.java:327)
	at org.apache.atlas.AtlasBaseClient.callAPI(AtlasBaseClient.java:229)
	at org.apache.atlas.AtlasClientV2.getEntityByAttribute(AtlasClientV2.java:264)
	at org.apache.atlas.hbase.HBaseAtlasHookIT$1.evaluate(HBaseAtlasHookIT.java:258)
	at org.apache.atlas.hbase.HBaseAtlasHookIT.waitFor(HBaseAtlasHookIT.java:285)
	at org.apache.atlas.hbase.HBaseAtlasHookIT.assertEntityIsRegistered(HBaseAtlasHookIT.java:255)
	at org.apache.atlas.hbase.HBaseAtlasHookIT.assertNameSpaceIsRegistered(HBaseAtlasHookIT.java:221)
	at org.apache.atlas.hbase.HBaseAtlasHookIT.assertNameSpaceIsRegistered(HBaseAtlasHookIT.java:213)
	at org.apache.atlas.hbase.HBaseAtlasHookIT.testCreateNamesapce(HBaseAtlasHookIT.java:93)

testCreateTable(org.apache.atlas.hbase.HBaseAtlasHookIT)  Time elapsed: 97.551 sec  <<<
FAILURE!
java.lang.AssertionError: Assertions failed. Failing after waiting for timeout 80000 msecs
	at org.apache.atlas.AtlasBaseClient.callAPIWithResource(AtlasBaseClient.java:399)
	at org.apache.atlas.AtlasBaseClient.callAPIWithResource(AtlasBaseClient.java:327)
	at org.apache.atlas.AtlasBaseClient.callAPI(AtlasBaseClient.java:229)
	at org.apache.atlas.AtlasClientV2.getEntityByAttribute(AtlasClientV2.java:264)
	at org.apache.atlas.hbase.HBaseAtlasHookIT$1.evaluate(HBaseAtlasHookIT.java:258)
	at org.apache.atlas.hbase.HBaseAtlasHookIT.waitFor(HBaseAtlasHookIT.java:285)
	at org.apache.atlas.hbase.HBaseAtlasHookIT.assertEntityIsRegistered(HBaseAtlasHookIT.java:255)
	at org.apache.atlas.hbase.HBaseAtlasHookIT.assertTableIsRegistered(HBaseAtlasHookIT.java:234)
	at org.apache.atlas.hbase.HBaseAtlasHookIT.assertTableIsRegistered(HBaseAtlasHookIT.java:226)
	at org.apache.atlas.hbase.HBaseAtlasHookIT.testCreateTable(HBaseAtlasHookIT.java:133)


Results :

Failed tests: 
  HBaseAtlasHookIT.testCreateNamesapce:93->assertNameSpaceIsRegistered:213->assertNameSpaceIsRegistered:221->assertEntityIsRegistered:255->waitFor:289
Assertions failed. Failing after waiting for timeout 80000 msecs
  HBaseAtlasHookIT.testCreateTable:133->assertTableIsRegistered:226->assertTableIsRegistered:234->assertEntityIsRegistered:255->waitFor:289
Assertions failed. Failing after waiting for timeout 80000 msecs

Tests run: 2, Failures: 2, Errors: 0, Skipped: 0

[INFO] 
[INFO] --- jetty-maven-plugin:9.3.14.v20161028:stop (stop-jetty) @ hbase-bridge ---
[INFO] Waiting 10 seconds for jetty to stop
[INFO] Stopped ServerConnector@4b4b6363{HTTP/1.1,[http/1.1]}{0.0.0.0:31000}
[INFO] Closing Spring root WebApplicationContext
[INFO] Shutting down log4j
[INFO] Stopped o.e.j.m.p.JettyWebAppContext@6a0a99b0{/,file://<https://builds.apache.org/job/Atlas-master-IntegrationTests/ws/webapp/target/atlas-webapp-2.0.0-SNAPSHOT/,UNAVAILABLE}{/home/jenkins/jenkins-slave/workspace/Atlas-master-IntegrationTests/webapp/target/atlas-webapp-2.0.0-SNAPSHOT.war}>
[INFO] Server reports itself as stopped
[INFO] 
[INFO] --- maven-source-plugin:2.4:jar-no-fork (attach-sources) @ hbase-bridge ---
[INFO] Building jar: <https://builds.apache.org/job/Atlas-master-IntegrationTests/ws/addons/hbase-bridge/target/hbase-bridge-2.0.0-SNAPSHOT-sources.jar>
[INFO] 
[INFO] --- maven-source-plugin:2.4:test-jar-no-fork (attach-sources) @ hbase-bridge ---
[INFO] Building jar: <https://builds.apache.org/job/Atlas-master-IntegrationTests/ws/addons/hbase-bridge/target/hbase-bridge-2.0.0-SNAPSHOT-test-sources.jar>
[INFO] 
[INFO] --- maven-failsafe-plugin:2.18.1:verify (verify) @ hbase-bridge ---
[INFO] Failsafe report directory: <https://builds.apache.org/job/Atlas-master-IntegrationTests/ws/addons/hbase-bridge/target/failsafe-reports>
[INFO] ------------------------------------------------------------------------
[INFO] Reactor Summary:
[INFO] 
[INFO] Apache Atlas Server Build Tools 1.0 ................ SUCCESS [  0.873 s]
[INFO] apache-atlas 2.0.0-SNAPSHOT ........................ SUCCESS [  4.811 s]
[INFO] Apache Atlas Test Utility Tools .................... SUCCESS [ 29.211 s]
[INFO] Apache Atlas Integration ........................... SUCCESS [ 35.545 s]
[INFO] Apache Atlas Common ................................ SUCCESS [ 11.240 s]
[INFO] Apache Atlas Client ................................ SUCCESS [  0.975 s]
[INFO] atlas-client-common ................................ SUCCESS [ 11.064 s]
[INFO] atlas-client-v1 .................................... SUCCESS [  9.340 s]
[INFO] Apache Atlas Server API ............................ SUCCESS [  6.934 s]
[INFO] Apache Atlas Notification .......................... SUCCESS [ 13.505 s]
[INFO] atlas-client-v2 .................................... SUCCESS [  6.829 s]
[INFO] Apache Atlas Graph Database Projects ............... SUCCESS [  0.468 s]
[INFO] Apache Atlas Graph Database API .................... SUCCESS [  5.433 s]
[INFO] Graph Database Common Code ......................... SUCCESS [  5.349 s]
[INFO] Apache Atlas JanusGraph DB Impl .................... SUCCESS [ 31.613 s]
[INFO] Apache Atlas Graph Database Implementation Dependencies SUCCESS [  2.286 s]
[INFO] Shaded version of Apache hbase client .............. SUCCESS [  8.502 s]
[INFO] Shaded version of Apache hbase server .............. SUCCESS [ 23.689 s]
[INFO] Apache Atlas Authorization ......................... SUCCESS [  8.994 s]
[INFO] Apache Atlas Repository ............................ SUCCESS [ 46.856 s]
[INFO] Apache Atlas UI .................................... SUCCESS [02:04 min]
[INFO] Apache Atlas Web Application ....................... SUCCESS [09:29 min]
[INFO] Apache Atlas Documentation ......................... SUCCESS [  5.423 s]
[INFO] Apache Atlas FileSystem Model ...................... SUCCESS [  3.325 s]
[INFO] Apache Atlas Plugin Classloader .................... SUCCESS [  8.122 s]
[INFO] Apache Atlas Hive Bridge Shim ...................... SUCCESS [ 13.110 s]
[INFO] Apache Atlas Hive Bridge ........................... SUCCESS [10:14 min]
[INFO] Apache Atlas Falcon Bridge Shim .................... SUCCESS [  8.854 s]
[INFO] Apache Atlas Falcon Bridge ......................... SUCCESS [02:00 min]
[INFO] Apache Atlas Sqoop Bridge Shim ..................... SUCCESS [  4.318 s]
[INFO] Apache Atlas Sqoop Bridge .......................... SUCCESS [01:17 min]
[INFO] Apache Atlas Storm Bridge Shim ..................... SUCCESS [  6.653 s]
[INFO] Apache Atlas Storm Bridge .......................... SUCCESS [01:08 min]
[INFO] Apache Atlas Hbase Bridge Shim ..................... SUCCESS [  9.885 s]
[INFO] Apache Atlas Hbase Bridge .......................... FAILURE [04:38 min]
[INFO] Apache Atlas Kafka Bridge .......................... SKIPPED
[INFO] Apache Atlas Distribution 2.0.0-SNAPSHOT ........... SKIPPED
[INFO] ------------------------------------------------------------------------
[INFO] BUILD FAILURE
[INFO] ------------------------------------------------------------------------
[INFO] Total time: 36:19 min
[INFO] Finished at: 2018-08-20T19:09:38Z
[INFO] ------------------------------------------------------------------------
[ERROR] Failed to execute goal org.apache.maven.plugins:maven-failsafe-plugin:2.18.1:verify
(verify) on project hbase-bridge: There are test failures.
[ERROR] 
[ERROR] Please refer to <https://builds.apache.org/job/Atlas-master-IntegrationTests/ws/addons/hbase-bridge/target/failsafe-reports>
for the individual test results.
[ERROR] -> [Help 1]
[ERROR] 
[ERROR] To see the full stack trace of the errors, re-run Maven with the -e switch.
[ERROR] Re-run Maven using the -X switch to enable full debug logging.
[ERROR] 
[ERROR] For more information about the errors and possible solutions, please read the following
articles:
[ERROR] [Help 1] http://cwiki.apache.org/confluence/display/MAVEN/MojoFailureException
[ERROR] 
[ERROR] After correcting the problems, you can resume the build with the command
[ERROR]   mvn <goals> -rf :hbase-bridge
Build step 'Execute shell' marked build as failure
[CHECKSTYLE] Collecting checkstyle analysis files...
[CHECKSTYLE] Searching for all files in <https://builds.apache.org/job/Atlas-master-IntegrationTests/ws/>
that match the pattern **/target/checkstyle-result.xml
[CHECKSTYLE] Parsing 33 files in <https://builds.apache.org/job/Atlas-master-IntegrationTests/ws/>
[CHECKSTYLE] Successfully parsed file <https://builds.apache.org/job/Atlas-master-IntegrationTests/ws/addons/falcon-bridge-shim/target/checkstyle-result.xml>
with 29 unique warnings and 0 duplicates.
[CHECKSTYLE] Successfully parsed file <https://builds.apache.org/job/Atlas-master-IntegrationTests/ws/addons/falcon-bridge/target/checkstyle-result.xml>
with 393 unique warnings and 0 duplicates.
[CHECKSTYLE] Successfully parsed file <https://builds.apache.org/job/Atlas-master-IntegrationTests/ws/addons/hbase-bridge-shim/target/checkstyle-result.xml>
with 1831 unique warnings and 0 duplicates.
[CHECKSTYLE] Successfully parsed file <https://builds.apache.org/job/Atlas-master-IntegrationTests/ws/addons/hdfs-model/target/checkstyle-result.xml>
with 1831 unique warnings and 0 duplicates.
[CHECKSTYLE] Successfully parsed file <https://builds.apache.org/job/Atlas-master-IntegrationTests/ws/addons/hive-bridge-shim/target/checkstyle-result.xml>
with 1846 unique warnings and 0 duplicates.
[CHECKSTYLE] Successfully parsed file <https://builds.apache.org/job/Atlas-master-IntegrationTests/ws/addons/hive-bridge/target/checkstyle-result.xml>
with 4171 unique warnings and 0 duplicates.
[CHECKSTYLE] Successfully parsed file <https://builds.apache.org/job/Atlas-master-IntegrationTests/ws/addons/sqoop-bridge-shim/target/checkstyle-result.xml>
with 4187 unique warnings and 0 duplicates.
[CHECKSTYLE] Successfully parsed file <https://builds.apache.org/job/Atlas-master-IntegrationTests/ws/addons/sqoop-bridge/target/checkstyle-result.xml>
with 4334 unique warnings and 0 duplicates.
[CHECKSTYLE] Successfully parsed file <https://builds.apache.org/job/Atlas-master-IntegrationTests/ws/addons/storm-bridge-shim/target/checkstyle-result.xml>
with 4355 unique warnings and 0 duplicates.
[CHECKSTYLE] Successfully parsed file <https://builds.apache.org/job/Atlas-master-IntegrationTests/ws/addons/storm-bridge/target/checkstyle-result.xml>
with 4633 unique warnings and 0 duplicates.
[CHECKSTYLE] Successfully parsed file <https://builds.apache.org/job/Atlas-master-IntegrationTests/ws/authorization/target/checkstyle-result.xml>
with 5606 unique warnings and 0 duplicates.
[CHECKSTYLE] Successfully parsed file <https://builds.apache.org/job/Atlas-master-IntegrationTests/ws/client/client-v1/target/checkstyle-result.xml>
with 6505 unique warnings and 0 duplicates.
[CHECKSTYLE] Successfully parsed file <https://builds.apache.org/job/Atlas-master-IntegrationTests/ws/client/client-v2/target/checkstyle-result.xml>
with 6864 unique warnings and 0 duplicates.
[CHECKSTYLE] Successfully parsed file <https://builds.apache.org/job/Atlas-master-IntegrationTests/ws/client/common/target/checkstyle-result.xml>
with 7356 unique warnings and 0 duplicates.
[CHECKSTYLE] Successfully parsed file <https://builds.apache.org/job/Atlas-master-IntegrationTests/ws/client/target/checkstyle-result.xml>
with 7356 unique warnings and 0 duplicates.
[CHECKSTYLE] Successfully parsed file <https://builds.apache.org/job/Atlas-master-IntegrationTests/ws/common/target/checkstyle-result.xml>
with 8430 unique warnings and 0 duplicates.
[CHECKSTYLE] Successfully parsed file <https://builds.apache.org/job/Atlas-master-IntegrationTests/ws/dashboardv2/target/checkstyle-result.xml>
with 8430 unique warnings and 0 duplicates.
[CHECKSTYLE] Successfully parsed file <https://builds.apache.org/job/Atlas-master-IntegrationTests/ws/docs/target/checkstyle-result.xml>
with 8430 unique warnings and 0 duplicates.
[CHECKSTYLE] Successfully parsed file <https://builds.apache.org/job/Atlas-master-IntegrationTests/ws/graphdb/api/target/checkstyle-result.xml>
with 8732 unique warnings and 0 duplicates.
[CHECKSTYLE] Successfully parsed file <https://builds.apache.org/job/Atlas-master-IntegrationTests/ws/graphdb/common/target/checkstyle-result.xml>
with 8958 unique warnings and 0 duplicates.
[CHECKSTYLE] Successfully parsed file <https://builds.apache.org/job/Atlas-master-IntegrationTests/ws/graphdb/graphdb-impls/target/checkstyle-result.xml>
with 8958 unique warnings and 0 duplicates.
[CHECKSTYLE] Successfully parsed file <https://builds.apache.org/job/Atlas-master-IntegrationTests/ws/graphdb/janus/target/checkstyle-result.xml>
with 11280 unique warnings and 0 duplicates.
[CHECKSTYLE] Successfully parsed file <https://builds.apache.org/job/Atlas-master-IntegrationTests/ws/graphdb/target/checkstyle-result.xml>
with 11280 unique warnings and 0 duplicates.
[CHECKSTYLE] Successfully parsed file <https://builds.apache.org/job/Atlas-master-IntegrationTests/ws/intg/target/checkstyle-result.xml>
with 23377 unique warnings and 0 duplicates.
[CHECKSTYLE] Successfully parsed file <https://builds.apache.org/job/Atlas-master-IntegrationTests/ws/notification/target/checkstyle-result.xml>
with 24660 unique warnings and 0 duplicates.
[CHECKSTYLE] Successfully parsed file <https://builds.apache.org/job/Atlas-master-IntegrationTests/ws/plugin-classloader/target/checkstyle-result.xml>
with 24773 unique warnings and 0 duplicates.
[CHECKSTYLE] Successfully parsed file <https://builds.apache.org/job/Atlas-master-IntegrationTests/ws/repository/target/checkstyle-result.xml>
with 43904 unique warnings and 0 duplicates.
[CHECKSTYLE] Successfully parsed file <https://builds.apache.org/job/Atlas-master-IntegrationTests/ws/server-api/target/checkstyle-result.xml>
with 44072 unique warnings and 0 duplicates.
[CHECKSTYLE] Successfully parsed file <https://builds.apache.org/job/Atlas-master-IntegrationTests/ws/shaded/hbase-client-shaded/target/checkstyle-result.xml>
with 44072 unique warnings and 0 duplicates.
[CHECKSTYLE] Successfully parsed file <https://builds.apache.org/job/Atlas-master-IntegrationTests/ws/shaded/hbase-server-shaded/target/checkstyle-result.xml>
with 44072 unique warnings and 0 duplicates.
[CHECKSTYLE] Successfully parsed file <https://builds.apache.org/job/Atlas-master-IntegrationTests/ws/target/checkstyle-result.xml>
with 44072 unique warnings and 0 duplicates.
[CHECKSTYLE] Successfully parsed file <https://builds.apache.org/job/Atlas-master-IntegrationTests/ws/test-tools/target/checkstyle-result.xml>
with 44110 unique warnings and 0 duplicates.
[CHECKSTYLE] Successfully parsed file <https://builds.apache.org/job/Atlas-master-IntegrationTests/ws/webapp/target/checkstyle-result.xml>
with 52471 unique warnings and 0 duplicates.
<Git Blamer> Using GitBlamer to create author and commit information for all warnings.
<Git Blamer> GIT_COMMIT=5b406348cb51a871fdf388f676c68102f647afac, workspace=<https://builds.apache.org/job/Atlas-master-IntegrationTests/ws/>
 > git rev-parse 5b406348cb51a871fdf388f676c68102f647afac^{commit} # timeout=10
[CHECKSTYLE] Computing warning deltas based on reference build #2176
[FINDBUGS] Collecting findbugs analysis files...
[FINDBUGS] Searching for all files in <https://builds.apache.org/job/Atlas-master-IntegrationTests/ws/>
that match the pattern **/target/findbugs.xml
[FINDBUGS] Parsing 24 files in <https://builds.apache.org/job/Atlas-master-IntegrationTests/ws/>
[FINDBUGS] Successfully parsed file <https://builds.apache.org/job/Atlas-master-IntegrationTests/ws/addons/falcon-bridge-shim/target/findbugs.xml>
with 0 unique warnings and 0 duplicates.
[FINDBUGS] Successfully parsed file <https://builds.apache.org/job/Atlas-master-IntegrationTests/ws/addons/falcon-bridge/target/findbugs.xml>
with 0 unique warnings and 0 duplicates.
[FINDBUGS] Successfully parsed file <https://builds.apache.org/job/Atlas-master-IntegrationTests/ws/addons/hbase-bridge-shim/target/findbugs.xml>
with 0 unique warnings and 0 duplicates.
[FINDBUGS] Successfully parsed file <https://builds.apache.org/job/Atlas-master-IntegrationTests/ws/addons/hive-bridge-shim/target/findbugs.xml>
with 0 unique warnings and 0 duplicates.
[FINDBUGS] Successfully parsed file <https://builds.apache.org/job/Atlas-master-IntegrationTests/ws/addons/hive-bridge/target/findbugs.xml>
with 0 unique warnings and 0 duplicates.
[FINDBUGS] Successfully parsed file <https://builds.apache.org/job/Atlas-master-IntegrationTests/ws/addons/sqoop-bridge-shim/target/findbugs.xml>
with 0 unique warnings and 0 duplicates.
[FINDBUGS] Successfully parsed file <https://builds.apache.org/job/Atlas-master-IntegrationTests/ws/addons/sqoop-bridge/target/findbugs.xml>
with 0 unique warnings and 0 duplicates.
[FINDBUGS] Successfully parsed file <https://builds.apache.org/job/Atlas-master-IntegrationTests/ws/addons/storm-bridge-shim/target/findbugs.xml>
with 0 unique warnings and 0 duplicates.
[FINDBUGS] Successfully parsed file <https://builds.apache.org/job/Atlas-master-IntegrationTests/ws/addons/storm-bridge/target/findbugs.xml>
with 0 unique warnings and 0 duplicates.
[FINDBUGS] Successfully parsed file <https://builds.apache.org/job/Atlas-master-IntegrationTests/ws/authorization/target/findbugs.xml>
with 0 unique warnings and 0 duplicates.
[FINDBUGS] Successfully parsed file <https://builds.apache.org/job/Atlas-master-IntegrationTests/ws/client/client-v1/target/findbugs.xml>
with 0 unique warnings and 0 duplicates.
[FINDBUGS] Successfully parsed file <https://builds.apache.org/job/Atlas-master-IntegrationTests/ws/client/client-v2/target/findbugs.xml>
with 0 unique warnings and 0 duplicates.
[FINDBUGS] Successfully parsed file <https://builds.apache.org/job/Atlas-master-IntegrationTests/ws/client/common/target/findbugs.xml>
with 0 unique warnings and 0 duplicates.
[FINDBUGS] Successfully parsed file <https://builds.apache.org/job/Atlas-master-IntegrationTests/ws/common/target/findbugs.xml>
with 0 unique warnings and 0 duplicates.
[FINDBUGS] Successfully parsed file <https://builds.apache.org/job/Atlas-master-IntegrationTests/ws/graphdb/api/target/findbugs.xml>
with 0 unique warnings and 0 duplicates.
[FINDBUGS] Successfully parsed file <https://builds.apache.org/job/Atlas-master-IntegrationTests/ws/graphdb/common/target/findbugs.xml>
with 0 unique warnings and 0 duplicates.
[FINDBUGS] Successfully parsed file <https://builds.apache.org/job/Atlas-master-IntegrationTests/ws/graphdb/janus/target/findbugs.xml>
with 0 unique warnings and 0 duplicates.
[FINDBUGS] Successfully parsed file <https://builds.apache.org/job/Atlas-master-IntegrationTests/ws/intg/target/findbugs.xml>
with 0 unique warnings and 0 duplicates.
[FINDBUGS] Successfully parsed file <https://builds.apache.org/job/Atlas-master-IntegrationTests/ws/notification/target/findbugs.xml>
with 0 unique warnings and 0 duplicates.
[FINDBUGS] Successfully parsed file <https://builds.apache.org/job/Atlas-master-IntegrationTests/ws/plugin-classloader/target/findbugs.xml>
with 0 unique warnings and 0 duplicates.
[FINDBUGS] Successfully parsed file <https://builds.apache.org/job/Atlas-master-IntegrationTests/ws/repository/target/findbugs.xml>
with 0 unique warnings and 0 duplicates.
[FINDBUGS] Successfully parsed file <https://builds.apache.org/job/Atlas-master-IntegrationTests/ws/server-api/target/findbugs.xml>
with 0 unique warnings and 0 duplicates.
[FINDBUGS] Successfully parsed file <https://builds.apache.org/job/Atlas-master-IntegrationTests/ws/test-tools/target/findbugs.xml>
with 0 unique warnings and 0 duplicates.
[FINDBUGS] Successfully parsed file <https://builds.apache.org/job/Atlas-master-IntegrationTests/ws/webapp/target/findbugs.xml>
with 0 unique warnings and 0 duplicates.
<Git Blamer> Using GitBlamer to create author and commit information for all warnings.
<Git Blamer> GIT_COMMIT=5b406348cb51a871fdf388f676c68102f647afac, workspace=<https://builds.apache.org/job/Atlas-master-IntegrationTests/ws/>
[FINDBUGS] Computing warning deltas based on reference build #2176
Archiving artifacts
[Fast Archiver] Compressed 170.14 MB of artifacts by 84.5% relative to #2176
TestNG Reports Processing: START
Looking for TestNG results report in workspace using pattern: **/target/surefire-reports/testng-results.xml,**/target/failsafe-reports/testng-results.xml
Saving reports...
Processing '/x1/jenkins/jenkins-home/jobs/Atlas-master-IntegrationTests/builds/2177/testng/testng-results-1.xml'
Processing '/x1/jenkins/jenkins-home/jobs/Atlas-master-IntegrationTests/builds/2177/testng/testng-results-2.xml'
Processing '/x1/jenkins/jenkins-home/jobs/Atlas-master-IntegrationTests/builds/2177/testng/testng-results-3.xml'
Processing '/x1/jenkins/jenkins-home/jobs/Atlas-master-IntegrationTests/builds/2177/testng/testng-results-4.xml'
Processing '/x1/jenkins/jenkins-home/jobs/Atlas-master-IntegrationTests/builds/2177/testng/testng-results-5.xml'
Processing '/x1/jenkins/jenkins-home/jobs/Atlas-master-IntegrationTests/builds/2177/testng/testng-results.xml'
1.169591% of tests failed, which exceeded threshold of 0%. Marking build as UNSTABLE
TestNG Reports Processing: FINISH

Mime
View raw message