atlas-dev mailing list archives

Site index · List index
Message view « Date » · « Thread »
Top « Date » · « Thread »
From Apache Jenkins Server <jenk...@builds.apache.org>
Subject Build failed in Jenkins: Atlas-1.0-AllTests #788
Date Thu, 16 Aug 2018 22:37:44 GMT
See <https://builds.apache.org/job/Atlas-1.0-AllTests/788/display/redirect>

------------------------------------------
[...truncated 813.53 KB...]
    at org.codehaus.plexus.classworlds.launcher.Launcher.launch (Launcher.java:229)
    at org.codehaus.plexus.classworlds.launcher.Launcher.mainWithExitCode (Launcher.java:415)
    at org.codehaus.plexus.classworlds.launcher.Launcher.main (Launcher.java:356)
[INFO] Started ServerConnector@2811025a{HTTP/1.1,[http/1.1]}{0.0.0.0:31000}
[INFO] Started @2565221ms
[INFO] Started Jetty Server
[INFO] 
[INFO] --- maven-failsafe-plugin:2.18.1:integration-test (integration-test) @ hbase-bridge
---
[WARNING] useSystemClassloader setting has no effect when not forking
[INFO] Failsafe report directory: <https://builds.apache.org/job/Atlas-1.0-AllTests/ws/addons/hbase-bridge/target/failsafe-reports>
Running org.apache.atlas.hbase.HBaseAtlasHookIT
127.0.0.1 - - [16/Aug/2018:22:23:19 +0000] "GET //localhost:31000/api/atlas/v2/entity/uniqueAttribute/type/hbase_namespace?attr:qualifiedName=test_namespace@primary
HTTP/1.1" 503 383 "-" "Java/1.8.0_172"
127.0.0.1 - - [16/Aug/2018:22:23:24 +0000] "GET //localhost:31000/api/atlas/v2/entity/uniqueAttribute/type/hbase_namespace?attr:qualifiedName=test_namespace@primary
HTTP/1.1" 503 383 "-" "Java/1.8.0_172"
127.0.0.1 - - [16/Aug/2018:22:23:29 +0000] "GET //localhost:31000/api/atlas/v2/entity/uniqueAttribute/type/hbase_namespace?attr:qualifiedName=test_namespace@primary
HTTP/1.1" 503 383 "-" "Java/1.8.0_172"
127.0.0.1 - - [16/Aug/2018:22:23:34 +0000] "GET //localhost:31000/api/atlas/v2/entity/uniqueAttribute/type/hbase_namespace?attr:qualifiedName=test_namespace@primary
HTTP/1.1" 503 383 "-" "Java/1.8.0_172"
127.0.0.1 - - [16/Aug/2018:22:23:44 +0000] "GET //localhost:31000/api/atlas/v2/entity/uniqueAttribute/type/hbase_namespace?attr:qualifiedName=test_namespace@primary
HTTP/1.1" 503 383 "-" "Java/1.8.0_172"
127.0.0.1 - - [16/Aug/2018:22:23:49 +0000] "GET //localhost:31000/api/atlas/v2/entity/uniqueAttribute/type/hbase_namespace?attr:qualifiedName=test_namespace@primary
HTTP/1.1" 503 383 "-" "Java/1.8.0_172"
127.0.0.1 - - [16/Aug/2018:22:23:54 +0000] "GET //localhost:31000/api/atlas/v2/entity/uniqueAttribute/type/hbase_namespace?attr:qualifiedName=test_namespace@primary
HTTP/1.1" 503 383 "-" "Java/1.8.0_172"
127.0.0.1 - - [16/Aug/2018:22:23:59 +0000] "GET //localhost:31000/api/atlas/v2/entity/uniqueAttribute/type/hbase_namespace?attr:qualifiedName=test_namespace@primary
HTTP/1.1" 503 383 "-" "Java/1.8.0_172"
127.0.0.1 - - [16/Aug/2018:22:24:09 +0000] "GET //localhost:31000/api/atlas/v2/entity/uniqueAttribute/type/hbase_namespace?attr:qualifiedName=test_namespace@primary
HTTP/1.1" 503 383 "-" "Java/1.8.0_172"
127.0.0.1 - - [16/Aug/2018:22:24:14 +0000] "GET //localhost:31000/api/atlas/v2/entity/uniqueAttribute/type/hbase_namespace?attr:qualifiedName=test_namespace@primary
HTTP/1.1" 503 383 "-" "Java/1.8.0_172"
127.0.0.1 - - [16/Aug/2018:22:24:19 +0000] "GET //localhost:31000/api/atlas/v2/entity/uniqueAttribute/type/hbase_namespace?attr:qualifiedName=test_namespace@primary
HTTP/1.1" 503 383 "-" "Java/1.8.0_172"
127.0.0.1 - - [16/Aug/2018:22:24:24 +0000] "GET //localhost:31000/api/atlas/v2/entity/uniqueAttribute/type/hbase_namespace?attr:qualifiedName=test_namespace@primary
HTTP/1.1" 503 383 "-" "Java/1.8.0_172"
127.0.0.1 - - [16/Aug/2018:22:24:34 +0000] "GET //localhost:31000/api/atlas/v2/entity/uniqueAttribute/type/hbase_namespace?attr:qualifiedName=test_namespace@primary
HTTP/1.1" 503 383 "-" "Java/1.8.0_172"
127.0.0.1 - - [16/Aug/2018:22:24:39 +0000] "GET //localhost:31000/api/atlas/v2/entity/uniqueAttribute/type/hbase_namespace?attr:qualifiedName=test_namespace@primary
HTTP/1.1" 503 383 "-" "Java/1.8.0_172"
127.0.0.1 - - [16/Aug/2018:22:24:44 +0000] "GET //localhost:31000/api/atlas/v2/entity/uniqueAttribute/type/hbase_namespace?attr:qualifiedName=test_namespace@primary
HTTP/1.1" 503 383 "-" "Java/1.8.0_172"
127.0.0.1 - - [16/Aug/2018:22:24:49 +0000] "GET //localhost:31000/api/atlas/v2/entity/uniqueAttribute/type/hbase_namespace?attr:qualifiedName=test_namespace@primary
HTTP/1.1" 503 383 "-" "Java/1.8.0_172"
127.0.0.1 - - [16/Aug/2018:22:25:12 +0000] "GET //localhost:31000/api/atlas/v2/entity/uniqueAttribute/type/hbase_table?attr:qualifiedName=test_namespace1:test_table@primary
HTTP/1.1" 503 379 "-" "Java/1.8.0_172"
127.0.0.1 - - [16/Aug/2018:22:25:17 +0000] "GET //localhost:31000/api/atlas/v2/entity/uniqueAttribute/type/hbase_table?attr:qualifiedName=test_namespace1:test_table@primary
HTTP/1.1" 503 379 "-" "Java/1.8.0_172"
127.0.0.1 - - [16/Aug/2018:22:25:22 +0000] "GET //localhost:31000/api/atlas/v2/entity/uniqueAttribute/type/hbase_table?attr:qualifiedName=test_namespace1:test_table@primary
HTTP/1.1" 503 379 "-" "Java/1.8.0_172"
127.0.0.1 - - [16/Aug/2018:22:25:27 +0000] "GET //localhost:31000/api/atlas/v2/entity/uniqueAttribute/type/hbase_table?attr:qualifiedName=test_namespace1:test_table@primary
HTTP/1.1" 503 379 "-" "Java/1.8.0_172"
127.0.0.1 - - [16/Aug/2018:22:25:37 +0000] "GET //localhost:31000/api/atlas/v2/entity/uniqueAttribute/type/hbase_table?attr:qualifiedName=test_namespace1:test_table@primary
HTTP/1.1" 503 379 "-" "Java/1.8.0_172"
127.0.0.1 - - [16/Aug/2018:22:25:42 +0000] "GET //localhost:31000/api/atlas/v2/entity/uniqueAttribute/type/hbase_table?attr:qualifiedName=test_namespace1:test_table@primary
HTTP/1.1" 503 379 "-" "Java/1.8.0_172"
127.0.0.1 - - [16/Aug/2018:22:25:47 +0000] "GET //localhost:31000/api/atlas/v2/entity/uniqueAttribute/type/hbase_table?attr:qualifiedName=test_namespace1:test_table@primary
HTTP/1.1" 503 379 "-" "Java/1.8.0_172"
127.0.0.1 - - [16/Aug/2018:22:25:52 +0000] "GET //localhost:31000/api/atlas/v2/entity/uniqueAttribute/type/hbase_table?attr:qualifiedName=test_namespace1:test_table@primary
HTTP/1.1" 503 379 "-" "Java/1.8.0_172"
127.0.0.1 - - [16/Aug/2018:22:26:02 +0000] "GET //localhost:31000/api/atlas/v2/entity/uniqueAttribute/type/hbase_table?attr:qualifiedName=test_namespace1:test_table@primary
HTTP/1.1" 503 379 "-" "Java/1.8.0_172"
127.0.0.1 - - [16/Aug/2018:22:26:07 +0000] "GET //localhost:31000/api/atlas/v2/entity/uniqueAttribute/type/hbase_table?attr:qualifiedName=test_namespace1:test_table@primary
HTTP/1.1" 503 379 "-" "Java/1.8.0_172"
127.0.0.1 - - [16/Aug/2018:22:26:12 +0000] "GET //localhost:31000/api/atlas/v2/entity/uniqueAttribute/type/hbase_table?attr:qualifiedName=test_namespace1:test_table@primary
HTTP/1.1" 503 379 "-" "Java/1.8.0_172"
127.0.0.1 - - [16/Aug/2018:22:26:17 +0000] "GET //localhost:31000/api/atlas/v2/entity/uniqueAttribute/type/hbase_table?attr:qualifiedName=test_namespace1:test_table@primary
HTTP/1.1" 503 379 "-" "Java/1.8.0_172"
127.0.0.1 - - [16/Aug/2018:22:26:27 +0000] "GET //localhost:31000/api/atlas/v2/entity/uniqueAttribute/type/hbase_table?attr:qualifiedName=test_namespace1:test_table@primary
HTTP/1.1" 503 379 "-" "Java/1.8.0_172"
127.0.0.1 - - [16/Aug/2018:22:26:32 +0000] "GET //localhost:31000/api/atlas/v2/entity/uniqueAttribute/type/hbase_table?attr:qualifiedName=test_namespace1:test_table@primary
HTTP/1.1" 503 379 "-" "Java/1.8.0_172"
127.0.0.1 - - [16/Aug/2018:22:26:37 +0000] "GET //localhost:31000/api/atlas/v2/entity/uniqueAttribute/type/hbase_table?attr:qualifiedName=test_namespace1:test_table@primary
HTTP/1.1" 503 379 "-" "Java/1.8.0_172"
127.0.0.1 - - [16/Aug/2018:22:26:42 +0000] "GET //localhost:31000/api/atlas/v2/entity/uniqueAttribute/type/hbase_table?attr:qualifiedName=test_namespace1:test_table@primary
HTTP/1.1" 503 379 "-" "Java/1.8.0_172"
Tests run: 2, Failures: 2, Errors: 0, Skipped: 0, Time elapsed: 241.213 sec <<< FAILURE!
- in org.apache.atlas.hbase.HBaseAtlasHookIT
testCreateNamesapce(org.apache.atlas.hbase.HBaseAtlasHookIT)  Time elapsed: 95.288 sec  <<<
FAILURE!
java.lang.AssertionError: Assertions failed. Failing after waiting for timeout 80000 msecs
	at org.apache.atlas.AtlasBaseClient.callAPIWithResource(AtlasBaseClient.java:399)
	at org.apache.atlas.AtlasBaseClient.callAPIWithResource(AtlasBaseClient.java:327)
	at org.apache.atlas.AtlasBaseClient.callAPI(AtlasBaseClient.java:229)
	at org.apache.atlas.AtlasClientV2.getEntityByAttribute(AtlasClientV2.java:264)
	at org.apache.atlas.hbase.HBaseAtlasHookIT$1.evaluate(HBaseAtlasHookIT.java:258)
	at org.apache.atlas.hbase.HBaseAtlasHookIT.waitFor(HBaseAtlasHookIT.java:285)
	at org.apache.atlas.hbase.HBaseAtlasHookIT.assertEntityIsRegistered(HBaseAtlasHookIT.java:255)
	at org.apache.atlas.hbase.HBaseAtlasHookIT.assertNameSpaceIsRegistered(HBaseAtlasHookIT.java:221)
	at org.apache.atlas.hbase.HBaseAtlasHookIT.assertNameSpaceIsRegistered(HBaseAtlasHookIT.java:213)
	at org.apache.atlas.hbase.HBaseAtlasHookIT.testCreateNamesapce(HBaseAtlasHookIT.java:93)

testCreateTable(org.apache.atlas.hbase.HBaseAtlasHookIT)  Time elapsed: 113.551 sec  <<<
FAILURE!
java.lang.AssertionError: Assertions failed. Failing after waiting for timeout 80000 msecs
	at org.apache.atlas.AtlasBaseClient.callAPIWithResource(AtlasBaseClient.java:399)
	at org.apache.atlas.AtlasBaseClient.callAPIWithResource(AtlasBaseClient.java:327)
	at org.apache.atlas.AtlasBaseClient.callAPI(AtlasBaseClient.java:229)
	at org.apache.atlas.AtlasClientV2.getEntityByAttribute(AtlasClientV2.java:264)
	at org.apache.atlas.hbase.HBaseAtlasHookIT$1.evaluate(HBaseAtlasHookIT.java:258)
	at org.apache.atlas.hbase.HBaseAtlasHookIT.waitFor(HBaseAtlasHookIT.java:285)
	at org.apache.atlas.hbase.HBaseAtlasHookIT.assertEntityIsRegistered(HBaseAtlasHookIT.java:255)
	at org.apache.atlas.hbase.HBaseAtlasHookIT.assertTableIsRegistered(HBaseAtlasHookIT.java:234)
	at org.apache.atlas.hbase.HBaseAtlasHookIT.assertTableIsRegistered(HBaseAtlasHookIT.java:226)
	at org.apache.atlas.hbase.HBaseAtlasHookIT.testCreateTable(HBaseAtlasHookIT.java:133)


Results :

Failed tests: 
  HBaseAtlasHookIT.testCreateNamesapce:93->assertNameSpaceIsRegistered:213->assertNameSpaceIsRegistered:221->assertEntityIsRegistered:255->waitFor:289
Assertions failed. Failing after waiting for timeout 80000 msecs
  HBaseAtlasHookIT.testCreateTable:133->assertTableIsRegistered:226->assertTableIsRegistered:234->assertEntityIsRegistered:255->waitFor:289
Assertions failed. Failing after waiting for timeout 80000 msecs

Tests run: 2, Failures: 2, Errors: 0, Skipped: 0

[INFO] 
[INFO] --- jetty-maven-plugin:9.3.14.v20161028:stop (stop-jetty) @ hbase-bridge ---
[INFO] Waiting 10 seconds for jetty to stop
[INFO] Stopped ServerConnector@2811025a{HTTP/1.1,[http/1.1]}{0.0.0.0:31000}
[INFO] Closing Spring root WebApplicationContext
[INFO] Shutting down log4j
[INFO] Stopped o.e.j.m.p.JettyWebAppContext@4ecbcce2{/,file://<https://builds.apache.org/job/Atlas-1.0-AllTests/ws/webapp/target/atlas-webapp-1.1.0-SNAPSHOT/,UNAVAILABLE}{/home/jenkins/jenkins-slave/workspace/Atlas-1.0-AllTests/webapp/target/atlas-webapp-1.1.0-SNAPSHOT.war}>
[INFO] Server reports itself as stopped
[INFO] 
[INFO] --- maven-source-plugin:2.4:jar-no-fork (attach-sources) @ hbase-bridge ---
[INFO] Building jar: <https://builds.apache.org/job/Atlas-1.0-AllTests/ws/addons/hbase-bridge/target/hbase-bridge-1.1.0-SNAPSHOT-sources.jar>
[INFO] 
[INFO] --- maven-source-plugin:2.4:test-jar-no-fork (attach-sources) @ hbase-bridge ---
[INFO] Building jar: <https://builds.apache.org/job/Atlas-1.0-AllTests/ws/addons/hbase-bridge/target/hbase-bridge-1.1.0-SNAPSHOT-test-sources.jar>
[INFO] 
[INFO] --- maven-failsafe-plugin:2.18.1:verify (verify) @ hbase-bridge ---
[INFO] Failsafe report directory: <https://builds.apache.org/job/Atlas-1.0-AllTests/ws/addons/hbase-bridge/target/failsafe-reports>
[INFO] ------------------------------------------------------------------------
[INFO] Reactor Summary:
[INFO] 
[INFO] Apache Atlas Server Build Tools 1.0 ................ SUCCESS [  0.808 s]
[INFO] apache-atlas 1.1.0-SNAPSHOT ........................ SUCCESS [  4.351 s]
[INFO] Apache Atlas Test Utility Tools .................... SUCCESS [ 10.889 s]
[INFO] Apache Atlas Integration ........................... SUCCESS [01:00 min]
[INFO] Apache Atlas Common ................................ SUCCESS [  9.801 s]
[INFO] Apache Atlas Client ................................ SUCCESS [  0.631 s]
[INFO] atlas-client-common ................................ SUCCESS [  7.373 s]
[INFO] atlas-client-v1 .................................... SUCCESS [  9.496 s]
[INFO] Apache Atlas Server API ............................ SUCCESS [  5.816 s]
[INFO] Apache Atlas Notification .......................... SUCCESS [ 30.549 s]
[INFO] atlas-client-v2 .................................... SUCCESS [  5.832 s]
[INFO] Apache Atlas Graph Database Projects ............... SUCCESS [  0.508 s]
[INFO] Apache Atlas Graph Database API .................... SUCCESS [  5.129 s]
[INFO] Graph Database Common Code ......................... SUCCESS [  5.296 s]
[INFO] Apache Atlas JanusGraph DB Impl .................... SUCCESS [02:41 min]
[INFO] Apache Atlas Graph Database Implementation Dependencies SUCCESS [  2.544 s]
[INFO] Shaded version of Apache hbase client .............. SUCCESS [  9.482 s]
[INFO] Shaded version of Apache hbase server .............. SUCCESS [ 21.668 s]
[INFO] Apache Atlas Authorization ......................... SUCCESS [  9.653 s]
[INFO] Apache Atlas Repository ............................ SUCCESS [08:07 min]
[INFO] Apache Atlas UI .................................... SUCCESS [02:01 min]
[INFO] Apache Atlas Web Application ....................... SUCCESS [13:02 min]
[INFO] Apache Atlas Documentation ......................... SUCCESS [  5.297 s]
[INFO] Apache Atlas FileSystem Model ...................... SUCCESS [  2.898 s]
[INFO] Apache Atlas Plugin Classloader .................... SUCCESS [  7.619 s]
[INFO] Apache Atlas Hive Bridge Shim ...................... SUCCESS [  5.028 s]
[INFO] Apache Atlas Hive Bridge ........................... SUCCESS [07:48 min]
[INFO] Apache Atlas Falcon Bridge Shim .................... SUCCESS [  7.467 s]
[INFO] Apache Atlas Falcon Bridge ......................... SUCCESS [01:10 min]
[INFO] Apache Atlas Sqoop Bridge Shim ..................... SUCCESS [  4.687 s]
[INFO] Apache Atlas Sqoop Bridge .......................... SUCCESS [01:14 min]
[INFO] Apache Atlas Storm Bridge Shim ..................... SUCCESS [  8.204 s]
[INFO] Apache Atlas Storm Bridge .......................... SUCCESS [01:20 min]
[INFO] Apache Atlas Hbase Bridge Shim ..................... SUCCESS [ 11.646 s]
[INFO] Apache Atlas Hbase Bridge .......................... FAILURE [05:04 min]
[INFO] Apache Atlas Kafka Bridge .......................... SKIPPED
[INFO] Apache Atlas Distribution 1.1.0-SNAPSHOT ........... SKIPPED
[INFO] ------------------------------------------------------------------------
[INFO] BUILD FAILURE
[INFO] ------------------------------------------------------------------------
[INFO] Total time: 46:46 min
[INFO] Finished at: 2018-08-16T22:26:57Z
[INFO] ------------------------------------------------------------------------
[ERROR] Failed to execute goal org.apache.maven.plugins:maven-failsafe-plugin:2.18.1:verify
(verify) on project hbase-bridge: There are test failures.
[ERROR] 
[ERROR] Please refer to <https://builds.apache.org/job/Atlas-1.0-AllTests/ws/addons/hbase-bridge/target/failsafe-reports>
for the individual test results.
[ERROR] -> [Help 1]
[ERROR] 
[ERROR] To see the full stack trace of the errors, re-run Maven with the -e switch.
[ERROR] Re-run Maven using the -X switch to enable full debug logging.
[ERROR] 
[ERROR] For more information about the errors and possible solutions, please read the following
articles:
[ERROR] [Help 1] http://cwiki.apache.org/confluence/display/MAVEN/MojoFailureException
[ERROR] 
[ERROR] After correcting the problems, you can resume the build with the command
[ERROR]   mvn <goals> -rf :hbase-bridge
Build step 'Execute shell' marked build as failure
[CHECKSTYLE] Collecting checkstyle analysis files...
[CHECKSTYLE] Searching for all files in <https://builds.apache.org/job/Atlas-1.0-AllTests/ws/>
that match the pattern **/target/checkstyle-result.xml
[CHECKSTYLE] Parsing 33 files in <https://builds.apache.org/job/Atlas-1.0-AllTests/ws/>
[CHECKSTYLE] Successfully parsed file <https://builds.apache.org/job/Atlas-1.0-AllTests/ws/addons/falcon-bridge-shim/target/checkstyle-result.xml>
with 29 unique warnings and 0 duplicates.
[CHECKSTYLE] Successfully parsed file <https://builds.apache.org/job/Atlas-1.0-AllTests/ws/addons/falcon-bridge/target/checkstyle-result.xml>
with 393 unique warnings and 0 duplicates.
[CHECKSTYLE] Successfully parsed file <https://builds.apache.org/job/Atlas-1.0-AllTests/ws/addons/hbase-bridge-shim/target/checkstyle-result.xml>
with 1831 unique warnings and 0 duplicates.
[CHECKSTYLE] Successfully parsed file <https://builds.apache.org/job/Atlas-1.0-AllTests/ws/addons/hdfs-model/target/checkstyle-result.xml>
with 1831 unique warnings and 0 duplicates.
[CHECKSTYLE] Successfully parsed file <https://builds.apache.org/job/Atlas-1.0-AllTests/ws/addons/hive-bridge-shim/target/checkstyle-result.xml>
with 1846 unique warnings and 0 duplicates.
[CHECKSTYLE] Successfully parsed file <https://builds.apache.org/job/Atlas-1.0-AllTests/ws/addons/hive-bridge/target/checkstyle-result.xml>
with 4171 unique warnings and 0 duplicates.
[CHECKSTYLE] Successfully parsed file <https://builds.apache.org/job/Atlas-1.0-AllTests/ws/addons/sqoop-bridge-shim/target/checkstyle-result.xml>
with 4187 unique warnings and 0 duplicates.
[CHECKSTYLE] Successfully parsed file <https://builds.apache.org/job/Atlas-1.0-AllTests/ws/addons/sqoop-bridge/target/checkstyle-result.xml>
with 4334 unique warnings and 0 duplicates.
[CHECKSTYLE] Successfully parsed file <https://builds.apache.org/job/Atlas-1.0-AllTests/ws/addons/storm-bridge-shim/target/checkstyle-result.xml>
with 4355 unique warnings and 0 duplicates.
[CHECKSTYLE] Successfully parsed file <https://builds.apache.org/job/Atlas-1.0-AllTests/ws/addons/storm-bridge/target/checkstyle-result.xml>
with 4633 unique warnings and 0 duplicates.
[CHECKSTYLE] Successfully parsed file <https://builds.apache.org/job/Atlas-1.0-AllTests/ws/authorization/target/checkstyle-result.xml>
with 5606 unique warnings and 0 duplicates.
[CHECKSTYLE] Successfully parsed file <https://builds.apache.org/job/Atlas-1.0-AllTests/ws/client/client-v1/target/checkstyle-result.xml>
with 6505 unique warnings and 0 duplicates.
[CHECKSTYLE] Successfully parsed file <https://builds.apache.org/job/Atlas-1.0-AllTests/ws/client/client-v2/target/checkstyle-result.xml>
with 6864 unique warnings and 0 duplicates.
[CHECKSTYLE] Successfully parsed file <https://builds.apache.org/job/Atlas-1.0-AllTests/ws/client/common/target/checkstyle-result.xml>
with 7356 unique warnings and 0 duplicates.
[CHECKSTYLE] Successfully parsed file <https://builds.apache.org/job/Atlas-1.0-AllTests/ws/client/target/checkstyle-result.xml>
with 7356 unique warnings and 0 duplicates.
[CHECKSTYLE] Successfully parsed file <https://builds.apache.org/job/Atlas-1.0-AllTests/ws/common/target/checkstyle-result.xml>
with 8417 unique warnings and 0 duplicates.
[CHECKSTYLE] Successfully parsed file <https://builds.apache.org/job/Atlas-1.0-AllTests/ws/dashboardv2/target/checkstyle-result.xml>
with 8417 unique warnings and 0 duplicates.
[CHECKSTYLE] Successfully parsed file <https://builds.apache.org/job/Atlas-1.0-AllTests/ws/docs/target/checkstyle-result.xml>
with 8417 unique warnings and 0 duplicates.
[CHECKSTYLE] Successfully parsed file <https://builds.apache.org/job/Atlas-1.0-AllTests/ws/graphdb/api/target/checkstyle-result.xml>
with 8719 unique warnings and 0 duplicates.
[CHECKSTYLE] Successfully parsed file <https://builds.apache.org/job/Atlas-1.0-AllTests/ws/graphdb/common/target/checkstyle-result.xml>
with 8945 unique warnings and 0 duplicates.
[CHECKSTYLE] Successfully parsed file <https://builds.apache.org/job/Atlas-1.0-AllTests/ws/graphdb/graphdb-impls/target/checkstyle-result.xml>
with 8945 unique warnings and 0 duplicates.
[CHECKSTYLE] Successfully parsed file <https://builds.apache.org/job/Atlas-1.0-AllTests/ws/graphdb/janus/target/checkstyle-result.xml>
with 11267 unique warnings and 0 duplicates.
[CHECKSTYLE] Successfully parsed file <https://builds.apache.org/job/Atlas-1.0-AllTests/ws/graphdb/target/checkstyle-result.xml>
with 11267 unique warnings and 0 duplicates.
[CHECKSTYLE] Successfully parsed file <https://builds.apache.org/job/Atlas-1.0-AllTests/ws/intg/target/checkstyle-result.xml>
with 23328 unique warnings and 0 duplicates.
[CHECKSTYLE] Successfully parsed file <https://builds.apache.org/job/Atlas-1.0-AllTests/ws/notification/target/checkstyle-result.xml>
with 24603 unique warnings and 0 duplicates.
[CHECKSTYLE] Successfully parsed file <https://builds.apache.org/job/Atlas-1.0-AllTests/ws/plugin-classloader/target/checkstyle-result.xml>
with 24716 unique warnings and 0 duplicates.
[CHECKSTYLE] Successfully parsed file <https://builds.apache.org/job/Atlas-1.0-AllTests/ws/repository/target/checkstyle-result.xml>
with 43841 unique warnings and 0 duplicates.
[CHECKSTYLE] Successfully parsed file <https://builds.apache.org/job/Atlas-1.0-AllTests/ws/server-api/target/checkstyle-result.xml>
with 44009 unique warnings and 0 duplicates.
[CHECKSTYLE] Successfully parsed file <https://builds.apache.org/job/Atlas-1.0-AllTests/ws/shaded/hbase-client-shaded/target/checkstyle-result.xml>
with 44009 unique warnings and 0 duplicates.
[CHECKSTYLE] Successfully parsed file <https://builds.apache.org/job/Atlas-1.0-AllTests/ws/shaded/hbase-server-shaded/target/checkstyle-result.xml>
with 44009 unique warnings and 0 duplicates.
[CHECKSTYLE] Successfully parsed file <https://builds.apache.org/job/Atlas-1.0-AllTests/ws/target/checkstyle-result.xml>
with 44009 unique warnings and 0 duplicates.
[CHECKSTYLE] Successfully parsed file <https://builds.apache.org/job/Atlas-1.0-AllTests/ws/test-tools/target/checkstyle-result.xml>
with 44047 unique warnings and 0 duplicates.
[CHECKSTYLE] Successfully parsed file <https://builds.apache.org/job/Atlas-1.0-AllTests/ws/webapp/target/checkstyle-result.xml>
with 52401 unique warnings and 0 duplicates.
<Git Blamer> Using GitBlamer to create author and commit information for all warnings.
<Git Blamer> GIT_COMMIT=6766b9abea46a1f873c67e9db6799d4aa702d9cf, workspace=<https://builds.apache.org/job/Atlas-1.0-AllTests/ws/>
 > git rev-parse 6766b9abea46a1f873c67e9db6799d4aa702d9cf^{commit} # timeout=10
[CHECKSTYLE] Computing warning deltas based on reference build #787
[FINDBUGS] Collecting findbugs analysis files...
[FINDBUGS] Searching for all files in <https://builds.apache.org/job/Atlas-1.0-AllTests/ws/>
that match the pattern **/target/findbugs.xml
[FINDBUGS] Parsing 24 files in <https://builds.apache.org/job/Atlas-1.0-AllTests/ws/>
[FINDBUGS] Successfully parsed file <https://builds.apache.org/job/Atlas-1.0-AllTests/ws/addons/falcon-bridge-shim/target/findbugs.xml>
with 0 unique warnings and 0 duplicates.
[FINDBUGS] Successfully parsed file <https://builds.apache.org/job/Atlas-1.0-AllTests/ws/addons/falcon-bridge/target/findbugs.xml>
with 0 unique warnings and 0 duplicates.
[FINDBUGS] Successfully parsed file <https://builds.apache.org/job/Atlas-1.0-AllTests/ws/addons/hbase-bridge-shim/target/findbugs.xml>
with 0 unique warnings and 0 duplicates.
[FINDBUGS] Successfully parsed file <https://builds.apache.org/job/Atlas-1.0-AllTests/ws/addons/hive-bridge-shim/target/findbugs.xml>
with 0 unique warnings and 0 duplicates.
[FINDBUGS] Successfully parsed file <https://builds.apache.org/job/Atlas-1.0-AllTests/ws/addons/hive-bridge/target/findbugs.xml>
with 0 unique warnings and 0 duplicates.
[FINDBUGS] Successfully parsed file <https://builds.apache.org/job/Atlas-1.0-AllTests/ws/addons/sqoop-bridge-shim/target/findbugs.xml>
with 0 unique warnings and 0 duplicates.
[FINDBUGS] Successfully parsed file <https://builds.apache.org/job/Atlas-1.0-AllTests/ws/addons/sqoop-bridge/target/findbugs.xml>
with 0 unique warnings and 0 duplicates.
[FINDBUGS] Successfully parsed file <https://builds.apache.org/job/Atlas-1.0-AllTests/ws/addons/storm-bridge-shim/target/findbugs.xml>
with 0 unique warnings and 0 duplicates.
[FINDBUGS] Successfully parsed file <https://builds.apache.org/job/Atlas-1.0-AllTests/ws/addons/storm-bridge/target/findbugs.xml>
with 0 unique warnings and 0 duplicates.
[FINDBUGS] Successfully parsed file <https://builds.apache.org/job/Atlas-1.0-AllTests/ws/authorization/target/findbugs.xml>
with 0 unique warnings and 0 duplicates.
[FINDBUGS] Successfully parsed file <https://builds.apache.org/job/Atlas-1.0-AllTests/ws/client/client-v1/target/findbugs.xml>
with 0 unique warnings and 0 duplicates.
[FINDBUGS] Successfully parsed file <https://builds.apache.org/job/Atlas-1.0-AllTests/ws/client/client-v2/target/findbugs.xml>
with 0 unique warnings and 0 duplicates.
[FINDBUGS] Successfully parsed file <https://builds.apache.org/job/Atlas-1.0-AllTests/ws/client/common/target/findbugs.xml>
with 0 unique warnings and 0 duplicates.
[FINDBUGS] Successfully parsed file <https://builds.apache.org/job/Atlas-1.0-AllTests/ws/common/target/findbugs.xml>
with 0 unique warnings and 0 duplicates.
[FINDBUGS] Successfully parsed file <https://builds.apache.org/job/Atlas-1.0-AllTests/ws/graphdb/api/target/findbugs.xml>
with 0 unique warnings and 0 duplicates.
[FINDBUGS] Successfully parsed file <https://builds.apache.org/job/Atlas-1.0-AllTests/ws/graphdb/common/target/findbugs.xml>
with 0 unique warnings and 0 duplicates.
[FINDBUGS] Successfully parsed file <https://builds.apache.org/job/Atlas-1.0-AllTests/ws/graphdb/janus/target/findbugs.xml>
with 0 unique warnings and 0 duplicates.
[FINDBUGS] Successfully parsed file <https://builds.apache.org/job/Atlas-1.0-AllTests/ws/intg/target/findbugs.xml>
with 0 unique warnings and 0 duplicates.
[FINDBUGS] Successfully parsed file <https://builds.apache.org/job/Atlas-1.0-AllTests/ws/notification/target/findbugs.xml>
with 0 unique warnings and 0 duplicates.
[FINDBUGS] Successfully parsed file <https://builds.apache.org/job/Atlas-1.0-AllTests/ws/plugin-classloader/target/findbugs.xml>
with 0 unique warnings and 0 duplicates.
[FINDBUGS] Successfully parsed file <https://builds.apache.org/job/Atlas-1.0-AllTests/ws/repository/target/findbugs.xml>
with 0 unique warnings and 0 duplicates.
[FINDBUGS] Successfully parsed file <https://builds.apache.org/job/Atlas-1.0-AllTests/ws/server-api/target/findbugs.xml>
with 0 unique warnings and 0 duplicates.
[FINDBUGS] Successfully parsed file <https://builds.apache.org/job/Atlas-1.0-AllTests/ws/test-tools/target/findbugs.xml>
with 0 unique warnings and 0 duplicates.
[FINDBUGS] Successfully parsed file <https://builds.apache.org/job/Atlas-1.0-AllTests/ws/webapp/target/findbugs.xml>
with 0 unique warnings and 0 duplicates.
<Git Blamer> Using GitBlamer to create author and commit information for all warnings.
<Git Blamer> GIT_COMMIT=6766b9abea46a1f873c67e9db6799d4aa702d9cf, workspace=<https://builds.apache.org/job/Atlas-1.0-AllTests/ws/>
[FINDBUGS] Computing warning deltas based on reference build #787
Archiving artifacts
[Fast Archiver] Compressed 408.84 MB of artifacts by 34.8% relative to #787
TestNG Reports Processing: START
Looking for TestNG results report in workspace using pattern: **/target/surefire-reports/testng-results.xml,**/target/failsafe-reports/testng-results.xml
Saving reports...
Processing '/x1/jenkins/jenkins-home/jobs/Atlas-1.0-AllTests/builds/788/testng/testng-results-1.xml'
Processing '/x1/jenkins/jenkins-home/jobs/Atlas-1.0-AllTests/builds/788/testng/testng-results-10.xml'
Processing '/x1/jenkins/jenkins-home/jobs/Atlas-1.0-AllTests/builds/788/testng/testng-results-11.xml'
Processing '/x1/jenkins/jenkins-home/jobs/Atlas-1.0-AllTests/builds/788/testng/testng-results-12.xml'
Processing '/x1/jenkins/jenkins-home/jobs/Atlas-1.0-AllTests/builds/788/testng/testng-results-13.xml'
Processing '/x1/jenkins/jenkins-home/jobs/Atlas-1.0-AllTests/builds/788/testng/testng-results-14.xml'
Processing '/x1/jenkins/jenkins-home/jobs/Atlas-1.0-AllTests/builds/788/testng/testng-results-15.xml'
Processing '/x1/jenkins/jenkins-home/jobs/Atlas-1.0-AllTests/builds/788/testng/testng-results-2.xml'
Processing '/x1/jenkins/jenkins-home/jobs/Atlas-1.0-AllTests/builds/788/testng/testng-results-3.xml'
Processing '/x1/jenkins/jenkins-home/jobs/Atlas-1.0-AllTests/builds/788/testng/testng-results-4.xml'
Processing '/x1/jenkins/jenkins-home/jobs/Atlas-1.0-AllTests/builds/788/testng/testng-results-5.xml'
Processing '/x1/jenkins/jenkins-home/jobs/Atlas-1.0-AllTests/builds/788/testng/testng-results-6.xml'
Processing '/x1/jenkins/jenkins-home/jobs/Atlas-1.0-AllTests/builds/788/testng/testng-results-7.xml'
Processing '/x1/jenkins/jenkins-home/jobs/Atlas-1.0-AllTests/builds/788/testng/testng-results-8.xml'
Processing '/x1/jenkins/jenkins-home/jobs/Atlas-1.0-AllTests/builds/788/testng/testng-results-9.xml'
Processing '/x1/jenkins/jenkins-home/jobs/Atlas-1.0-AllTests/builds/788/testng/testng-results.xml'
0.435730% of tests failed, which exceeded threshold of 0%. Marking build as UNSTABLE
TestNG Reports Processing: FINISH

Mime
View raw message