atlas-dev mailing list archives

Site index · List index
Message view « Date » · « Thread »
Top « Date » · « Thread »
From Apache Jenkins Server <jenk...@builds.apache.org>
Subject Build failed in Jenkins: Atlas-1.0-IntegrationTests #849
Date Wed, 22 Aug 2018 21:33:23 GMT
See <https://builds.apache.org/job/Atlas-1.0-IntegrationTests/849/display/redirect>

------------------------------------------
[...truncated 191.29 KB...]
     [java] Warnings generated: 4
[INFO] Done FindBugs Analysis....
[INFO] 
[INFO] <<< findbugs-maven-plugin:3.0.1:check (findbugs-check) < :findbugs @ atlas-authorization
<<<
[INFO] 
[INFO] 
[INFO] --- findbugs-maven-plugin:3.0.1:check (findbugs-check) @ atlas-authorization ---
[INFO] BugInstance size is 4
[INFO] Error size is 0
[INFO] Total bugs: 4
[INFO] org.apache.atlas.authorize.AtlasAccessRequest.getAccessTime() may expose internal representation
by returning AtlasAccessRequest.accessTime [org.apache.atlas.authorize.AtlasAccessRequest]
At AtlasAccessRequest.java:[line 69]
[INFO] Possible exposure of partially initialized object in org.apache.atlas.authorize.AtlasAuthorizerFactory.getAtlasAuthorizer()
[org.apache.atlas.authorize.AtlasAuthorizerFactory, org.apache.atlas.authorize.AtlasAuthorizerFactory]
At AtlasAuthorizerFactory.java:[line 75]Stored at AtlasAuthorizerFactory.java:[line 73]
[INFO] Found reliance on default encoding in org.apache.atlas.authorize.simple.AtlasSimpleAuthzUpdateTool.writeUsingFiles(String,
String): String.getBytes() [org.apache.atlas.authorize.simple.AtlasSimpleAuthzUpdateTool]
At AtlasSimpleAuthzUpdateTool.java:[line 145]
[INFO] Exception is caught when Exception is not thrown in org.apache.atlas.authorize.simple.AtlasSimpleAuthzUpdateTool.updateSimpleAuthzJsonWithRelationshipPermissions(String)
[org.apache.atlas.authorize.simple.AtlasSimpleAuthzUpdateTool] At AtlasSimpleAuthzUpdateTool.java:[line
118]
[INFO] 


To see bug detail using the Findbugs GUI, use the following command "mvn findbugs:gui"



[INFO] 
[INFO] --- maven-install-plugin:2.5.2:install (default-install) @ atlas-authorization ---
[INFO] Installing <https://builds.apache.org/job/Atlas-1.0-IntegrationTests/ws/authorization/target/atlas-authorization-1.1.0-SNAPSHOT.jar>
to /home/jenkins/.m2/repository/org/apache/atlas/atlas-authorization/1.1.0-SNAPSHOT/atlas-authorization-1.1.0-SNAPSHOT.jar
[INFO] Installing <https://builds.apache.org/job/Atlas-1.0-IntegrationTests/ws/authorization/pom.xml>
to /home/jenkins/.m2/repository/org/apache/atlas/atlas-authorization/1.1.0-SNAPSHOT/atlas-authorization-1.1.0-SNAPSHOT.pom
[INFO] Installing <https://builds.apache.org/job/Atlas-1.0-IntegrationTests/ws/authorization/target/atlas-authorization-1.1.0-SNAPSHOT-sources.jar>
to /home/jenkins/.m2/repository/org/apache/atlas/atlas-authorization/1.1.0-SNAPSHOT/atlas-authorization-1.1.0-SNAPSHOT-sources.jar
[INFO] Installing <https://builds.apache.org/job/Atlas-1.0-IntegrationTests/ws/authorization/target/atlas-authorization-1.1.0-SNAPSHOT-test-sources.jar>
to /home/jenkins/.m2/repository/org/apache/atlas/atlas-authorization/1.1.0-SNAPSHOT/atlas-authorization-1.1.0-SNAPSHOT-test-sources.jar
[INFO] 
[INFO] -----------------< org.apache.atlas:atlas-repository >------------------
[INFO] Building Apache Atlas Repository 1.1.0-SNAPSHOT                  [20/37]
[INFO] --------------------------------[ jar ]---------------------------------
[INFO] 
[INFO] --- maven-clean-plugin:2.5:clean (default-clean) @ atlas-repository ---
[INFO] Deleting <https://builds.apache.org/job/Atlas-1.0-IntegrationTests/ws/repository>
(includes = [**/*.pyc], excludes = [])
[INFO] 
[INFO] --- maven-enforcer-plugin:3.0.0-M1:enforce (enforce-versions) @ atlas-repository ---
[INFO] 
[INFO] --- buildnumber-maven-plugin:1.4:create (default) @ atlas-repository ---
[INFO] Executing: /bin/sh -c cd '<https://builds.apache.org/job/Atlas-1.0-IntegrationTests/ws/repository'>
&& 'git' 'rev-parse' '--verify' 'HEAD'
[INFO] Working directory: <https://builds.apache.org/job/Atlas-1.0-IntegrationTests/ws/repository>
[INFO] Storing buildNumber: 2f81c8953054ddf983f80c9b17cc3c615e737095 at timestamp: 1534973278347
[WARNING] Cannot get the branch information from the git repository: 
Detecting the current branch failed: fatal: ref HEAD is not a symbolic ref

[INFO] Executing: /bin/sh -c cd '<https://builds.apache.org/job/Atlas-1.0-IntegrationTests/ws/repository'>
&& 'git' 'rev-parse' '--verify' 'HEAD'
[INFO] Working directory: <https://builds.apache.org/job/Atlas-1.0-IntegrationTests/ws/repository>
[INFO] Storing buildScmBranch: UNKNOWN
[INFO] 
[INFO] --- apache-rat-plugin:0.12:check (rat-check) @ atlas-repository ---
[INFO] Enabled default license matchers.
[INFO] Will parse SCM ignores for exclusions...
[INFO] Finished adding exclusions from SCM ignore files.
[INFO] 61 implicit excludes (use -debug for more details).
[INFO] Exclude: **/antlr4/**
[INFO] Exclude: **/dependency-reduced-pom.xml
[INFO] Exclude: **/javax.script.ScriptEngineFactory
[INFO] Exclude: .reviewboardrc
[INFO] Exclude: 3party-licenses/**
[INFO] Exclude: **/.cache
[INFO] Exclude: **/.cache-main
[INFO] Exclude: **/.cache-tests
[INFO] Exclude: **/.checkstyle
[INFO] Exclude: **/*.txt
[INFO] Exclude: **/*.json
[INFO] Exclude: .pc/**
[INFO] Exclude: debian/**
[INFO] Exclude: .svn/**
[INFO] Exclude: .git/**
[INFO] Exclude: .gitignore
[INFO] Exclude: **/.idea/**
[INFO] Exclude: **/*.twiki
[INFO] Exclude: **/*.iml
[INFO] Exclude: **/*.json
[INFO] Exclude: **/*.log
[INFO] Exclude: **/target/**
[INFO] Exclude: **/target*/**
[INFO] Exclude: **/build/**
[INFO] Exclude: **/*.patch
[INFO] Exclude: derby.log
[INFO] Exclude: **/logs/**
[INFO] Exclude: **/.classpath
[INFO] Exclude: **/.project
[INFO] Exclude: **/.settings/**
[INFO] Exclude: **/test-output/**
[INFO] Exclude: **/mock/**
[INFO] Exclude: **/data/**
[INFO] Exclude: **/maven-eclipse.xml
[INFO] Exclude: **/.externalToolBuilders/**
[INFO] Exclude: **/build.log
[INFO] Exclude: **/.bowerrc
[INFO] Exclude: *.json
[INFO] Exclude: **/overlays/**
[INFO] Exclude: dev-support/**
[INFO] Exclude: **/users-credentials.properties
[INFO] Exclude: **/public/css/animate.min.css
[INFO] Exclude: **/public/css/bootstrap-sidebar.css
[INFO] Exclude: **/public/js/external_lib/**
[INFO] Exclude: **/node_modules/**
[INFO] Exclude: **/public/js/libs/**
[INFO] Exclude: **/atlas.data/**
[INFO] Exclude: **/${sys:atlas.data}/**
[INFO] Exclude: **/policy-store.txt
[INFO] Exclude: **/*rebel*.xml
[INFO] Exclude: **/*rebel*.xml.bak
[INFO] Exclude: **/test/resources/**
[INFO] 177 resources included (use -debug for more details)
[INFO] Rat check: Summary over all files. Unapproved: 0, unknown: 0, generated: 0, approved:
177 licenses.
[INFO] 
[INFO] --- maven-resources-plugin:2.7:copy-resources (copy-resources-solr) @ atlas-repository
---
[INFO] Using 'UTF-8' encoding to copy filtered resources.
[INFO] Copying 9 resources
[INFO] 
[INFO] --- maven-remote-resources-plugin:1.5:process (default) @ atlas-repository ---
[INFO] 
[INFO] --- maven-resources-plugin:2.7:resources (default-resources) @ atlas-repository ---
[INFO] Using 'UTF-8' encoding to copy filtered resources.
[INFO] skip non existing resourceDirectory <https://builds.apache.org/job/Atlas-1.0-IntegrationTests/ws/repository/src/main/resources>
[INFO] Copying 2 resources to META-INF
[INFO] Copying 3 resources
[INFO] 
[INFO] --- maven-compiler-plugin:3.7.0:compile (default-compile) @ atlas-repository ---
[INFO] Changes detected - recompiling the module!
[INFO] Compiling 131 source files to <https://builds.apache.org/job/Atlas-1.0-IntegrationTests/ws/repository/target/classes>
[INFO] <https://builds.apache.org/job/Atlas-1.0-IntegrationTests/ws/repository/src/main/java/org/apache/atlas/repository/converters/AtlasInstanceConverter.java>:
Some input files use or override a deprecated API.
[INFO] <https://builds.apache.org/job/Atlas-1.0-IntegrationTests/ws/repository/src/main/java/org/apache/atlas/repository/converters/AtlasInstanceConverter.java>:
Recompile with -Xlint:deprecation for details.
[INFO] <https://builds.apache.org/job/Atlas-1.0-IntegrationTests/ws/repository/src/main/java/org/apache/atlas/repository/store/graph/v2/AtlasStructDefStoreV2.java>:
Some input files use unchecked or unsafe operations.
[INFO] <https://builds.apache.org/job/Atlas-1.0-IntegrationTests/ws/repository/src/main/java/org/apache/atlas/repository/store/graph/v2/AtlasStructDefStoreV2.java>:
Recompile with -Xlint:unchecked for details.
[INFO] -------------------------------------------------------------
[ERROR] COMPILATION ERROR : 
[INFO] -------------------------------------------------------------
[ERROR] <https://builds.apache.org/job/Atlas-1.0-IntegrationTests/ws/repository/src/main/java/org/apache/atlas/repository/store/graph/v2/EntityGraphMapper.java>:[1683,17]
cannot find symbol
  symbol:   method isActive(org.apache.atlas.model.instance.AtlasEntity)
  location: class org.apache.atlas.repository.store.graph.v2.EntityGraphMapper
[ERROR] <https://builds.apache.org/job/Atlas-1.0-IntegrationTests/ws/repository/src/main/java/org/apache/atlas/repository/store/graph/v2/EntityGraphMapper.java>:[1696,21]
cannot find symbol
  symbol:   method isActive(org.apache.atlas.model.instance.AtlasEntity)
  location: class org.apache.atlas.repository.store.graph.v2.EntityGraphMapper
[INFO] 2 errors 
[INFO] -------------------------------------------------------------
[INFO] ------------------------------------------------------------------------
[INFO] Reactor Summary:
[INFO] 
[INFO] Apache Atlas Server Build Tools 1.0 ................ SUCCESS [  0.806 s]
[INFO] apache-atlas 1.1.0-SNAPSHOT ........................ SUCCESS [  5.468 s]
[INFO] Apache Atlas Test Utility Tools .................... SUCCESS [ 11.943 s]
[INFO] Apache Atlas Integration ........................... SUCCESS [ 23.995 s]
[INFO] Apache Atlas Common ................................ SUCCESS [  8.922 s]
[INFO] Apache Atlas Client ................................ SUCCESS [  0.647 s]
[INFO] atlas-client-common ................................ SUCCESS [  9.288 s]
[INFO] atlas-client-v1 .................................... SUCCESS [  8.880 s]
[INFO] Apache Atlas Server API ............................ SUCCESS [  7.190 s]
[INFO] Apache Atlas Notification .......................... SUCCESS [ 10.408 s]
[INFO] atlas-client-v2 .................................... SUCCESS [  7.059 s]
[INFO] Apache Atlas Graph Database Projects ............... SUCCESS [  0.471 s]
[INFO] Apache Atlas Graph Database API .................... SUCCESS [  5.583 s]
[INFO] Graph Database Common Code ......................... SUCCESS [  6.009 s]
[INFO] Apache Atlas JanusGraph DB Impl .................... SUCCESS [ 19.241 s]
[INFO] Apache Atlas Graph Database Implementation Dependencies SUCCESS [  2.573 s]
[INFO] Shaded version of Apache hbase client .............. SUCCESS [  8.405 s]
[INFO] Shaded version of Apache hbase server .............. SUCCESS [ 21.216 s]
[INFO] Apache Atlas Authorization ......................... SUCCESS [  7.869 s]
[INFO] Apache Atlas Repository ............................ FAILURE [  8.944 s]
[INFO] Apache Atlas UI .................................... SKIPPED
[INFO] Apache Atlas Web Application ....................... SKIPPED
[INFO] Apache Atlas Documentation ......................... SKIPPED
[INFO] Apache Atlas FileSystem Model ...................... SKIPPED
[INFO] Apache Atlas Plugin Classloader .................... SKIPPED
[INFO] Apache Atlas Hive Bridge Shim ...................... SKIPPED
[INFO] Apache Atlas Hive Bridge ........................... SKIPPED
[INFO] Apache Atlas Falcon Bridge Shim .................... SKIPPED
[INFO] Apache Atlas Falcon Bridge ......................... SKIPPED
[INFO] Apache Atlas Sqoop Bridge Shim ..................... SKIPPED
[INFO] Apache Atlas Sqoop Bridge .......................... SKIPPED
[INFO] Apache Atlas Storm Bridge Shim ..................... SKIPPED
[INFO] Apache Atlas Storm Bridge .......................... SKIPPED
[INFO] Apache Atlas Hbase Bridge Shim ..................... SKIPPED
[INFO] Apache Atlas Hbase Bridge .......................... SKIPPED
[INFO] Apache Atlas Kafka Bridge .......................... SKIPPED
[INFO] Apache Atlas Distribution 1.1.0-SNAPSHOT ........... SKIPPED
[INFO] ------------------------------------------------------------------------
[INFO] BUILD FAILURE
[INFO] ------------------------------------------------------------------------
[INFO] Total time: 02:56 min
[INFO] Finished at: 2018-08-22T21:28:07Z
[INFO] ------------------------------------------------------------------------
[ERROR] Failed to execute goal org.apache.maven.plugins:maven-compiler-plugin:3.7.0:compile
(default-compile) on project atlas-repository: Compilation failure: Compilation failure: 
[ERROR] <https://builds.apache.org/job/Atlas-1.0-IntegrationTests/ws/repository/src/main/java/org/apache/atlas/repository/store/graph/v2/EntityGraphMapper.java>:[1683,17]
cannot find symbol
[ERROR]   symbol:   method isActive(org.apache.atlas.model.instance.AtlasEntity)
[ERROR]   location: class org.apache.atlas.repository.store.graph.v2.EntityGraphMapper
[ERROR] <https://builds.apache.org/job/Atlas-1.0-IntegrationTests/ws/repository/src/main/java/org/apache/atlas/repository/store/graph/v2/EntityGraphMapper.java>:[1696,21]
cannot find symbol
[ERROR]   symbol:   method isActive(org.apache.atlas.model.instance.AtlasEntity)
[ERROR]   location: class org.apache.atlas.repository.store.graph.v2.EntityGraphMapper
[ERROR] -> [Help 1]
[ERROR] 
[ERROR] To see the full stack trace of the errors, re-run Maven with the -e switch.
[ERROR] Re-run Maven using the -X switch to enable full debug logging.
[ERROR] 
[ERROR] For more information about the errors and possible solutions, please read the following
articles:
[ERROR] [Help 1] http://cwiki.apache.org/confluence/display/MAVEN/MojoFailureException
[ERROR] 
[ERROR] After correcting the problems, you can resume the build with the command
[ERROR]   mvn <goals> -rf :atlas-repository
Build step 'Execute shell' marked build as failure
[CHECKSTYLE] Collecting checkstyle analysis files...
[CHECKSTYLE] Searching for all files in <https://builds.apache.org/job/Atlas-1.0-IntegrationTests/ws/>
that match the pattern **/target/checkstyle-result.xml
[CHECKSTYLE] Parsing 18 files in <https://builds.apache.org/job/Atlas-1.0-IntegrationTests/ws/>
[CHECKSTYLE] Successfully parsed file <https://builds.apache.org/job/Atlas-1.0-IntegrationTests/ws/authorization/target/checkstyle-result.xml>
with 973 unique warnings and 0 duplicates.
[CHECKSTYLE] Successfully parsed file <https://builds.apache.org/job/Atlas-1.0-IntegrationTests/ws/client/client-v1/target/checkstyle-result.xml>
with 1872 unique warnings and 0 duplicates.
[CHECKSTYLE] Successfully parsed file <https://builds.apache.org/job/Atlas-1.0-IntegrationTests/ws/client/client-v2/target/checkstyle-result.xml>
with 2231 unique warnings and 0 duplicates.
[CHECKSTYLE] Successfully parsed file <https://builds.apache.org/job/Atlas-1.0-IntegrationTests/ws/client/common/target/checkstyle-result.xml>
with 2723 unique warnings and 0 duplicates.
[CHECKSTYLE] Successfully parsed file <https://builds.apache.org/job/Atlas-1.0-IntegrationTests/ws/client/target/checkstyle-result.xml>
with 2723 unique warnings and 0 duplicates.
[CHECKSTYLE] Successfully parsed file <https://builds.apache.org/job/Atlas-1.0-IntegrationTests/ws/common/target/checkstyle-result.xml>
with 3784 unique warnings and 0 duplicates.
[CHECKSTYLE] Successfully parsed file <https://builds.apache.org/job/Atlas-1.0-IntegrationTests/ws/graphdb/api/target/checkstyle-result.xml>
with 4086 unique warnings and 0 duplicates.
[CHECKSTYLE] Successfully parsed file <https://builds.apache.org/job/Atlas-1.0-IntegrationTests/ws/graphdb/common/target/checkstyle-result.xml>
with 4312 unique warnings and 0 duplicates.
[CHECKSTYLE] Successfully parsed file <https://builds.apache.org/job/Atlas-1.0-IntegrationTests/ws/graphdb/graphdb-impls/target/checkstyle-result.xml>
with 4312 unique warnings and 0 duplicates.
[CHECKSTYLE] Successfully parsed file <https://builds.apache.org/job/Atlas-1.0-IntegrationTests/ws/graphdb/janus/target/checkstyle-result.xml>
with 6638 unique warnings and 0 duplicates.
[CHECKSTYLE] Successfully parsed file <https://builds.apache.org/job/Atlas-1.0-IntegrationTests/ws/graphdb/target/checkstyle-result.xml>
with 6638 unique warnings and 0 duplicates.
[CHECKSTYLE] Successfully parsed file <https://builds.apache.org/job/Atlas-1.0-IntegrationTests/ws/intg/target/checkstyle-result.xml>
with 18699 unique warnings and 0 duplicates.
[CHECKSTYLE] Successfully parsed file <https://builds.apache.org/job/Atlas-1.0-IntegrationTests/ws/notification/target/checkstyle-result.xml>
with 19973 unique warnings and 0 duplicates.
[CHECKSTYLE] Successfully parsed file <https://builds.apache.org/job/Atlas-1.0-IntegrationTests/ws/server-api/target/checkstyle-result.xml>
with 20141 unique warnings and 0 duplicates.
[CHECKSTYLE] Successfully parsed file <https://builds.apache.org/job/Atlas-1.0-IntegrationTests/ws/shaded/hbase-client-shaded/target/checkstyle-result.xml>
with 20141 unique warnings and 0 duplicates.
[CHECKSTYLE] Successfully parsed file <https://builds.apache.org/job/Atlas-1.0-IntegrationTests/ws/shaded/hbase-server-shaded/target/checkstyle-result.xml>
with 20141 unique warnings and 0 duplicates.
[CHECKSTYLE] Successfully parsed file <https://builds.apache.org/job/Atlas-1.0-IntegrationTests/ws/target/checkstyle-result.xml>
with 20141 unique warnings and 0 duplicates.
[CHECKSTYLE] Successfully parsed file <https://builds.apache.org/job/Atlas-1.0-IntegrationTests/ws/test-tools/target/checkstyle-result.xml>
with 20179 unique warnings and 0 duplicates.
<Git Blamer> Using GitBlamer to create author and commit information for all warnings.
<Git Blamer> GIT_COMMIT=2f81c8953054ddf983f80c9b17cc3c615e737095, workspace=<https://builds.apache.org/job/Atlas-1.0-IntegrationTests/ws/>
 > git rev-parse 2f81c8953054ddf983f80c9b17cc3c615e737095^{commit} # timeout=10
[CHECKSTYLE] Computing warning deltas based on reference build #836
[FINDBUGS] Collecting findbugs analysis files...
[FINDBUGS] Searching for all files in <https://builds.apache.org/job/Atlas-1.0-IntegrationTests/ws/>
that match the pattern **/target/findbugs.xml
[FINDBUGS] Parsing 12 files in <https://builds.apache.org/job/Atlas-1.0-IntegrationTests/ws/>
[FINDBUGS] Successfully parsed file <https://builds.apache.org/job/Atlas-1.0-IntegrationTests/ws/authorization/target/findbugs.xml>
with 0 unique warnings and 0 duplicates.
[FINDBUGS] Successfully parsed file <https://builds.apache.org/job/Atlas-1.0-IntegrationTests/ws/client/client-v1/target/findbugs.xml>
with 0 unique warnings and 0 duplicates.
[FINDBUGS] Successfully parsed file <https://builds.apache.org/job/Atlas-1.0-IntegrationTests/ws/client/client-v2/target/findbugs.xml>
with 0 unique warnings and 0 duplicates.
[FINDBUGS] Successfully parsed file <https://builds.apache.org/job/Atlas-1.0-IntegrationTests/ws/client/common/target/findbugs.xml>
with 0 unique warnings and 0 duplicates.
[FINDBUGS] Successfully parsed file <https://builds.apache.org/job/Atlas-1.0-IntegrationTests/ws/common/target/findbugs.xml>
with 0 unique warnings and 0 duplicates.
[FINDBUGS] Successfully parsed file <https://builds.apache.org/job/Atlas-1.0-IntegrationTests/ws/graphdb/api/target/findbugs.xml>
with 0 unique warnings and 0 duplicates.
[FINDBUGS] Successfully parsed file <https://builds.apache.org/job/Atlas-1.0-IntegrationTests/ws/graphdb/common/target/findbugs.xml>
with 0 unique warnings and 0 duplicates.
[FINDBUGS] Successfully parsed file <https://builds.apache.org/job/Atlas-1.0-IntegrationTests/ws/graphdb/janus/target/findbugs.xml>
with 0 unique warnings and 0 duplicates.
[FINDBUGS] Successfully parsed file <https://builds.apache.org/job/Atlas-1.0-IntegrationTests/ws/intg/target/findbugs.xml>
with 0 unique warnings and 0 duplicates.
[FINDBUGS] Successfully parsed file <https://builds.apache.org/job/Atlas-1.0-IntegrationTests/ws/notification/target/findbugs.xml>
with 0 unique warnings and 0 duplicates.
[FINDBUGS] Successfully parsed file <https://builds.apache.org/job/Atlas-1.0-IntegrationTests/ws/server-api/target/findbugs.xml>
with 0 unique warnings and 0 duplicates.
[FINDBUGS] Successfully parsed file <https://builds.apache.org/job/Atlas-1.0-IntegrationTests/ws/test-tools/target/findbugs.xml>
with 0 unique warnings and 0 duplicates.
<Git Blamer> Using GitBlamer to create author and commit information for all warnings.
<Git Blamer> GIT_COMMIT=2f81c8953054ddf983f80c9b17cc3c615e737095, workspace=<https://builds.apache.org/job/Atlas-1.0-IntegrationTests/ws/>
[FINDBUGS] Computing warning deltas based on reference build #836
Archiving artifacts
TestNG Reports Processing: START
Looking for TestNG results report in workspace using pattern: **/target/surefire-reports/testng-results.xml,**/target/failsafe-reports/testng-results.xml
Did not find any matching files.

Mime
View raw message