atlas-dev mailing list archives

Site index · List index
Message view « Date » · « Thread »
Top « Date » · « Thread »
From Apache Jenkins Server <jenk...@builds.apache.org>
Subject Build failed in Jenkins: Atlas-1.0-NoTests #874
Date Sat, 25 Aug 2018 03:58:32 GMT
See <https://builds.apache.org/job/Atlas-1.0-NoTests/874/display/redirect>

------------------------------------------
[...truncated 163.35 KB...]
[INFO] Exclude: **/test-output/**
[INFO] Exclude: **/mock/**
[INFO] Exclude: **/data/**
[INFO] Exclude: **/maven-eclipse.xml
[INFO] Exclude: **/.externalToolBuilders/**
[INFO] Exclude: **/build.log
[INFO] Exclude: **/.bowerrc
[INFO] Exclude: *.json
[INFO] Exclude: **/overlays/**
[INFO] Exclude: dev-support/**
[INFO] Exclude: **/users-credentials.properties
[INFO] Exclude: **/public/css/animate.min.css
[INFO] Exclude: **/public/css/bootstrap-sidebar.css
[INFO] Exclude: **/public/js/external_lib/**
[INFO] Exclude: **/node_modules/**
[INFO] Exclude: **/public/js/libs/**
[INFO] Exclude: **/atlas.data/**
[INFO] Exclude: **/${sys:atlas.data}/**
[INFO] Exclude: **/policy-store.txt
[INFO] Exclude: **/*rebel*.xml
[INFO] Exclude: **/*rebel*.xml.bak
[INFO] Exclude: **/test/resources/**
[INFO] 177 resources included (use -debug for more details)
[INFO] Rat check: Summary over all files. Unapproved: 0, unknown: 0, generated: 0, approved:
177 licenses.
[INFO] 
[INFO] --- maven-resources-plugin:2.7:copy-resources (copy-resources-solr) @ atlas-repository
---
[INFO] Using 'UTF-8' encoding to copy filtered resources.
[INFO] Copying 9 resources
[INFO] 
[INFO] --- maven-remote-resources-plugin:1.5:process (default) @ atlas-repository ---
[INFO] 
[INFO] --- maven-resources-plugin:2.7:resources (default-resources) @ atlas-repository ---
[INFO] Using 'UTF-8' encoding to copy filtered resources.
[INFO] skip non existing resourceDirectory <https://builds.apache.org/job/Atlas-1.0-NoTests/ws/repository/src/main/resources>
[INFO] Copying 2 resources to META-INF
[INFO] Copying 3 resources
[INFO] 
[INFO] --- maven-compiler-plugin:3.7.0:compile (default-compile) @ atlas-repository ---
[INFO] Changes detected - recompiling the module!
[INFO] Compiling 131 source files to <https://builds.apache.org/job/Atlas-1.0-NoTests/ws/repository/target/classes>
[INFO] <https://builds.apache.org/job/Atlas-1.0-NoTests/ws/repository/src/main/java/org/apache/atlas/repository/converters/AtlasInstanceConverter.java>:
Some input files use or override a deprecated API.
[INFO] <https://builds.apache.org/job/Atlas-1.0-NoTests/ws/repository/src/main/java/org/apache/atlas/repository/converters/AtlasInstanceConverter.java>:
Recompile with -Xlint:deprecation for details.
[INFO] <https://builds.apache.org/job/Atlas-1.0-NoTests/ws/repository/src/main/java/org/apache/atlas/repository/store/graph/v2/AtlasGraphUtilsV2.java>:
Some input files use unchecked or unsafe operations.
[INFO] <https://builds.apache.org/job/Atlas-1.0-NoTests/ws/repository/src/main/java/org/apache/atlas/repository/store/graph/v2/AtlasGraphUtilsV2.java>:
Recompile with -Xlint:unchecked for details.
[INFO] -------------------------------------------------------------
[ERROR] COMPILATION ERROR : 
[INFO] -------------------------------------------------------------
[ERROR] <https://builds.apache.org/job/Atlas-1.0-NoTests/ws/repository/src/main/java/org/apache/atlas/repository/store/graph/v2/EntityGraphMapper.java>:[149,55]
cannot find symbol
  symbol:   variable SUPER_TYPES_PROPERTY_KEY
  location: class org.apache.atlas.repository.store.graph.v2.EntityGraphMapper
[ERROR] <https://builds.apache.org/job/Atlas-1.0-NoTests/ws/repository/src/main/java/org/apache/atlas/repository/store/graph/v2/EntityGraphMapper.java>:[152,51]
cannot find symbol
  symbol:   variable GUID_PROPERTY_KEY
  location: class org.apache.atlas.repository.store.graph.v2.EntityGraphMapper
[ERROR] <https://builds.apache.org/job/Atlas-1.0-NoTests/ws/repository/src/main/java/org/apache/atlas/repository/store/graph/v2/EntityGraphMapper.java>:[153,51]
cannot find symbol
  symbol:   variable VERSION_PROPERTY_KEY
  location: class org.apache.atlas.repository.store.graph.v2.EntityGraphMapper
[ERROR] <https://builds.apache.org/job/Atlas-1.0-NoTests/ws/repository/src/main/java/org/apache/atlas/repository/store/graph/v2/EntityGraphMapper.java>:[164,58]
cannot find symbol
  symbol:   variable TIMESTAMP_PROPERTY_KEY
  location: class org.apache.atlas.repository.store.graph.v2.EntityGraphMapper
[ERROR] <https://builds.apache.org/job/Atlas-1.0-NoTests/ws/repository/src/main/java/org/apache/atlas/repository/store/graph/v2/EntityGraphMapper.java>:[168,58]
cannot find symbol
  symbol:   variable MODIFICATION_TIMESTAMP_PROPERTY_KEY
  location: class org.apache.atlas.repository.store.graph.v2.EntityGraphMapper
[ERROR] <https://builds.apache.org/job/Atlas-1.0-NoTests/ws/repository/src/main/java/org/apache/atlas/repository/store/graph/v2/EntityGraphMapper.java>:[172,58]
cannot find symbol
  symbol:   variable CREATED_BY_KEY
  location: class org.apache.atlas.repository.store.graph.v2.EntityGraphMapper
[ERROR] <https://builds.apache.org/job/Atlas-1.0-NoTests/ws/repository/src/main/java/org/apache/atlas/repository/store/graph/v2/EntityGraphMapper.java>:[176,58]
cannot find symbol
  symbol:   variable MODIFIED_BY_KEY
  location: class org.apache.atlas.repository.store.graph.v2.EntityGraphMapper
[ERROR] <https://builds.apache.org/job/Atlas-1.0-NoTests/ws/repository/src/main/java/org/apache/atlas/repository/store/graph/v2/EntityGraphMapper.java>:[180,58]
cannot find symbol
  symbol:   variable HOME_ID_KEY
  location: class org.apache.atlas.repository.store.graph.v2.EntityGraphMapper
[ERROR] <https://builds.apache.org/job/Atlas-1.0-NoTests/ws/repository/src/main/java/org/apache/atlas/repository/store/graph/v2/EntityGraphMapper.java>:[184,58]
cannot find symbol
  symbol:   variable IS_PROXY_KEY
  location: class org.apache.atlas.repository.store.graph.v2.EntityGraphMapper
[ERROR] <https://builds.apache.org/job/Atlas-1.0-NoTests/ws/repository/src/main/java/org/apache/atlas/repository/store/graph/v2/EntityGraphMapper.java>:[261,51]
cannot find symbol
  symbol:   variable ENTITY_TYPE_PROPERTY_KEY
  location: class org.apache.atlas.repository.store.graph.v2.EntityGraphMapper
[ERROR] <https://builds.apache.org/job/Atlas-1.0-NoTests/ws/repository/src/main/java/org/apache/atlas/repository/store/graph/v2/EntityGraphMapper.java>:[263,51]
cannot find symbol
  symbol:   variable TIMESTAMP_PROPERTY_KEY
  location: class org.apache.atlas.repository.store.graph.v2.EntityGraphMapper
[ERROR] <https://builds.apache.org/job/Atlas-1.0-NoTests/ws/repository/src/main/java/org/apache/atlas/repository/store/graph/v2/EntityGraphMapper.java>:[264,51]
cannot find symbol
  symbol:   variable MODIFICATION_TIMESTAMP_PROPERTY_KEY
  location: class org.apache.atlas.repository.store.graph.v2.EntityGraphMapper
[ERROR] <https://builds.apache.org/job/Atlas-1.0-NoTests/ws/repository/src/main/java/org/apache/atlas/repository/store/graph/v2/EntityGraphMapper.java>:[265,51]
cannot find symbol
  symbol:   variable CREATED_BY_KEY
  location: class org.apache.atlas.repository.store.graph.v2.EntityGraphMapper
[ERROR] <https://builds.apache.org/job/Atlas-1.0-NoTests/ws/repository/src/main/java/org/apache/atlas/repository/store/graph/v2/EntityGraphMapper.java>:[266,51]
cannot find symbol
  symbol:   variable MODIFIED_BY_KEY
  location: class org.apache.atlas.repository.store.graph.v2.EntityGraphMapper
[ERROR] <https://builds.apache.org/job/Atlas-1.0-NoTests/ws/repository/src/main/java/org/apache/atlas/repository/store/graph/v2/EntityGraphMapper.java>:[284,51]
cannot find symbol
  symbol:   variable SUPER_TYPES_PROPERTY_KEY
  location: class org.apache.atlas.repository.store.graph.v2.EntityGraphMapper
[ERROR] <https://builds.apache.org/job/Atlas-1.0-NoTests/ws/repository/src/main/java/org/apache/atlas/repository/store/graph/v2/EntityGraphMapper.java>:[285,51]
cannot find symbol
  symbol:   variable CLASSIFICATION_ENTITY_GUID
  location: class org.apache.atlas.repository.store.graph.v2.EntityGraphMapper
[ERROR] <https://builds.apache.org/job/Atlas-1.0-NoTests/ws/repository/src/main/java/org/apache/atlas/repository/store/graph/v2/EntityGraphMapper.java>:[286,51]
cannot find symbol
  symbol:   variable CLASSIFICATION_ENTITY_STATUS
  location: class org.apache.atlas.repository.store.graph.v2.EntityGraphMapper
[ERROR] <https://builds.apache.org/job/Atlas-1.0-NoTests/ws/repository/src/main/java/org/apache/atlas/repository/store/graph/v2/EntityGraphMapper.java>:[613,52]
cannot find symbol
  symbol:   variable RELATIONSHIP_GUID_PROPERTY_KEY
  location: class org.apache.atlas.repository.store.graph.v2.EntityGraphMapper
[ERROR] <https://builds.apache.org/job/Atlas-1.0-NoTests/ws/repository/src/main/java/org/apache/atlas/repository/store/graph/v2/EntityGraphMapper.java>:[802,71]
cannot find symbol
  symbol:   variable RELATIONSHIP_GUID_PROPERTY_KEY
  location: class org.apache.atlas.repository.store.graph.v2.EntityGraphMapper
[ERROR] <https://builds.apache.org/job/Atlas-1.0-NoTests/ws/repository/src/main/java/org/apache/atlas/repository/store/graph/v2/EntityGraphMapper.java>:[1717,71]
cannot find symbol
  symbol:   variable CLASSIFICATION_VALIDITY_PERIODS_KEY
  location: class org.apache.atlas.repository.store.graph.v2.EntityGraphMapper
[ERROR] <https://builds.apache.org/job/Atlas-1.0-NoTests/ws/repository/src/main/java/org/apache/atlas/repository/store/graph/v2/EntityGraphMapper.java>:[1723,71]
cannot find symbol
  symbol:   variable CLASSIFICATION_VERTEX_PROPAGATE_KEY
  location: class org.apache.atlas.repository.store.graph.v2.EntityGraphMapper
[INFO] 21 errors 
[INFO] -------------------------------------------------------------
[INFO] ------------------------------------------------------------------------
[INFO] Reactor Summary:
[INFO] 
[INFO] Apache Atlas Server Build Tools 1.0 ................ SUCCESS [  0.751 s]
[INFO] apache-atlas 1.1.0-SNAPSHOT ........................ SUCCESS [  3.729 s]
[INFO] Apache Atlas Test Utility Tools .................... SUCCESS [  4.895 s]
[INFO] Apache Atlas Integration ........................... SUCCESS [  6.240 s]
[INFO] Apache Atlas Common ................................ SUCCESS [  1.616 s]
[INFO] Apache Atlas Client ................................ SUCCESS [  0.172 s]
[INFO] atlas-client-common ................................ SUCCESS [  0.842 s]
[INFO] atlas-client-v1 .................................... SUCCESS [  1.088 s]
[INFO] Apache Atlas Server API ............................ SUCCESS [  1.009 s]
[INFO] Apache Atlas Notification .......................... SUCCESS [  2.402 s]
[INFO] atlas-client-v2 .................................... SUCCESS [  1.008 s]
[INFO] Apache Atlas Graph Database Projects ............... SUCCESS [  0.111 s]
[INFO] Apache Atlas Graph Database API .................... SUCCESS [  0.846 s]
[INFO] Graph Database Common Code ......................... SUCCESS [  0.915 s]
[INFO] Apache Atlas JanusGraph DB Impl .................... SUCCESS [ 10.554 s]
[INFO] Apache Atlas Graph Database Implementation Dependencies SUCCESS [  2.369 s]
[INFO] Shaded version of Apache hbase client .............. SUCCESS [  9.013 s]
[INFO] Shaded version of Apache hbase server .............. SUCCESS [ 20.965 s]
[INFO] Apache Atlas Authorization ......................... SUCCESS [  1.160 s]
[INFO] Apache Atlas Repository ............................ FAILURE [  8.257 s]
[INFO] Apache Atlas UI .................................... SKIPPED
[INFO] Apache Atlas Web Application ....................... SKIPPED
[INFO] Apache Atlas Documentation ......................... SKIPPED
[INFO] Apache Atlas FileSystem Model ...................... SKIPPED
[INFO] Apache Atlas Plugin Classloader .................... SKIPPED
[INFO] Apache Atlas Hive Bridge Shim ...................... SKIPPED
[INFO] Apache Atlas Hive Bridge ........................... SKIPPED
[INFO] Apache Atlas Falcon Bridge Shim .................... SKIPPED
[INFO] Apache Atlas Falcon Bridge ......................... SKIPPED
[INFO] Apache Atlas Sqoop Bridge Shim ..................... SKIPPED
[INFO] Apache Atlas Sqoop Bridge .......................... SKIPPED
[INFO] Apache Atlas Storm Bridge Shim ..................... SKIPPED
[INFO] Apache Atlas Storm Bridge .......................... SKIPPED
[INFO] Apache Atlas Hbase Bridge Shim ..................... SKIPPED
[INFO] Apache Atlas Hbase Bridge .......................... SKIPPED
[INFO] Apache Atlas Kafka Bridge .......................... SKIPPED
[INFO] Apache Atlas Distribution 1.1.0-SNAPSHOT ........... SKIPPED
[INFO] ------------------------------------------------------------------------
[INFO] BUILD FAILURE
[INFO] ------------------------------------------------------------------------
[INFO] Total time: 01:19 min
[INFO] Finished at: 2018-08-25T03:58:28Z
[INFO] ------------------------------------------------------------------------
[ERROR] Failed to execute goal org.apache.maven.plugins:maven-compiler-plugin:3.7.0:compile
(default-compile) on project atlas-repository: Compilation failure: Compilation failure: 
[ERROR] <https://builds.apache.org/job/Atlas-1.0-NoTests/ws/repository/src/main/java/org/apache/atlas/repository/store/graph/v2/EntityGraphMapper.java>:[149,55]
cannot find symbol
[ERROR]   symbol:   variable SUPER_TYPES_PROPERTY_KEY
[ERROR]   location: class org.apache.atlas.repository.store.graph.v2.EntityGraphMapper
[ERROR] <https://builds.apache.org/job/Atlas-1.0-NoTests/ws/repository/src/main/java/org/apache/atlas/repository/store/graph/v2/EntityGraphMapper.java>:[152,51]
cannot find symbol
[ERROR]   symbol:   variable GUID_PROPERTY_KEY
[ERROR]   location: class org.apache.atlas.repository.store.graph.v2.EntityGraphMapper
[ERROR] <https://builds.apache.org/job/Atlas-1.0-NoTests/ws/repository/src/main/java/org/apache/atlas/repository/store/graph/v2/EntityGraphMapper.java>:[153,51]
cannot find symbol
[ERROR]   symbol:   variable VERSION_PROPERTY_KEY
[ERROR]   location: class org.apache.atlas.repository.store.graph.v2.EntityGraphMapper
[ERROR] <https://builds.apache.org/job/Atlas-1.0-NoTests/ws/repository/src/main/java/org/apache/atlas/repository/store/graph/v2/EntityGraphMapper.java>:[164,58]
cannot find symbol
[ERROR]   symbol:   variable TIMESTAMP_PROPERTY_KEY
[ERROR]   location: class org.apache.atlas.repository.store.graph.v2.EntityGraphMapper
[ERROR] <https://builds.apache.org/job/Atlas-1.0-NoTests/ws/repository/src/main/java/org/apache/atlas/repository/store/graph/v2/EntityGraphMapper.java>:[168,58]
cannot find symbol
[ERROR]   symbol:   variable MODIFICATION_TIMESTAMP_PROPERTY_KEY
[ERROR]   location: class org.apache.atlas.repository.store.graph.v2.EntityGraphMapper
[ERROR] <https://builds.apache.org/job/Atlas-1.0-NoTests/ws/repository/src/main/java/org/apache/atlas/repository/store/graph/v2/EntityGraphMapper.java>:[172,58]
cannot find symbol
[ERROR]   symbol:   variable CREATED_BY_KEY
[ERROR]   location: class org.apache.atlas.repository.store.graph.v2.EntityGraphMapper
[ERROR] <https://builds.apache.org/job/Atlas-1.0-NoTests/ws/repository/src/main/java/org/apache/atlas/repository/store/graph/v2/EntityGraphMapper.java>:[176,58]
cannot find symbol
[ERROR]   symbol:   variable MODIFIED_BY_KEY
[ERROR]   location: class org.apache.atlas.repository.store.graph.v2.EntityGraphMapper
[ERROR] <https://builds.apache.org/job/Atlas-1.0-NoTests/ws/repository/src/main/java/org/apache/atlas/repository/store/graph/v2/EntityGraphMapper.java>:[180,58]
cannot find symbol
[ERROR]   symbol:   variable HOME_ID_KEY
[ERROR]   location: class org.apache.atlas.repository.store.graph.v2.EntityGraphMapper
[ERROR] <https://builds.apache.org/job/Atlas-1.0-NoTests/ws/repository/src/main/java/org/apache/atlas/repository/store/graph/v2/EntityGraphMapper.java>:[184,58]
cannot find symbol
[ERROR]   symbol:   variable IS_PROXY_KEY
[ERROR]   location: class org.apache.atlas.repository.store.graph.v2.EntityGraphMapper
[ERROR] <https://builds.apache.org/job/Atlas-1.0-NoTests/ws/repository/src/main/java/org/apache/atlas/repository/store/graph/v2/EntityGraphMapper.java>:[261,51]
cannot find symbol
[ERROR]   symbol:   variable ENTITY_TYPE_PROPERTY_KEY
[ERROR]   location: class org.apache.atlas.repository.store.graph.v2.EntityGraphMapper
[ERROR] <https://builds.apache.org/job/Atlas-1.0-NoTests/ws/repository/src/main/java/org/apache/atlas/repository/store/graph/v2/EntityGraphMapper.java>:[263,51]
cannot find symbol
[ERROR]   symbol:   variable TIMESTAMP_PROPERTY_KEY
[ERROR]   location: class org.apache.atlas.repository.store.graph.v2.EntityGraphMapper
[ERROR] <https://builds.apache.org/job/Atlas-1.0-NoTests/ws/repository/src/main/java/org/apache/atlas/repository/store/graph/v2/EntityGraphMapper.java>:[264,51]
cannot find symbol
[ERROR]   symbol:   variable MODIFICATION_TIMESTAMP_PROPERTY_KEY
[ERROR]   location: class org.apache.atlas.repository.store.graph.v2.EntityGraphMapper
[ERROR] <https://builds.apache.org/job/Atlas-1.0-NoTests/ws/repository/src/main/java/org/apache/atlas/repository/store/graph/v2/EntityGraphMapper.java>:[265,51]
cannot find symbol
[ERROR]   symbol:   variable CREATED_BY_KEY
[ERROR]   location: class org.apache.atlas.repository.store.graph.v2.EntityGraphMapper
[ERROR] <https://builds.apache.org/job/Atlas-1.0-NoTests/ws/repository/src/main/java/org/apache/atlas/repository/store/graph/v2/EntityGraphMapper.java>:[266,51]
cannot find symbol
[ERROR]   symbol:   variable MODIFIED_BY_KEY
[ERROR]   location: class org.apache.atlas.repository.store.graph.v2.EntityGraphMapper
[ERROR] <https://builds.apache.org/job/Atlas-1.0-NoTests/ws/repository/src/main/java/org/apache/atlas/repository/store/graph/v2/EntityGraphMapper.java>:[284,51]
cannot find symbol
[ERROR]   symbol:   variable SUPER_TYPES_PROPERTY_KEY
[ERROR]   location: class org.apache.atlas.repository.store.graph.v2.EntityGraphMapper
[ERROR] <https://builds.apache.org/job/Atlas-1.0-NoTests/ws/repository/src/main/java/org/apache/atlas/repository/store/graph/v2/EntityGraphMapper.java>:[285,51]
cannot find symbol
[ERROR]   symbol:   variable CLASSIFICATION_ENTITY_GUID
[ERROR]   location: class org.apache.atlas.repository.store.graph.v2.EntityGraphMapper
[ERROR] <https://builds.apache.org/job/Atlas-1.0-NoTests/ws/repository/src/main/java/org/apache/atlas/repository/store/graph/v2/EntityGraphMapper.java>:[286,51]
cannot find symbol
[ERROR]   symbol:   variable CLASSIFICATION_ENTITY_STATUS
[ERROR]   location: class org.apache.atlas.repository.store.graph.v2.EntityGraphMapper
[ERROR] <https://builds.apache.org/job/Atlas-1.0-NoTests/ws/repository/src/main/java/org/apache/atlas/repository/store/graph/v2/EntityGraphMapper.java>:[613,52]
cannot find symbol
[ERROR]   symbol:   variable RELATIONSHIP_GUID_PROPERTY_KEY
[ERROR]   location: class org.apache.atlas.repository.store.graph.v2.EntityGraphMapper
[ERROR] <https://builds.apache.org/job/Atlas-1.0-NoTests/ws/repository/src/main/java/org/apache/atlas/repository/store/graph/v2/EntityGraphMapper.java>:[802,71]
cannot find symbol
[ERROR]   symbol:   variable RELATIONSHIP_GUID_PROPERTY_KEY
[ERROR]   location: class org.apache.atlas.repository.store.graph.v2.EntityGraphMapper
[ERROR] <https://builds.apache.org/job/Atlas-1.0-NoTests/ws/repository/src/main/java/org/apache/atlas/repository/store/graph/v2/EntityGraphMapper.java>:[1717,71]
cannot find symbol
[ERROR]   symbol:   variable CLASSIFICATION_VALIDITY_PERIODS_KEY
[ERROR]   location: class org.apache.atlas.repository.store.graph.v2.EntityGraphMapper
[ERROR] <https://builds.apache.org/job/Atlas-1.0-NoTests/ws/repository/src/main/java/org/apache/atlas/repository/store/graph/v2/EntityGraphMapper.java>:[1723,71]
cannot find symbol
[ERROR]   symbol:   variable CLASSIFICATION_VERTEX_PROPAGATE_KEY
[ERROR]   location: class org.apache.atlas.repository.store.graph.v2.EntityGraphMapper
[ERROR] -> [Help 1]
[ERROR] 
[ERROR] To see the full stack trace of the errors, re-run Maven with the -e switch.
[ERROR] Re-run Maven using the -X switch to enable full debug logging.
[ERROR] 
[ERROR] For more information about the errors and possible solutions, please read the following
articles:
[ERROR] [Help 1] http://cwiki.apache.org/confluence/display/MAVEN/MojoFailureException
[ERROR] 
[ERROR] After correcting the problems, you can resume the build with the command
[ERROR]   mvn <goals> -rf :atlas-repository
Build step 'Execute shell' marked build as failure
[CHECKSTYLE] Collecting checkstyle analysis files...
[CHECKSTYLE] Searching for all files in <https://builds.apache.org/job/Atlas-1.0-NoTests/ws/>
that match the pattern **/target/checkstyle-result.xml
[CHECKSTYLE] No files found. Configuration error?
<Git Blamer> Using GitBlamer to create author and commit information for all warnings.
<Git Blamer> GIT_COMMIT=bcf904d8d4b762b78bd5e150e7e76845434c8525, workspace=<https://builds.apache.org/job/Atlas-1.0-NoTests/ws/>
[CHECKSTYLE] Computing warning deltas based on reference build #871
[FINDBUGS] Collecting findbugs analysis files...
[FINDBUGS] Searching for all files in <https://builds.apache.org/job/Atlas-1.0-NoTests/ws/>
that match the pattern **/target/findbugs.xml
[FINDBUGS] No files found. Configuration error?
<Git Blamer> Using GitBlamer to create author and commit information for all warnings.
<Git Blamer> GIT_COMMIT=bcf904d8d4b762b78bd5e150e7e76845434c8525, workspace=<https://builds.apache.org/job/Atlas-1.0-NoTests/ws/>
[FINDBUGS] Computing warning deltas based on reference build #871
Archiving artifacts
TestNG Reports Processing: START
Looking for TestNG results report in workspace using pattern: **/target/surefire-reports/testng-results.xml,**/target/failsafe-reports/testng-results.xml
Did not find any matching files.

Mime
View raw message