atlas-dev mailing list archives

Site index · List index
Message view « Date » · « Thread »
Top « Date » · « Thread »
From Apache Jenkins Server <jenk...@builds.apache.org>
Subject Build failed in Jenkins: Atlas-0.8-UnitTests #233
Date Wed, 08 Aug 2018 21:45:23 GMT
See <https://builds.apache.org/job/Atlas-0.8-UnitTests/233/display/redirect?page=changes>

Changes:

[apoorvnaik] ATLAS-2815: Graph TXN fixes

------------------------------------------
[...truncated 212.91 KB...]
Running org.apache.atlas.query.ParserTest
Running org.apache.atlas.repository.store.graph.v1.AtlasEntityDefStoreV1Test
Running org.apache.atlas.query.LexerTest
Running org.apache.atlas.query.LineageQueryTest
Running org.apache.atlas.repository.store.graph.v1.AtlasDeleteHandlerV1Test
Running org.apache.atlas.repository.store.graph.v1.HardDeleteHandlerV1Test
Running org.apache.atlas.repository.typestore.StoreBackedTypeCacheTest
Running org.apache.atlas.repository.store.graph.AtlasTypeDefGraphStoreTest
Running org.apache.atlas.repository.typestore.GraphBackedTypeStoreTest
Running org.apache.atlas.repository.store.graph.v1.InverseReferenceUpdateHardDeleteV1Test
Running org.apache.atlas.repository.store.graph.v1.AtlasEntityStoreV1BulkImportPercentTest
Running org.apache.atlas.repository.store.graph.v1.InverseReferenceUpdateV1Test
Running org.apache.atlas.repository.store.graph.v1.SoftDeleteHandlerV1Test
Running org.apache.atlas.repository.BaseTest
Tests run: 0, Failures: 0, Errors: 0, Skipped: 0, Time elapsed: 54.45 sec - in org.apache.atlas.BaseRepositoryTest
Java HotSpot(TM) 64-Bit Server VM warning: ignoring option MaxPermSize=512m; support was removed
in 8.0
Tests run: 0, Failures: 0, Errors: 0, Skipped: 0, Time elapsed: 55.395 sec - in org.apache.atlas.TestUtils
Java HotSpot(TM) 64-Bit Server VM warning: ignoring option MaxPermSize=512m; support was removed
in 8.0
Tests run: 9, Failures: 0, Errors: 0, Skipped: 0, Time elapsed: 56.659 sec - in org.apache.atlas.utils.ObjectUpdateSynchronizerTest
Tests run: 0, Failures: 0, Errors: 0, Skipped: 0, Time elapsed: 56.555 sec - in org.apache.atlas.query.BaseGremlinTest
Java HotSpot(TM) 64-Bit Server VM warning: ignoring option MaxPermSize=512m; support was removed
in 8.0
Tests run: 0, Failures: 0, Errors: 0, Skipped: 0, Time elapsed: 56.242 sec - in org.apache.atlas.repository.store.graph.v1.AtlasDeleteHandlerV1Test
Java HotSpot(TM) 64-Bit Server VM warning: ignoring option MaxPermSize=512m; support was removed
in 8.0
Running org.apache.atlas.repository.userprofile.UserProfileServiceTest
Java HotSpot(TM) 64-Bit Server VM warning: ignoring option MaxPermSize=512m; support was removed
in 8.0
Tests run: 0, Failures: 0, Errors: 0, Skipped: 0, Time elapsed: 58.919 sec - in org.apache.atlas.utils.TestResourceFileUtils
Running org.apache.atlas.repository.graph.GraphBackedSearchIndexerMockTest
Running org.apache.atlas.repository.graph.GraphRepoMapperScaleTest
Java HotSpot(TM) 64-Bit Server VM warning: ignoring option MaxPermSize=512m; support was removed
in 8.0
Tests run: 0, Failures: 0, Errors: 0, Skipped: 0, Time elapsed: 59.622 sec - in org.apache.atlas.TestModules
Tests run: 2, Failures: 0, Errors: 0, Skipped: 0, Time elapsed: 59.714 sec - in org.apache.atlas.repository.audit.HBaseBasedAuditRepositoryHATest
Running org.apache.atlas.repository.graph.Gremlin3QueryOptimizerTest
Tests run: 0, Failures: 0, Errors: 0, Skipped: 0, Time elapsed: 58.282 sec - in org.apache.atlas.repository.BaseTest
Running org.apache.atlas.repository.graph.GraphBackedRepositorySoftDeleteTest
Tests run: 5, Failures: 0, Errors: 0, Skipped: 0, Time elapsed: 60.4 sec - in org.apache.atlas.util.CompiledQueryCacheKeyTest
Java HotSpot(TM) 64-Bit Server VM warning: ignoring option MaxPermSize=512m; support was removed
in 8.0
Java HotSpot(TM) 64-Bit Server VM warning: ignoring option MaxPermSize=512m; support was removed
in 8.0
Java HotSpot(TM) 64-Bit Server VM warning: ignoring option MaxPermSize=512m; support was removed
in 8.0
Java HotSpot(TM) 64-Bit Server VM warning: ignoring option MaxPermSize=512m; support was removed
in 8.0
Tests run: 19, Failures: 0, Errors: 0, Skipped: 0, Time elapsed: 60.694 sec - in org.apache.atlas.query.ExpressionTest
Tests run: 0, Failures: 0, Errors: 0, Skipped: 0, Time elapsed: 59.193 sec - in org.apache.atlas.repository.store.graph.v1.InverseReferenceUpdateV1Test
Tests run: 3, Failures: 0, Errors: 0, Skipped: 0, Time elapsed: 60.589 sec - in org.apache.atlas.repository.audit.InMemoryAuditRepositoryTest
Tests run: 5, Failures: 0, Errors: 0, Skipped: 0, Time elapsed: 60.969 sec - in org.apache.atlas.query.QueryProcessorTest
Tests run: 9, Failures: 0, Errors: 0, Skipped: 0, Time elapsed: 59.826 sec - in org.apache.atlas.repository.store.graph.v1.AtlasEntityStoreV1BulkImportPercentTest
Java HotSpot(TM) 64-Bit Server VM warning: ignoring option MaxPermSize=512m; support was removed
in 8.0
Java HotSpot(TM) 64-Bit Server VM warning: ignoring option MaxPermSize=512m; support was removed
in 8.0
Java HotSpot(TM) 64-Bit Server VM warning: ignoring option MaxPermSize=512m; support was removed
in 8.0
Java HotSpot(TM) 64-Bit Server VM warning: ignoring option MaxPermSize=512m; support was removed
in 8.0
Java HotSpot(TM) 64-Bit Server VM warning: ignoring option MaxPermSize=512m; support was removed
in 8.0
Running org.apache.atlas.repository.graph.Gremlin2QueryOptimizerTest
Tests run: 1, Failures: 0, Errors: 0, Skipped: 0, Time elapsed: 61.914 sec - in org.apache.atlas.query.LexerTest
Running org.apache.atlas.repository.graph.GraphBackedRepositoryHardDeleteTest
Running org.apache.atlas.repository.graph.GraphHelperTest
Running org.apache.atlas.repository.graph.GraphBackedMetadataRepositoryTest
Running org.apache.atlas.repository.graph.TestIntSequence
Running org.apache.atlas.repository.graph.GraphBackedSearchIndexerTest
Running org.apache.atlas.repository.graph.ReverseReferenceUpdateSoftDeleteTest
Running org.apache.atlas.repository.graph.ReverseReferenceUpdateHardDeleteTest
Running org.apache.atlas.repository.graph.AbstractGremlinQueryOptimizerTest
Running org.apache.atlas.repository.graph.GraphHelperMockTest
Tests run: 1, Failures: 0, Errors: 0, Skipped: 0, Time elapsed: 65.531 sec - in org.apache.atlas.services.MetricsServiceTest
Java HotSpot(TM) 64-Bit Server VM warning: ignoring option MaxPermSize=512m; support was removed
in 8.0
Java HotSpot(TM) 64-Bit Server VM warning: ignoring option MaxPermSize=512m; support was removed
in 8.0
Tests run: 14, Failures: 0, Errors: 0, Skipped: 0, Time elapsed: 68.263 sec - in org.apache.atlas.query.ParserTest
Running org.apache.atlas.repository.impexp.ImportServiceTest
Running org.apache.atlas.repository.impexp.ClusterServiceTest
Java HotSpot(TM) 64-Bit Server VM warning: ignoring option MaxPermSize=512m; support was removed
in 8.0
Running org.apache.atlas.repository.impexp.ExportServiceTest
Tests run: 1, Failures: 0, Errors: 0, Skipped: 0, Time elapsed: 74.869 sec - in org.apache.atlas.RepositoryServiceLoadingTest
Java HotSpot(TM) 64-Bit Server VM warning: ignoring option MaxPermSize=512m; support was removed
in 8.0
Running org.apache.atlas.repository.impexp.ExportImportAuditServiceTest
Tests run: 1, Failures: 0, Errors: 0, Skipped: 0, Time elapsed: 78.6 sec - in org.apache.atlas.repository.store.graph.v1.AtlasEntityDefStoreV1Test
Java HotSpot(TM) 64-Bit Server VM warning: ignoring option MaxPermSize=512m; support was removed
in 8.0
Running org.apache.atlas.repository.impexp.AtlasImportRequestTest
Tests run: 5, Failures: 0, Errors: 0, Skipped: 0, Time elapsed: 84.027 sec - in org.apache.atlas.repository.typestore.GraphBackedTypeStoreTest
Java HotSpot(TM) 64-Bit Server VM warning: ignoring option MaxPermSize=512m; support was removed
in 8.0
Tests run: 2, Failures: 0, Errors: 0, Skipped: 0, Time elapsed: 86.249 sec - in org.apache.atlas.repository.typestore.StoreBackedTypeCacheTest
Java HotSpot(TM) 64-Bit Server VM warning: ignoring option MaxPermSize=512m; support was removed
in 8.0
Running org.apache.atlas.repository.impexp.ExportSkipLineageTest
Running org.apache.atlas.repository.impexp.ZipSinkTest
Tests run: 5, Failures: 0, Errors: 0, Skipped: 0, Time elapsed: 107.287 sec - in org.apache.atlas.repository.store.graph.v1.InverseReferenceUpdateSoftDeleteV1Test
Java HotSpot(TM) 64-Bit Server VM warning: ignoring option MaxPermSize=512m; support was removed
in 8.0
Tests run: 5, Failures: 0, Errors: 0, Skipped: 0, Time elapsed: 109.848 sec - in org.apache.atlas.repository.store.graph.v1.InverseReferenceUpdateHardDeleteV1Test
Running org.apache.atlas.repository.impexp.ImportTransformerTest
Java HotSpot(TM) 64-Bit Server VM warning: ignoring option MaxPermSize=512m; support was removed
in 8.0
Running org.apache.atlas.repository.impexp.TypeAttributeDifferenceTest
Tests run: 33, Failures: 0, Errors: 0, Skipped: 0, Time elapsed: 62.912 sec - in org.apache.atlas.repository.graph.Gremlin3QueryOptimizerTest
Java HotSpot(TM) 64-Bit Server VM warning: ignoring option MaxPermSize=512m; support was removed
in 8.0
Tests run: 3, Failures: 0, Errors: 0, Skipped: 0, Time elapsed: 66.418 sec - in org.apache.atlas.repository.graph.GraphBackedSearchIndexerMockTest
Java HotSpot(TM) 64-Bit Server VM warning: ignoring option MaxPermSize=512m; support was removed
in 8.0
Running org.apache.atlas.repository.impexp.ImportTransformsTest
Tests run: 0, Failures: 0, Errors: 0, Skipped: 0, Time elapsed: 64.122 sec - in org.apache.atlas.repository.graph.TestIntSequence
Tests run: 0, Failures: 0, Errors: 0, Skipped: 0, Time elapsed: 63.647 sec - in org.apache.atlas.repository.graph.AbstractGremlinQueryOptimizerTest
Java HotSpot(TM) 64-Bit Server VM warning: ignoring option MaxPermSize=512m; support was removed
in 8.0
Java HotSpot(TM) 64-Bit Server VM warning: ignoring option MaxPermSize=512m; support was removed
in 8.0
Running org.apache.atlas.repository.impexp.ReplicationEntityAttributeTest
Tests run: 33, Failures: 0, Errors: 0, Skipped: 0, Time elapsed: 69.288 sec - in org.apache.atlas.repository.graph.Gremlin2QueryOptimizerTest
Running org.apache.atlas.repository.impexp.ImportTransformerJSONTest
Running org.apache.atlas.repository.impexp.UniqueListTest
Java HotSpot(TM) 64-Bit Server VM warning: ignoring option MaxPermSize=512m; support was removed
in 8.0
Tests run: 2, Failures: 0, Errors: 0, Skipped: 0, Time elapsed: 68.184 sec - in org.apache.atlas.repository.graph.GraphHelperMockTest
Java HotSpot(TM) 64-Bit Server VM warning: ignoring option MaxPermSize=512m; support was removed
in 8.0
Running org.apache.atlas.repository.impexp.ZipSourceTest
Running org.apache.atlas.repository.impexp.ExportIncrementalTest
Tests run: 5, Failures: 0, Errors: 0, Skipped: 0, Time elapsed: 82.713 sec - in org.apache.atlas.repository.graph.GraphBackedSearchIndexerTest
Java HotSpot(TM) 64-Bit Server VM warning: ignoring option MaxPermSize=512m; support was removed
in 8.0
Tests run: 5, Failures: 0, Errors: 0, Skipped: 0, Time elapsed: 146.473 sec - in org.apache.atlas.query.LineageQueryTest
Java HotSpot(TM) 64-Bit Server VM warning: ignoring option MaxPermSize=512m; support was removed
in 8.0
Running org.apache.atlas.discovery.EntityDiscoveryServiceTest
Running org.apache.atlas.discovery.GraphBackedDiscoveryServiceTest
Tests run: 6, Failures: 0, Errors: 0, Skipped: 0, Time elapsed: 69.849 sec - in org.apache.atlas.repository.impexp.AtlasImportRequestTest
Java HotSpot(TM) 64-Bit Server VM warning: ignoring option MaxPermSize=512m; support was removed
in 8.0
Running org.apache.atlas.discovery.DataSetLineageServiceTest
Tests run: 4, Failures: 0, Errors: 0, Skipped: 0, Time elapsed: 154.936 sec - in org.apache.atlas.repository.audit.HBaseBasedAuditRepositoryTest
Java HotSpot(TM) 64-Bit Server VM warning: ignoring option MaxPermSize=512m; support was removed
in 8.0
Tests run: 8, Failures: 0, Errors: 0, Skipped: 0, Time elapsed: 67.498 sec - in org.apache.atlas.repository.impexp.ZipSinkTest
Java HotSpot(TM) 64-Bit Server VM warning: ignoring option MaxPermSize=512m; support was removed
in 8.0
Running org.apache.atlas.service.DefaultMetadataServiceTest
Tests run: 13, Failures: 0, Errors: 0, Skipped: 0, Time elapsed: 160.792 sec - in org.apache.atlas.repository.store.graph.v1.AtlasEntityStoreV1Test
Running org.apache.atlas.service.StoreBackedTypeCacheMetadataServiceTest
Tests run: 5, Failures: 0, Errors: 0, Skipped: 0, Time elapsed: 101.6 sec - in org.apache.atlas.repository.graph.ReverseReferenceUpdateHardDeleteTest
Tests run: 11, Failures: 0, Errors: 0, Skipped: 0, Time elapsed: 167.987 sec - in org.apache.atlas.repository.store.graph.v1.HardDeleteHandlerV1Test
Tests run: 5, Failures: 0, Errors: 0, Skipped: 0, Time elapsed: 105.137 sec - in org.apache.atlas.repository.graph.ReverseReferenceUpdateSoftDeleteTest
Tests run: 11, Failures: 0, Errors: 0, Skipped: 0, Time elapsed: 169.182 sec - in org.apache.atlas.repository.store.graph.v1.SoftDeleteHandlerV1Test
Tests run: 8, Failures: 0, Errors: 0, Skipped: 0, Time elapsed: 62.635 sec - in org.apache.atlas.repository.impexp.ImportTransformerTest
Tests run: 14, Failures: 0, Errors: 0, Skipped: 0, Time elapsed: 116.54 sec - in org.apache.atlas.repository.graph.GraphHelperTest
Tests run: 1, Failures: 0, Errors: 0, Skipped: 0, Time elapsed: 110.7 sec - in org.apache.atlas.repository.impexp.ClusterServiceTest
Tests run: 6, Failures: 0, Errors: 0, Skipped: 0, Time elapsed: 66.96 sec - in org.apache.atlas.repository.impexp.TypeAttributeDifferenceTest
Tests run: 14, Failures: 0, Errors: 0, Skipped: 0, Time elapsed: 181.808 sec - in org.apache.atlas.repository.store.graph.AtlasTypeDefGraphStoreTest
Tests run: 4, Failures: 0, Errors: 0, Skipped: 0, Time elapsed: 53.474 sec - in org.apache.atlas.repository.impexp.UniqueListTest
Tests run: 3, Failures: 1, Errors: 0, Skipped: 0, Time elapsed: 106.627 sec <<< FAILURE!
- in org.apache.atlas.repository.impexp.ExportImportAuditServiceTest
numberOfSavedEntries_Retrieved(org.apache.atlas.repository.impexp.ExportImportAuditServiceTest)
 Time elapsed: 12.35 sec  <<< FAILURE!
java.lang.NullPointerException: null
	at org.apache.atlas.repository.impexp.ExportImportAuditServiceTest.numberOfSavedEntries_Retrieved(ExportImportAuditServiceTest.java:96)

Tests run: 8, Failures: 0, Errors: 0, Skipped: 0, Time elapsed: 63.137 sec - in org.apache.atlas.repository.impexp.ImportTransformsTest
Tests run: 6, Failures: 0, Errors: 0, Skipped: 0, Time elapsed: 57.085 sec - in org.apache.atlas.repository.impexp.ZipSourceTest
Tests run: 1, Failures: 0, Errors: 0, Skipped: 0, Time elapsed: 60.296 sec - in org.apache.atlas.repository.impexp.ImportTransformerJSONTest
Tests run: 11, Failures: 0, Errors: 0, Skipped: 0, Time elapsed: 140.66 sec - in org.apache.atlas.repository.userprofile.UserProfileServiceTest
Tests run: 23, Failures: 0, Errors: 0, Skipped: 0, Time elapsed: 211.104 sec - in org.apache.atlas.lineage.EntityLineageServiceTest
Tests run: 30, Failures: 0, Errors: 0, Skipped: 0, Time elapsed: 150.01 sec - in org.apache.atlas.repository.graph.GraphBackedMetadataRepositoryTest
Tests run: 21, Failures: 0, Errors: 0, Skipped: 0, Time elapsed: 213.339 sec - in org.apache.atlas.query.GremlinTest
Tests run: 21, Failures: 0, Errors: 0, Skipped: 0, Time elapsed: 154.187 sec - in org.apache.atlas.repository.graph.GraphBackedRepositorySoftDeleteTest
Tests run: 6, Failures: 0, Errors: 0, Skipped: 0, Time elapsed: 64.925 sec - in org.apache.atlas.discovery.EntityDiscoveryServiceTest
Tests run: 0, Failures: 0, Errors: 0, Skipped: 0, Time elapsed: 63.899 sec - in org.apache.atlas.discovery.DataSetLineageServiceTest
Tests run: 21, Failures: 0, Errors: 0, Skipped: 0, Time elapsed: 155.787 sec - in org.apache.atlas.repository.graph.GraphBackedRepositoryHardDeleteTest
Tests run: 1, Failures: 0, Errors: 0, Skipped: 0, Time elapsed: 133.526 sec - in org.apache.atlas.repository.impexp.ExportSkipLineageTest
Tests run: 11, Failures: 0, Errors: 0, Skipped: 0, Time elapsed: 161.739 sec - in org.apache.atlas.repository.impexp.ImportServiceTest
Tests run: 12, Failures: 0, Errors: 0, Skipped: 0, Time elapsed: 161.475 sec - in org.apache.atlas.repository.impexp.ExportServiceTest
Tests run: 3, Failures: 0, Errors: 0, Skipped: 0, Time elapsed: 70.118 sec - in org.apache.atlas.service.StoreBackedTypeCacheMetadataServiceTest
Tests run: 2, Failures: 0, Errors: 0, Skipped: 0, Time elapsed: 102.87 sec - in org.apache.atlas.repository.impexp.ReplicationEntityAttributeTest
Tests run: 4, Failures: 0, Errors: 0, Skipped: 3, Time elapsed: 97.561 sec - in org.apache.atlas.repository.impexp.ExportIncrementalTest
Tests run: 27, Failures: 0, Errors: 0, Skipped: 0, Time elapsed: 87.958 sec - in org.apache.atlas.service.DefaultMetadataServiceTest
Tests run: 2, Failures: 0, Errors: 0, Skipped: 0, Time elapsed: 350.367 sec - in org.apache.atlas.repository.graph.GraphRepoMapperScaleTest
Tests run: 338, Failures: 0, Errors: 0, Skipped: 0, Time elapsed: 260.005 sec - in org.apache.atlas.discovery.GraphBackedDiscoveryServiceTest

Results :

Failed tests: 
  ExportImportAuditServiceTest.numberOfSavedEntries_Retrieved:96 NullPointer

Tests run: 829, Failures: 1, Errors: 0, Skipped: 3

[INFO] ------------------------------------------------------------------------
[INFO] Reactor Summary:
[INFO] 
[INFO] Apache Atlas Server Build Tools 1.0 ................ SUCCESS [  0.552 s]
[INFO] apache-atlas 0.8.3-SNAPSHOT ........................ SUCCESS [  2.897 s]
[INFO] Apache Atlas Integration ........................... SUCCESS [ 14.211 s]
[INFO] Apache Atlas Common ................................ SUCCESS [  1.883 s]
[INFO] Apache Atlas Typesystem ............................ SUCCESS [ 38.362 s]
[INFO] Apache Atlas Client ................................ SUCCESS [  0.218 s]
[INFO] atlas-client-common ................................ SUCCESS [  0.692 s]
[INFO] atlas-client-v1 .................................... SUCCESS [  3.354 s]
[INFO] Apache Atlas Server API ............................ SUCCESS [  0.693 s]
[INFO] Apache Atlas Notification .......................... SUCCESS [ 12.479 s]
[INFO] atlas-client-v2 .................................... SUCCESS [  0.629 s]
[INFO] Apache Atlas Graph Database Projects ............... SUCCESS [  0.098 s]
[INFO] Apache Atlas Graph Database API .................... SUCCESS [  0.500 s]
[INFO] Graph Database Common Code ......................... SUCCESS [  0.656 s]
[INFO] Apache Atlas Titan 1.0.0 GraphDB Impl .............. SUCCESS [ 30.991 s]
[INFO] Shaded version of Apache hbase client .............. SUCCESS [  7.319 s]
[INFO] Apache Atlas Titan 0.5.4 Graph DB Impl ............. SUCCESS [01:04 min]
[INFO] Apache Atlas Graph Database Implementation Dependencies SUCCESS [  0.141 s]
[INFO] Shaded version of Apache hbase server .............. SUCCESS [ 21.550 s]
[INFO] Apache Atlas Repository ............................ FAILURE [07:36 min]
[INFO] Apache Atlas Authorization ......................... SKIPPED
[INFO] Apache Atlas Business Catalog ...................... SKIPPED
[INFO] Apache Atlas UI .................................... SKIPPED
[INFO] Apache Atlas Web Application ....................... SKIPPED
[INFO] Apache Atlas Documentation ......................... SKIPPED
[INFO] Apache Atlas FileSystem Model ...................... SKIPPED
[INFO] Apache Atlas Plugin Classloader .................... SKIPPED
[INFO] Apache Atlas Hive Bridge Shim ...................... SKIPPED
[INFO] Apache Atlas Hive Bridge ........................... SKIPPED
[INFO] Apache Atlas Falcon Bridge Shim .................... SKIPPED
[INFO] Apache Atlas Falcon Bridge ......................... SKIPPED
[INFO] Apache Atlas Sqoop Bridge Shim ..................... SKIPPED
[INFO] Apache Atlas Sqoop Bridge .......................... SKIPPED
[INFO] Apache Atlas Storm Bridge Shim ..................... SKIPPED
[INFO] Apache Atlas Storm Bridge .......................... SKIPPED
[INFO] Apache Atlas Hbase Bridge Shim ..................... SKIPPED
[INFO] Apache Atlas Hbase Bridge .......................... SKIPPED
[INFO] Apache Atlas Migration Exporter .................... SKIPPED
[INFO] Apache Atlas Distribution 0.8.3-SNAPSHOT ........... SKIPPED
[INFO] ------------------------------------------------------------------------
[INFO] BUILD FAILURE
[INFO] ------------------------------------------------------------------------
[INFO] Total time: 10:59 min
[INFO] Finished at: 2018-08-08T21:45:17Z
[INFO] ------------------------------------------------------------------------
[ERROR] Failed to execute goal org.apache.maven.plugins:maven-surefire-plugin:2.18.1:test
(default-test) on project atlas-repository: There are test failures.
[ERROR] 
[ERROR] Please refer to <https://builds.apache.org/job/Atlas-0.8-UnitTests/ws/repository/target/surefire-reports>
for the individual test results.
[ERROR] -> [Help 1]
[ERROR] 
[ERROR] To see the full stack trace of the errors, re-run Maven with the -e switch.
[ERROR] Re-run Maven using the -X switch to enable full debug logging.
[ERROR] 
[ERROR] For more information about the errors and possible solutions, please read the following
articles:
[ERROR] [Help 1] http://cwiki.apache.org/confluence/display/MAVEN/MojoFailureException
[ERROR] 
[ERROR] After correcting the problems, you can resume the build with the command
[ERROR]   mvn <goals> -rf :atlas-repository
Build step 'Execute shell' marked build as failure
[CHECKSTYLE] Collecting checkstyle analysis files...
[CHECKSTYLE] Searching for all files in <https://builds.apache.org/job/Atlas-0.8-UnitTests/ws/>
that match the pattern **/target/checkstyle-result.xml
[CHECKSTYLE] No files found. Configuration error?
<Git Blamer> Using GitBlamer to create author and commit information for all warnings.
<Git Blamer> GIT_COMMIT=7a64f612eb5e8c3d458e9fa2890698461bbcaa78, workspace=<https://builds.apache.org/job/Atlas-0.8-UnitTests/ws/>
[CHECKSTYLE] Computing warning deltas based on reference build #230
[FINDBUGS] Collecting findbugs analysis files...
[FINDBUGS] Searching for all files in <https://builds.apache.org/job/Atlas-0.8-UnitTests/ws/>
that match the pattern **/target/findbugs.xml
[FINDBUGS] No files found. Configuration error?
<Git Blamer> Using GitBlamer to create author and commit information for all warnings.
<Git Blamer> GIT_COMMIT=7a64f612eb5e8c3d458e9fa2890698461bbcaa78, workspace=<https://builds.apache.org/job/Atlas-0.8-UnitTests/ws/>
[FINDBUGS] Computing warning deltas based on reference build #230
Archiving artifacts
TestNG Reports Processing: START
Looking for TestNG results report in workspace using pattern: **/target/surefire-reports/testng-results.xml,**/target/failsafe-reports/testng-results.xml
Saving reports...
Processing '/x1/jenkins/jenkins-home/jobs/Atlas-0.8-UnitTests/builds/233/testng/testng-results-1.xml'
Processing '/x1/jenkins/jenkins-home/jobs/Atlas-0.8-UnitTests/builds/233/testng/testng-results-2.xml'
Processing '/x1/jenkins/jenkins-home/jobs/Atlas-0.8-UnitTests/builds/233/testng/testng-results-3.xml'
Processing '/x1/jenkins/jenkins-home/jobs/Atlas-0.8-UnitTests/builds/233/testng/testng-results-4.xml'
Processing '/x1/jenkins/jenkins-home/jobs/Atlas-0.8-UnitTests/builds/233/testng/testng-results-5.xml'
Processing '/x1/jenkins/jenkins-home/jobs/Atlas-0.8-UnitTests/builds/233/testng/testng-results-6.xml'
Processing '/x1/jenkins/jenkins-home/jobs/Atlas-0.8-UnitTests/builds/233/testng/testng-results.xml'
TestNG Reports Processing: FINISH

Mime
View raw message