atlas-dev mailing list archives

Site index · List index
Message view « Date » · « Thread »
Top « Date » · « Thread »
From Apache Jenkins Server <jenk...@builds.apache.org>
Subject Build failed in Jenkins: Atlas-0.8-IntegrationTests #218
Date Wed, 01 Aug 2018 00:51:57 GMT
See <https://builds.apache.org/job/Atlas-0.8-IntegrationTests/218/display/redirect?page=changes>

Changes:

[madhan] ATLAS-2325: fix to prevent duplicate elements in SET type attributes

------------------------------------------
[...truncated 3.13 MB...]
    at org.apache.maven.cli.MavenCli.main (MavenCli.java:192)
    at sun.reflect.NativeMethodAccessorImpl.invoke0 (Native Method)
    at sun.reflect.NativeMethodAccessorImpl.invoke (NativeMethodAccessorImpl.java:62)
    at sun.reflect.DelegatingMethodAccessorImpl.invoke (DelegatingMethodAccessorImpl.java:43)
    at java.lang.reflect.Method.invoke (Method.java:498)
    at org.codehaus.plexus.classworlds.launcher.Launcher.launchEnhanced (Launcher.java:289)
    at org.codehaus.plexus.classworlds.launcher.Launcher.launch (Launcher.java:229)
    at org.codehaus.plexus.classworlds.launcher.Launcher.mainWithExitCode (Launcher.java:415)
    at org.codehaus.plexus.classworlds.launcher.Launcher.main (Launcher.java:356)
[WARNING] FAILED ServerConnector@5ccf61bb{HTTP/1.1}{0.0.0.0:31000}: java.net.BindException:
Address already in use
java.net.BindException: Address already in use
    at sun.nio.ch.Net.bind0 (Native Method)
    at sun.nio.ch.Net.bind (Net.java:433)
    at sun.nio.ch.Net.bind (Net.java:425)
    at sun.nio.ch.ServerSocketChannelImpl.bind (ServerSocketChannelImpl.java:223)
    at sun.nio.ch.ServerSocketAdaptor.bind (ServerSocketAdaptor.java:74)
    at org.eclipse.jetty.server.ServerConnector.open (ServerConnector.java:321)
    at org.eclipse.jetty.server.AbstractNetworkConnector.doStart (AbstractNetworkConnector.java:80)
    at org.eclipse.jetty.server.ServerConnector.doStart (ServerConnector.java:236)
    at org.eclipse.jetty.util.component.AbstractLifeCycle.start (AbstractLifeCycle.java:68)
    at org.eclipse.jetty.maven.plugin.MavenServerConnector.doStart (MavenServerConnector.java:120)
    at org.eclipse.jetty.util.component.AbstractLifeCycle.start (AbstractLifeCycle.java:68)
    at org.eclipse.jetty.server.Server.doStart (Server.java:366)
    at org.eclipse.jetty.maven.plugin.JettyServer.doStart (JettyServer.java:73)
    at org.eclipse.jetty.util.component.AbstractLifeCycle.start (AbstractLifeCycle.java:68)
    at org.eclipse.jetty.maven.plugin.AbstractJettyMojo.startJetty (AbstractJettyMojo.java:534)
    at org.eclipse.jetty.maven.plugin.AbstractJettyMojo.execute (AbstractJettyMojo.java:357)
    at org.eclipse.jetty.maven.plugin.JettyRunWarMojo.execute (JettyRunWarMojo.java:64)
    at org.eclipse.jetty.maven.plugin.JettyDeployWar.execute (JettyDeployWar.java:67)
    at org.apache.maven.plugin.DefaultBuildPluginManager.executeMojo (DefaultBuildPluginManager.java:137)
    at org.apache.maven.lifecycle.internal.MojoExecutor.execute (MojoExecutor.java:208)
    at org.apache.maven.lifecycle.internal.MojoExecutor.execute (MojoExecutor.java:154)
    at org.apache.maven.lifecycle.internal.MojoExecutor.execute (MojoExecutor.java:146)
    at org.apache.maven.lifecycle.internal.LifecycleModuleBuilder.buildProject (LifecycleModuleBuilder.java:117)
    at org.apache.maven.lifecycle.internal.LifecycleModuleBuilder.buildProject (LifecycleModuleBuilder.java:81)
    at org.apache.maven.lifecycle.internal.builder.singlethreaded.SingleThreadedBuilder.build
(SingleThreadedBuilder.java:56)
    at org.apache.maven.lifecycle.internal.LifecycleStarter.execute (LifecycleStarter.java:128)
    at org.apache.maven.DefaultMaven.doExecute (DefaultMaven.java:305)
    at org.apache.maven.DefaultMaven.doExecute (DefaultMaven.java:192)
    at org.apache.maven.DefaultMaven.execute (DefaultMaven.java:105)
    at org.apache.maven.cli.MavenCli.execute (MavenCli.java:954)
    at org.apache.maven.cli.MavenCli.doMain (MavenCli.java:288)
    at org.apache.maven.cli.MavenCli.main (MavenCli.java:192)
    at sun.reflect.NativeMethodAccessorImpl.invoke0 (Native Method)
    at sun.reflect.NativeMethodAccessorImpl.invoke (NativeMethodAccessorImpl.java:62)
    at sun.reflect.DelegatingMethodAccessorImpl.invoke (DelegatingMethodAccessorImpl.java:43)
    at java.lang.reflect.Method.invoke (Method.java:498)
    at org.codehaus.plexus.classworlds.launcher.Launcher.launchEnhanced (Launcher.java:289)
    at org.codehaus.plexus.classworlds.launcher.Launcher.launch (Launcher.java:229)
    at org.codehaus.plexus.classworlds.launcher.Launcher.mainWithExitCode (Launcher.java:415)
    at org.codehaus.plexus.classworlds.launcher.Launcher.main (Launcher.java:356)
[WARNING] FAILED org.eclipse.jetty.maven.plugin.MavenServerConnector@6588814a: java.net.BindException:
Address already in use
java.net.BindException: Address already in use
    at sun.nio.ch.Net.bind0 (Native Method)
    at sun.nio.ch.Net.bind (Net.java:433)
    at sun.nio.ch.Net.bind (Net.java:425)
    at sun.nio.ch.ServerSocketChannelImpl.bind (ServerSocketChannelImpl.java:223)
    at sun.nio.ch.ServerSocketAdaptor.bind (ServerSocketAdaptor.java:74)
    at org.eclipse.jetty.server.ServerConnector.open (ServerConnector.java:321)
    at org.eclipse.jetty.server.AbstractNetworkConnector.doStart (AbstractNetworkConnector.java:80)
    at org.eclipse.jetty.server.ServerConnector.doStart (ServerConnector.java:236)
    at org.eclipse.jetty.util.component.AbstractLifeCycle.start (AbstractLifeCycle.java:68)
    at org.eclipse.jetty.maven.plugin.MavenServerConnector.doStart (MavenServerConnector.java:120)
    at org.eclipse.jetty.util.component.AbstractLifeCycle.start (AbstractLifeCycle.java:68)
    at org.eclipse.jetty.server.Server.doStart (Server.java:366)
    at org.eclipse.jetty.maven.plugin.JettyServer.doStart (JettyServer.java:73)
    at org.eclipse.jetty.util.component.AbstractLifeCycle.start (AbstractLifeCycle.java:68)
    at org.eclipse.jetty.maven.plugin.AbstractJettyMojo.startJetty (AbstractJettyMojo.java:534)
    at org.eclipse.jetty.maven.plugin.AbstractJettyMojo.execute (AbstractJettyMojo.java:357)
    at org.eclipse.jetty.maven.plugin.JettyRunWarMojo.execute (JettyRunWarMojo.java:64)
    at org.eclipse.jetty.maven.plugin.JettyDeployWar.execute (JettyDeployWar.java:67)
    at org.apache.maven.plugin.DefaultBuildPluginManager.executeMojo (DefaultBuildPluginManager.java:137)
    at org.apache.maven.lifecycle.internal.MojoExecutor.execute (MojoExecutor.java:208)
    at org.apache.maven.lifecycle.internal.MojoExecutor.execute (MojoExecutor.java:154)
    at org.apache.maven.lifecycle.internal.MojoExecutor.execute (MojoExecutor.java:146)
    at org.apache.maven.lifecycle.internal.LifecycleModuleBuilder.buildProject (LifecycleModuleBuilder.java:117)
    at org.apache.maven.lifecycle.internal.LifecycleModuleBuilder.buildProject (LifecycleModuleBuilder.java:81)
    at org.apache.maven.lifecycle.internal.builder.singlethreaded.SingleThreadedBuilder.build
(SingleThreadedBuilder.java:56)
    at org.apache.maven.lifecycle.internal.LifecycleStarter.execute (LifecycleStarter.java:128)
    at org.apache.maven.DefaultMaven.doExecute (DefaultMaven.java:305)
    at org.apache.maven.DefaultMaven.doExecute (DefaultMaven.java:192)
    at org.apache.maven.DefaultMaven.execute (DefaultMaven.java:105)
    at org.apache.maven.cli.MavenCli.execute (MavenCli.java:954)
    at org.apache.maven.cli.MavenCli.doMain (MavenCli.java:288)
    at org.apache.maven.cli.MavenCli.main (MavenCli.java:192)
    at sun.reflect.NativeMethodAccessorImpl.invoke0 (Native Method)
    at sun.reflect.NativeMethodAccessorImpl.invoke (NativeMethodAccessorImpl.java:62)
    at sun.reflect.DelegatingMethodAccessorImpl.invoke (DelegatingMethodAccessorImpl.java:43)
    at java.lang.reflect.Method.invoke (Method.java:498)
    at org.codehaus.plexus.classworlds.launcher.Launcher.launchEnhanced (Launcher.java:289)
    at org.codehaus.plexus.classworlds.launcher.Launcher.launch (Launcher.java:229)
    at org.codehaus.plexus.classworlds.launcher.Launcher.mainWithExitCode (Launcher.java:415)
    at org.codehaus.plexus.classworlds.launcher.Launcher.main (Launcher.java:356)
[WARNING] FAILED org.eclipse.jetty.maven.plugin.JettyServer@420a6bdd: java.net.BindException:
Address already in use
java.net.BindException: Address already in use
    at sun.nio.ch.Net.bind0 (Native Method)
    at sun.nio.ch.Net.bind (Net.java:433)
    at sun.nio.ch.Net.bind (Net.java:425)
    at sun.nio.ch.ServerSocketChannelImpl.bind (ServerSocketChannelImpl.java:223)
    at sun.nio.ch.ServerSocketAdaptor.bind (ServerSocketAdaptor.java:74)
    at org.eclipse.jetty.server.ServerConnector.open (ServerConnector.java:321)
    at org.eclipse.jetty.server.AbstractNetworkConnector.doStart (AbstractNetworkConnector.java:80)
    at org.eclipse.jetty.server.ServerConnector.doStart (ServerConnector.java:236)
    at org.eclipse.jetty.util.component.AbstractLifeCycle.start (AbstractLifeCycle.java:68)
    at org.eclipse.jetty.maven.plugin.MavenServerConnector.doStart (MavenServerConnector.java:120)
    at org.eclipse.jetty.util.component.AbstractLifeCycle.start (AbstractLifeCycle.java:68)
    at org.eclipse.jetty.server.Server.doStart (Server.java:366)
    at org.eclipse.jetty.maven.plugin.JettyServer.doStart (JettyServer.java:73)
    at org.eclipse.jetty.util.component.AbstractLifeCycle.start (AbstractLifeCycle.java:68)
    at org.eclipse.jetty.maven.plugin.AbstractJettyMojo.startJetty (AbstractJettyMojo.java:534)
    at org.eclipse.jetty.maven.plugin.AbstractJettyMojo.execute (AbstractJettyMojo.java:357)
    at org.eclipse.jetty.maven.plugin.JettyRunWarMojo.execute (JettyRunWarMojo.java:64)
    at org.eclipse.jetty.maven.plugin.JettyDeployWar.execute (JettyDeployWar.java:67)
    at org.apache.maven.plugin.DefaultBuildPluginManager.executeMojo (DefaultBuildPluginManager.java:137)
    at org.apache.maven.lifecycle.internal.MojoExecutor.execute (MojoExecutor.java:208)
    at org.apache.maven.lifecycle.internal.MojoExecutor.execute (MojoExecutor.java:154)
    at org.apache.maven.lifecycle.internal.MojoExecutor.execute (MojoExecutor.java:146)
    at org.apache.maven.lifecycle.internal.LifecycleModuleBuilder.buildProject (LifecycleModuleBuilder.java:117)
    at org.apache.maven.lifecycle.internal.LifecycleModuleBuilder.buildProject (LifecycleModuleBuilder.java:81)
    at org.apache.maven.lifecycle.internal.builder.singlethreaded.SingleThreadedBuilder.build
(SingleThreadedBuilder.java:56)
    at org.apache.maven.lifecycle.internal.LifecycleStarter.execute (LifecycleStarter.java:128)
    at org.apache.maven.DefaultMaven.doExecute (DefaultMaven.java:305)
    at org.apache.maven.DefaultMaven.doExecute (DefaultMaven.java:192)
    at org.apache.maven.DefaultMaven.execute (DefaultMaven.java:105)
    at org.apache.maven.cli.MavenCli.execute (MavenCli.java:954)
    at org.apache.maven.cli.MavenCli.doMain (MavenCli.java:288)
    at org.apache.maven.cli.MavenCli.main (MavenCli.java:192)
    at sun.reflect.NativeMethodAccessorImpl.invoke0 (Native Method)
    at sun.reflect.NativeMethodAccessorImpl.invoke (NativeMethodAccessorImpl.java:62)
    at sun.reflect.DelegatingMethodAccessorImpl.invoke (DelegatingMethodAccessorImpl.java:43)
    at java.lang.reflect.Method.invoke (Method.java:498)
    at org.codehaus.plexus.classworlds.launcher.Launcher.launchEnhanced (Launcher.java:289)
    at org.codehaus.plexus.classworlds.launcher.Launcher.launch (Launcher.java:229)
    at org.codehaus.plexus.classworlds.launcher.Launcher.mainWithExitCode (Launcher.java:415)
    at org.codehaus.plexus.classworlds.launcher.Launcher.main (Launcher.java:356)
[INFO] ------------------------------------------------------------------------
[INFO] Reactor Summary:
[INFO] 
[INFO] Apache Atlas Server Build Tools 1.0 ................ SUCCESS [  0.693 s]
[INFO] apache-atlas 0.8.3-SNAPSHOT ........................ SUCCESS [  5.853 s]
[INFO] Apache Atlas Integration ........................... SUCCESS [ 20.818 s]
[INFO] Apache Atlas Common ................................ SUCCESS [  9.467 s]
[INFO] Apache Atlas Typesystem ............................ SUCCESS [ 50.709 s]
[INFO] Apache Atlas Client ................................ SUCCESS [  0.621 s]
[INFO] atlas-client-common ................................ SUCCESS [  6.770 s]
[INFO] atlas-client-v1 .................................... SUCCESS [  7.332 s]
[INFO] Apache Atlas Server API ............................ SUCCESS [  5.957 s]
[INFO] Apache Atlas Notification .......................... SUCCESS [ 10.448 s]
[INFO] atlas-client-v2 .................................... SUCCESS [  6.255 s]
[INFO] Apache Atlas Graph Database Projects ............... SUCCESS [  0.488 s]
[INFO] Apache Atlas Graph Database API .................... SUCCESS [  4.800 s]
[INFO] Graph Database Common Code ......................... SUCCESS [  5.206 s]
[INFO] Apache Atlas Titan 1.0.0 GraphDB Impl .............. SUCCESS [ 42.900 s]
[INFO] Shaded version of Apache hbase client .............. SUCCESS [  8.259 s]
[INFO] Apache Atlas Titan 0.5.4 Graph DB Impl ............. SUCCESS [ 37.894 s]
[INFO] Apache Atlas Graph Database Implementation Dependencies SUCCESS [  0.910 s]
[INFO] Shaded version of Apache hbase server .............. SUCCESS [ 22.804 s]
[INFO] Apache Atlas Repository ............................ SUCCESS [01:18 min]
[INFO] Apache Atlas Authorization ......................... SUCCESS [  6.575 s]
[INFO] Apache Atlas Business Catalog ...................... SUCCESS [ 10.257 s]
[INFO] Apache Atlas UI .................................... SUCCESS [01:29 min]
[INFO] Apache Atlas Web Application ....................... FAILURE [01:32 min]
[INFO] Apache Atlas Documentation ......................... SKIPPED
[INFO] Apache Atlas FileSystem Model ...................... SKIPPED
[INFO] Apache Atlas Plugin Classloader .................... SKIPPED
[INFO] Apache Atlas Hive Bridge Shim ...................... SKIPPED
[INFO] Apache Atlas Hive Bridge ........................... SKIPPED
[INFO] Apache Atlas Falcon Bridge Shim .................... SKIPPED
[INFO] Apache Atlas Falcon Bridge ......................... SKIPPED
[INFO] Apache Atlas Sqoop Bridge Shim ..................... SKIPPED
[INFO] Apache Atlas Sqoop Bridge .......................... SKIPPED
[INFO] Apache Atlas Storm Bridge Shim ..................... SKIPPED
[INFO] Apache Atlas Storm Bridge .......................... SKIPPED
[INFO] Apache Atlas Hbase Bridge Shim ..................... SKIPPED
[INFO] Apache Atlas Hbase Bridge .......................... SKIPPED
[INFO] Apache Atlas Migration Exporter .................... SKIPPED
[INFO] Apache Atlas Distribution 0.8.3-SNAPSHOT ........... SKIPPED
[INFO] ------------------------------------------------------------------------
[INFO] BUILD FAILURE
[INFO] ------------------------------------------------------------------------
[INFO] Total time: 08:47 min
[INFO] Finished at: 2018-08-01T00:48:08Z
[INFO] ------------------------------------------------------------------------
[ERROR] Failed to execute goal org.eclipse.jetty:jetty-maven-plugin:9.2.12.v20150709:deploy-war
(start-jetty) on project atlas-webapp: Failure: Address already in use -> [Help 1]
[ERROR] 
[ERROR] To see the full stack trace of the errors, re-run Maven with the -e switch.
[ERROR] Re-run Maven using the -X switch to enable full debug logging.
[ERROR] 
[ERROR] For more information about the errors and possible solutions, please read the following
articles:
[ERROR] [Help 1] http://cwiki.apache.org/confluence/display/MAVEN/MojoExecutionException
[ERROR] 
[ERROR] After correcting the problems, you can resume the build with the command
[ERROR]   mvn <goals> -rf :atlas-webapp
Build step 'Execute shell' marked build as failure
[CHECKSTYLE] Collecting checkstyle analysis files...
[CHECKSTYLE] Searching for all files in <https://builds.apache.org/job/Atlas-0.8-IntegrationTests/ws/>
that match the pattern **/target/checkstyle-result.xml
[CHECKSTYLE] Parsing 22 files in <https://builds.apache.org/job/Atlas-0.8-IntegrationTests/ws/>
[CHECKSTYLE] Successfully parsed file <https://builds.apache.org/job/Atlas-0.8-IntegrationTests/ws/authorization/target/checkstyle-result.xml>
with 471 unique warnings and 0 duplicates.
[CHECKSTYLE] Successfully parsed file <https://builds.apache.org/job/Atlas-0.8-IntegrationTests/ws/catalog/target/checkstyle-result.xml>
with 2608 unique warnings and 0 duplicates.
[CHECKSTYLE] Successfully parsed file <https://builds.apache.org/job/Atlas-0.8-IntegrationTests/ws/client/client-v1/target/checkstyle-result.xml>
with 3484 unique warnings and 0 duplicates.
[CHECKSTYLE] Successfully parsed file <https://builds.apache.org/job/Atlas-0.8-IntegrationTests/ws/client/client-v2/target/checkstyle-result.xml>
with 3814 unique warnings and 0 duplicates.
[CHECKSTYLE] Successfully parsed file <https://builds.apache.org/job/Atlas-0.8-IntegrationTests/ws/client/common/target/checkstyle-result.xml>
with 4305 unique warnings and 0 duplicates.
[CHECKSTYLE] Successfully parsed file <https://builds.apache.org/job/Atlas-0.8-IntegrationTests/ws/client/target/checkstyle-result.xml>
with 4305 unique warnings and 0 duplicates.
[CHECKSTYLE] Successfully parsed file <https://builds.apache.org/job/Atlas-0.8-IntegrationTests/ws/common/target/checkstyle-result.xml>
with 5262 unique warnings and 0 duplicates.
[CHECKSTYLE] Successfully parsed file <https://builds.apache.org/job/Atlas-0.8-IntegrationTests/ws/dashboardv2/target/checkstyle-result.xml>
with 5262 unique warnings and 0 duplicates.
[CHECKSTYLE] Successfully parsed file <https://builds.apache.org/job/Atlas-0.8-IntegrationTests/ws/graphdb/api/target/checkstyle-result.xml>
with 5535 unique warnings and 0 duplicates.
[CHECKSTYLE] Successfully parsed file <https://builds.apache.org/job/Atlas-0.8-IntegrationTests/ws/graphdb/common/target/checkstyle-result.xml>
with 5722 unique warnings and 0 duplicates.
[CHECKSTYLE] Successfully parsed file <https://builds.apache.org/job/Atlas-0.8-IntegrationTests/ws/graphdb/graphdb-impls/target/checkstyle-result.xml>
with 5722 unique warnings and 0 duplicates.
[CHECKSTYLE] Successfully parsed file <https://builds.apache.org/job/Atlas-0.8-IntegrationTests/ws/graphdb/target/checkstyle-result.xml>
with 5722 unique warnings and 0 duplicates.
[CHECKSTYLE] Successfully parsed file <https://builds.apache.org/job/Atlas-0.8-IntegrationTests/ws/graphdb/titan0/target/checkstyle-result.xml>
with 8177 unique warnings and 0 duplicates.
[CHECKSTYLE] Successfully parsed file <https://builds.apache.org/job/Atlas-0.8-IntegrationTests/ws/graphdb/titan1/target/checkstyle-result.xml>
with 9144 unique warnings and 0 duplicates.
[CHECKSTYLE] Successfully parsed file <https://builds.apache.org/job/Atlas-0.8-IntegrationTests/ws/intg/target/checkstyle-result.xml>
with 16075 unique warnings and 0 duplicates.
[CHECKSTYLE] Successfully parsed file <https://builds.apache.org/job/Atlas-0.8-IntegrationTests/ws/notification/target/checkstyle-result.xml>
with 17832 unique warnings and 0 duplicates.
[CHECKSTYLE] Successfully parsed file <https://builds.apache.org/job/Atlas-0.8-IntegrationTests/ws/repository/target/checkstyle-result.xml>
with 36917 unique warnings and 0 duplicates.
[CHECKSTYLE] Successfully parsed file <https://builds.apache.org/job/Atlas-0.8-IntegrationTests/ws/server-api/target/checkstyle-result.xml>
with 37307 unique warnings and 0 duplicates.
[CHECKSTYLE] Successfully parsed file <https://builds.apache.org/job/Atlas-0.8-IntegrationTests/ws/shaded/hbase-client-shaded/target/checkstyle-result.xml>
with 37307 unique warnings and 0 duplicates.
[CHECKSTYLE] Successfully parsed file <https://builds.apache.org/job/Atlas-0.8-IntegrationTests/ws/shaded/hbase-server-shaded/target/checkstyle-result.xml>
with 37307 unique warnings and 0 duplicates.
[CHECKSTYLE] Successfully parsed file <https://builds.apache.org/job/Atlas-0.8-IntegrationTests/ws/target/checkstyle-result.xml>
with 37307 unique warnings and 0 duplicates.
[CHECKSTYLE] Successfully parsed file <https://builds.apache.org/job/Atlas-0.8-IntegrationTests/ws/typesystem/target/checkstyle-result.xml>
with 41548 unique warnings and 0 duplicates.
<Git Blamer> Using GitBlamer to create author and commit information for all warnings.
<Git Blamer> GIT_COMMIT=917a0c09c4dddfe9e9a23322172e4213c6445455, workspace=<https://builds.apache.org/job/Atlas-0.8-IntegrationTests/ws/>
 > git rev-parse 917a0c09c4dddfe9e9a23322172e4213c6445455^{commit} # timeout=10
<Git Blamer> Skipping file <https://builds.apache.org/job/Atlas-0.8-IntegrationTests/ws/repository/src/main/java/org/apache/atlas/discovery/SearchIndexer.java,>
no result found.
<Git Blamer> Skipping file <https://builds.apache.org/job/Atlas-0.8-IntegrationTests/ws/catalog/src/main/java/org/apache/atlas/catalog/projection/Relation.java,>
no result found.
[FINDBUGS] Collecting findbugs analysis files...
[FINDBUGS] Searching for all files in <https://builds.apache.org/job/Atlas-0.8-IntegrationTests/ws/>
that match the pattern **/target/findbugs.xml
[FINDBUGS] Parsing 15 files in <https://builds.apache.org/job/Atlas-0.8-IntegrationTests/ws/>
[FINDBUGS] Successfully parsed file <https://builds.apache.org/job/Atlas-0.8-IntegrationTests/ws/authorization/target/findbugs.xml>
with 0 unique warnings and 0 duplicates.
[FINDBUGS] Successfully parsed file <https://builds.apache.org/job/Atlas-0.8-IntegrationTests/ws/catalog/target/findbugs.xml>
with 0 unique warnings and 0 duplicates.
[FINDBUGS] Successfully parsed file <https://builds.apache.org/job/Atlas-0.8-IntegrationTests/ws/client/client-v1/target/findbugs.xml>
with 0 unique warnings and 0 duplicates.
[FINDBUGS] Successfully parsed file <https://builds.apache.org/job/Atlas-0.8-IntegrationTests/ws/client/client-v2/target/findbugs.xml>
with 0 unique warnings and 0 duplicates.
[FINDBUGS] Successfully parsed file <https://builds.apache.org/job/Atlas-0.8-IntegrationTests/ws/client/common/target/findbugs.xml>
with 0 unique warnings and 0 duplicates.
[FINDBUGS] Successfully parsed file <https://builds.apache.org/job/Atlas-0.8-IntegrationTests/ws/common/target/findbugs.xml>
with 0 unique warnings and 0 duplicates.
[FINDBUGS] Successfully parsed file <https://builds.apache.org/job/Atlas-0.8-IntegrationTests/ws/graphdb/api/target/findbugs.xml>
with 0 unique warnings and 0 duplicates.
[FINDBUGS] Successfully parsed file <https://builds.apache.org/job/Atlas-0.8-IntegrationTests/ws/graphdb/common/target/findbugs.xml>
with 0 unique warnings and 0 duplicates.
[FINDBUGS] Successfully parsed file <https://builds.apache.org/job/Atlas-0.8-IntegrationTests/ws/graphdb/titan0/target/findbugs.xml>
with 0 unique warnings and 0 duplicates.
[FINDBUGS] Successfully parsed file <https://builds.apache.org/job/Atlas-0.8-IntegrationTests/ws/graphdb/titan1/target/findbugs.xml>
with 0 unique warnings and 0 duplicates.
[FINDBUGS] Successfully parsed file <https://builds.apache.org/job/Atlas-0.8-IntegrationTests/ws/intg/target/findbugs.xml>
with 0 unique warnings and 0 duplicates.
[FINDBUGS] Successfully parsed file <https://builds.apache.org/job/Atlas-0.8-IntegrationTests/ws/notification/target/findbugs.xml>
with 0 unique warnings and 0 duplicates.
[FINDBUGS] Successfully parsed file <https://builds.apache.org/job/Atlas-0.8-IntegrationTests/ws/repository/target/findbugs.xml>
with 0 unique warnings and 0 duplicates.
[FINDBUGS] Successfully parsed file <https://builds.apache.org/job/Atlas-0.8-IntegrationTests/ws/server-api/target/findbugs.xml>
with 0 unique warnings and 0 duplicates.
[FINDBUGS] Successfully parsed file <https://builds.apache.org/job/Atlas-0.8-IntegrationTests/ws/typesystem/target/findbugs.xml>
with 0 unique warnings and 0 duplicates.
<Git Blamer> Using GitBlamer to create author and commit information for all warnings.
<Git Blamer> GIT_COMMIT=917a0c09c4dddfe9e9a23322172e4213c6445455, workspace=<https://builds.apache.org/job/Atlas-0.8-IntegrationTests/ws/>
Archiving artifacts
[Fast Archiver] No prior successful build to compare, so performing full copy of artifacts
TestNG Reports Processing: START
Looking for TestNG results report in workspace using pattern: **/target/surefire-reports/testng-results.xml,**/target/failsafe-reports/testng-results.xml
Did not find any matching files.

Mime
View raw message