atlas-dev mailing list archives

Site index · List index
Message view « Date » · « Thread »
Top « Date » · « Thread »
From Apache Jenkins Server <jenk...@builds.apache.org>
Subject Build failed in Jenkins: Atlas-0.8-UnitTests #235
Date Mon, 13 Aug 2018 23:44:17 GMT
See <https://builds.apache.org/job/Atlas-0.8-UnitTests/235/display/redirect?page=changes>

Changes:

[amestry] ATLAS-2813: SoftRef implementation.

------------------------------------------
[...truncated 195.99 KB...]
Java HotSpot(TM) 64-Bit Server VM warning: ignoring option MaxPermSize=512m; support was removed
in 8.0
Running org.apache.atlas.repository.store.graph.v1.SoftDeleteHandlerV1Test
Running org.apache.atlas.repository.impexp.ReplicationEntityAttributeTest
Java HotSpot(TM) 64-Bit Server VM warning: ignoring option MaxPermSize=512m; support was removed
in 8.0
Running org.apache.atlas.repository.userprofile.UserProfileServiceTest
Running org.apache.atlas.repository.store.graph.v1.InverseReferenceUpdateV1Test
Running org.apache.atlas.repository.impexp.ExportSkipLineageTest
Running org.apache.atlas.repository.typestore.GraphBackedTypeStoreTest
Running org.apache.atlas.repository.impexp.ImportTransformerTest
Running org.apache.atlas.repository.store.graph.AtlasTypeDefGraphStoreTest
Running org.apache.atlas.repository.impexp.ExportImportAuditServiceTest
Running org.apache.atlas.repository.impexp.ClusterServiceTest
Running org.apache.atlas.repository.store.graph.v1.AtlasEntityStoreV1BulkImportPercentTest
Running org.apache.atlas.repository.store.graph.v1.AtlasDeleteHandlerV1Test
Running org.apache.atlas.repository.typestore.StoreBackedTypeCacheTest
Running org.apache.atlas.repository.store.graph.v1.SoftReferenceTest
Running org.apache.atlas.repository.BaseTest
Running org.apache.atlas.utils.ObjectUpdateSynchronizerTest
Running org.apache.atlas.repository.graph.GraphRepoMapperScaleTest
Running org.apache.atlas.repository.store.graph.v1.AtlasEntityDefStoreV1Test
RRunning ounning org.apache.atlas.repository.audit.HBaseBasrge.daApuadcihteR.eaptolsaist.orreypToessitt
ory.graph.GraphHelperTest
Running org.apache.atlas.repository.graph.GraphBackedMetadataRepositoryTest
Running org.apache.atlas.repository.store.graph.v1.InverseReferenceUpdateSoftDeleteV1Test
Running org.apache.atlas.repository.store.graph.v1.AtlasEntityStoreV1Test
Running org.apache.atlas.repository.graph.GraphBackedSearchIndexerTest
Running org.apache.atlas.repository.graph.ReverseReferenceUpdateSoftDeleteTest
Running org.apache.atlas.repository.store.graph.v1.InverseReferenceUpdateHardDeleteV1Test
Running org.apache.atlas.repository.impexp.ZipSinkTest
Running org.apache.atlas.TestUtils
Running org.apache.atlas.repository.graph.ReverseReferenceUpdateHardDeleteTest
Running org.apache.atlas.repository.graph.TestIntSequence
Running org.apache.atlas.repository.graph.GraphBackedRepositoryHardDeleteTest
Tests run: 0, Failures: 0, Errors: 0, Skipped: 0, Time elapsed: 59.441 sec - in org.apache.atlas.utils.TestResourceFileUtils
Java HotSpot(TM) 64-Bit Server VM warning: ignoring option MaxPermSize=512m; support was removed
in 8.0
Tests run: 0, Failures: 0, Errors: 0, Skipped: 0, Time elapsed: 59.522 sec - in org.apache.atlas.repository.BaseTest
Tests run: 0, Failures: 0, Errors: 0, Skipped: 0, Time elapsed: 60.432 sec - in org.apache.atlas.BaseRepositoryTest
Tests run: 6, Failures: 0, Errors: 0, Skipped: 0, Time elapsed: 60.972 sec - in org.apache.atlas.repository.impexp.TypeAttributeDifferenceTest
Tests run: 6, Failures: 0, Errors: 0, Skipped: 0, Time elapsed: 60.949 sec - in org.apache.atlas.repository.impexp.AtlasImportRequestTest
Tests run: 0, Failures: 0, Errors: 0, Skipped: 0, Time elapsed: 60.846 sec - in org.apache.atlas.TestModules
Java HotSpot(TM) 64-Bit Server VM warning: ignoring option MaxPermSize=512m; support was removed
in 8.0
Java HotSpot(TM) 64-Bit Server VM warning: ignoring option MaxPermSize=512m; support was removed
in 8.0
Java HotSpot(TM) 64-Bit Server VM warning: ignoring option MaxPermSize=512m; support was removed
in 8.0
Tests run: 9, Failures: 0, Errors: 0, Skipped: 0, Time elapsed: 61.024 sec - in org.apache.atlas.repository.store.graph.v1.AtlasEntityStoreV1BulkImportPercentTest
Java HotSpot(TM) 64-Bit Server VM warning: ignoring option MaxPermSize=512m; support was removed
in 8.0
Java HotSpot(TM) 64-Bit Server VM warning: ignoring option MaxPermSize=512m; support was removed
in 8.0
Tests run: 1, Failures: 0, Errors: 0, Skipped: 0, Time elapsed: 62.068 sec - in org.apache.atlas.repository.impexp.ImportTransformerJSONTest
Tests run: 0, Failures: 0, Errors: 0, Skipped: 0, Time elapsed: 60.649 sec - in org.apache.atlas.repository.graph.TestIntSequence
Java HotSpot(TM) 64-Bit Server VM warning: ignoring option MaxPermSize=512m; support was removed
in 8.0
Running org.apache.atlas.repository.graph.GraphBackedRepositorySoftDeleteTest
Java HotSpot(TM) 64-Bit Server VM warning: ignoring option MaxPermSize=512m; support was removed
in 8.0
Tests run: 8, Failures: 0, Errors: 0, Skipped: 0, Time elapsed: 62.68 sec - in org.apache.atlas.repository.impexp.ImportTransformsTest
Java HotSpot(TM) 64-Bit Server VM warning: ignoring option MaxPermSize=512m; support was removed
in 8.0
Tests run: 0, Failures: 0, Errors: 0, Skipped: 0, Time elapsed: 62.515 sec - in org.apache.atlas.repository.store.graph.v1.AtlasDeleteHandlerV1Test
Tests run: 3, Failures: 0, Errors: 0, Skipped: 0, Time elapsed: 63.325 sec - in org.apache.atlas.repository.audit.InMemoryAuditRepositoryTest
Java HotSpot(TM) 64-Bit Server VM warning: ignoring option MaxPermSize=512m; support was removed
in 8.0
Tests run: 4, Failures: 0, Errors: 0, Skipped: 0, Time elapsed: 63.553 sec - in org.apache.atlas.repository.impexp.UniqueListTest
Tests run: 8, Failures: 0, Errors: 0, Skipped: 0, Time elapsed: 62.496 sec - in org.apache.atlas.repository.impexp.ZipSinkTest
Tests run: 0, Failures: 0, Errors: 0, Skipped: 0, Time elapsed: 62.478 sec - in org.apache.atlas.TestUtils
Java HotSpot(TM) 64-Bit Server VM warning: ignoring option MaxPermSize=512m; support was removed
in 8.0
Running org.apache.atlas.repository.graph.GraphBackedSearchIndexerMockTest
Running org.apache.atlas.repository.graph.Gremlin2QueryOptimizerTest
Running org.apache.atlas.repository.graph.GraphHelperMockTest
Java HotSpot(TM) 64-Bit Server VM warning: ignoring option MaxPermSize=512m; support was removed
in 8.0
Java HotSpot(TM) 64-Bit Server VM warning: ignoring option MaxPermSize=512m; support was removed
in 8.0
Java HotSpot(TM) 64-Bit Server VM warning: ignoring option MaxPermSize=512m; support was removed
in 8.0
Java HotSpot(TM) 64-Bit Server VM warning: ignoring option MaxPermSize=512m; support was removed
in 8.0
Running org.apache.atlas.repository.graph.Gremlin3QueryOptimizerTest
Running org.apache.atlas.repository.graph.AbstractGremlinQueryOptimizerTest
Tests run: 0, Failures: 0, Errors: 0, Skipped: 0, Time elapsed: 64.682 sec - in org.apache.atlas.repository.store.graph.v1.InverseReferenceUpdateV1Test
Tests run: 9, Failures: 0, Errors: 0, Skipped: 0, Time elapsed: 64.443 sec - in org.apache.atlas.utils.ObjectUpdateSynchronizerTest
Tests run: 2, Failures: 0, Errors: 0, Skipped: 0, Time elapsed: 65.145 sec - in org.apache.atlas.repository.audit.HBaseBasedAuditRepositoryHATest
Tests run: 8, Failures: 0, Errors: 0, Skipped: 0, Time elapsed: 64.972 sec - in org.apache.atlas.repository.impexp.ImportTransformerTest
Java HotSpot(TM) 64-Bit Server VM warning: ignoring option MaxPermSize=512m; support was removed
in 8.0
Running org.apache.atlas.discovery.EntityDiscoveryServiceTest
Java HotSpot(TM) 64-Bit Server VM warning: ignoring option MaxPermSize=512m; support was removed
in 8.0
Java HotSpot(TM) 64-Bit Server VM warning: ignoring option MaxPermSize=512m; support was removed
in 8.0
Java HotSpot(TM) 64-Bit Server VM warning: ignoring option MaxPermSize=512m; support was removed
in 8.0
Running org.apache.atlas.discovery.DataSetLineageServiceTest
Running org.apache.atlas.discovery.GraphBackedDiscoveryServiceTest
Running org.apache.atlas.services.MetricsServiceTest
Running org.apache.atlas.RepositoryServiceLoadingTest
Tests run: 6, Failures: 0, Errors: 0, Skipped: 0, Time elapsed: 67.487 sec - in org.apache.atlas.repository.impexp.ZipSourceTest
Running org.apache.atlas.query.ExpressionTest
Running org.apache.atlas.query.BaseGremlinTest
Running org.apache.atlas.query.ParserTest
Running org.apache.atlas.query.LexerTest
Java HotSpot(TM) 64-Bit Server VM warning: ignoring option MaxPermSize=512m; support was removed
in 8.0
Running org.apache.atlas.query.LineageQueryTest
Running org.apache.atlas.query.QueryProcessorTest
Running org.apache.atlas.lineage.EntityLineageServiceTest
Running org.apache.atlas.query.GremlinTest
Running org.apache.atlas.util.CompiledQueryCacheKeyTest
Tests run: 5, Failures: 0, Errors: 0, Skipped: 0, Time elapsed: 81.629 sec - in org.apache.atlas.repository.graph.GraphBackedSearchIndexerTest
Tests run: 2, Failures: 1, Errors: 0, Skipped: 1, Time elapsed: 82.802 sec <<< FAILURE!
- in org.apache.atlas.repository.store.graph.v1.SoftReferenceTest
typeCreationFromFile(org.apache.atlas.repository.store.graph.v1.SoftReferenceTest)  Time elapsed:
0.045 sec  <<< FAILURE!
java.io.FileNotFoundException: File '<https://builds.apache.org/job/Atlas-0.8-UnitTests/ws/repository/src/test/resources/json/typesdef-soft-ref.json'>
does not exist
	at org.apache.commons.io.FileUtils.openInputStream(FileUtils.java:299)
	at org.apache.commons.io.FileUtils.readFileToString(FileUtils.java:1711)
	at org.apache.commons.io.FileUtils.readFileToString(FileUtils.java:1748)
	at org.apache.atlas.utils.TestResourceFileUtils.getJson(TestResourceFileUtils.java:72)
	at org.apache.atlas.utils.TestResourceFileUtils.getJson(TestResourceFileUtils.java:76)
	at org.apache.atlas.repository.store.graph.v1.SoftReferenceTest.typeCreationFromFile(SoftReferenceTest.java:75)

Tests run: 2, Failures: 0, Errors: 0, Skipped: 0, Time elapsed: 88.628 sec - in org.apache.atlas.repository.typestore.StoreBackedTypeCacheTest
Tests run: 1, Failures: 0, Errors: 0, Skipped: 0, Time elapsed: 91.162 sec - in org.apache.atlas.repository.store.graph.v1.AtlasEntityDefStoreV1Test
Tests run: 5, Failures: 0, Errors: 0, Skipped: 0, Time elapsed: 94.146 sec - in org.apache.atlas.repository.typestore.GraphBackedTypeStoreTest
Tests run: 5, Failures: 0, Errors: 0, Skipped: 0, Time elapsed: 98.998 sec - in org.apache.atlas.repository.graph.ReverseReferenceUpdateHardDeleteTest
Tests run: 5, Failures: 0, Errors: 0, Skipped: 0, Time elapsed: 101.867 sec - in org.apache.atlas.repository.graph.ReverseReferenceUpdateSoftDeleteTest
Tests run: 1, Failures: 0, Errors: 0, Skipped: 0, Time elapsed: 108.511 sec - in org.apache.atlas.repository.impexp.ClusterServiceTest
Tests run: 3, Failures: 1, Errors: 0, Skipped: 0, Time elapsed: 118.422 sec <<< FAILURE!
- in org.apache.atlas.repository.impexp.ExportImportAuditServiceTest
numberOfSavedEntries_Retrieved(org.apache.atlas.repository.impexp.ExportImportAuditServiceTest)
 Time elapsed: 14.059 sec  <<< FAILURE!
java.lang.NullPointerException: null
	at org.apache.atlas.repository.impexp.ExportImportAuditServiceTest.numberOfSavedEntries_Retrieved(ExportImportAuditServiceTest.java:96)

Tests run: 14, Failures: 0, Errors: 0, Skipped: 0, Time elapsed: 119.536 sec - in org.apache.atlas.repository.graph.GraphHelperTest
Tests run: 3, Failures: 0, Errors: 0, Skipped: 0, Time elapsed: 121.126 sec - in org.apache.atlas.service.StoreBackedTypeCacheMetadataServiceTest
Tests run: 5, Failures: 0, Errors: 0, Skipped: 0, Time elapsed: 122.41 sec - in org.apache.atlas.repository.store.graph.v1.InverseReferenceUpdateHardDeleteV1Test
Tests run: 5, Failures: 0, Errors: 0, Skipped: 0, Time elapsed: 122.62 sec - in org.apache.atlas.repository.store.graph.v1.InverseReferenceUpdateSoftDeleteV1Test
Tests run: 1, Failures: 0, Errors: 0, Skipped: 0, Time elapsed: 59.18 sec - in org.apache.atlas.query.LexerTest
Tests run: 0, Failures: 0, Errors: 0, Skipped: 0, Time elapsed: 61.681 sec - in org.apache.atlas.query.BaseGremlinTest
Tests run: 0, Failures: 0, Errors: 0, Skipped: 0, Time elapsed: 65.628 sec - in org.apache.atlas.repository.graph.AbstractGremlinQueryOptimizerTest
Tests run: 3, Failures: 0, Errors: 0, Skipped: 0, Time elapsed: 66.443 sec - in org.apache.atlas.repository.graph.GraphBackedSearchIndexerMockTest
Tests run: 5, Failures: 0, Errors: 0, Skipped: 0, Time elapsed: 58.691 sec - in org.apache.atlas.util.CompiledQueryCacheKeyTest
Tests run: 5, Failures: 0, Errors: 0, Skipped: 0, Time elapsed: 61.538 sec - in org.apache.atlas.query.QueryProcessorTest
Tests run: 33, Failures: 0, Errors: 0, Skipped: 0, Time elapsed: 66.749 sec - in org.apache.atlas.repository.graph.Gremlin2QueryOptimizerTest
Tests run: 33, Failures: 0, Errors: 0, Skipped: 0, Time elapsed: 67.721 sec - in org.apache.atlas.repository.graph.Gremlin3QueryOptimizerTest
Tests run: 2, Failures: 0, Errors: 0, Skipped: 0, Time elapsed: 70.671 sec - in org.apache.atlas.repository.graph.GraphHelperMockTest
Tests run: 19, Failures: 0, Errors: 0, Skipped: 0, Time elapsed: 67.382 sec - in org.apache.atlas.query.ExpressionTest
Tests run: 14, Failures: 0, Errors: 0, Skipped: 0, Time elapsed: 67.847 sec - in org.apache.atlas.query.ParserTest
Tests run: 4, Failures: 0, Errors: 0, Skipped: 0, Time elapsed: 136.449 sec - in org.apache.atlas.repository.audit.HBaseBasedAuditRepositoryTest
Tests run: 11, Failures: 0, Errors: 0, Skipped: 0, Time elapsed: 137.535 sec - in org.apache.atlas.repository.userprofile.UserProfileServiceTest
Tests run: 1, Failures: 0, Errors: 0, Skipped: 0, Time elapsed: 70.829 sec - in org.apache.atlas.services.MetricsServiceTest
Tests run: 4, Failures: 0, Errors: 0, Skipped: 3, Time elapsed: 141.401 sec - in org.apache.atlas.repository.impexp.ExportIncrementalTest
Tests run: 0, Failures: 0, Errors: 0, Skipped: 0, Time elapsed: 78.038 sec - in org.apache.atlas.discovery.DataSetLineageServiceTest
Tests run: 1, Failures: 0, Errors: 0, Skipped: 0, Time elapsed: 144.137 sec - in org.apache.atlas.repository.impexp.ExportSkipLineageTest
Tests run: 1, Failures: 0, Errors: 0, Skipped: 0, Time elapsed: 78.284 sec - in org.apache.atlas.RepositoryServiceLoadingTest
Tests run: 30, Failures: 0, Errors: 0, Skipped: 0, Time elapsed: 145.63 sec - in org.apache.atlas.repository.graph.GraphBackedMetadataRepositoryTest
Tests run: 6, Failures: 0, Errors: 0, Skipped: 0, Time elapsed: 81.461 sec - in org.apache.atlas.discovery.EntityDiscoveryServiceTest
Tests run: 2, Failures: 0, Errors: 0, Skipped: 0, Time elapsed: 148.475 sec - in org.apache.atlas.repository.impexp.ReplicationEntityAttributeTest
Tests run: 21, Failures: 0, Errors: 0, Skipped: 0, Time elapsed: 148.412 sec - in org.apache.atlas.repository.graph.GraphBackedRepositoryHardDeleteTest
Tests run: 13, Failures: 0, Errors: 0, Skipped: 0, Time elapsed: 149.668 sec - in org.apache.atlas.repository.store.graph.v1.AtlasEntityStoreV1Test
Tests run: 14, Failures: 0, Errors: 0, Skipped: 0, Time elapsed: 150.8 sec - in org.apache.atlas.repository.store.graph.AtlasTypeDefGraphStoreTest
Tests run: 11, Failures: 0, Errors: 0, Skipped: 0, Time elapsed: 155.141 sec - in org.apache.atlas.repository.store.graph.v1.HardDeleteHandlerV1Test
Tests run: 11, Failures: 0, Errors: 0, Skipped: 0, Time elapsed: 155.767 sec - in org.apache.atlas.repository.store.graph.v1.SoftDeleteHandlerV1Test
Tests run: 12, Failures: 0, Errors: 0, Skipped: 0, Time elapsed: 158.66 sec - in org.apache.atlas.repository.impexp.ExportServiceTest
Tests run: 5, Failures: 0, Errors: 0, Skipped: 0, Time elapsed: 91.012 sec - in org.apache.atlas.query.LineageQueryTest
Tests run: 27, Failures: 0, Errors: 0, Skipped: 0, Time elapsed: 160.44 sec - in org.apache.atlas.service.DefaultMetadataServiceTest
Tests run: 11, Failures: 0, Errors: 0, Skipped: 0, Time elapsed: 160.372 sec - in org.apache.atlas.repository.impexp.ImportServiceTest
Tests run: 21, Failures: 0, Errors: 0, Skipped: 0, Time elapsed: 99.431 sec - in org.apache.atlas.repository.graph.GraphBackedRepositorySoftDeleteTest
Tests run: 21, Failures: 0, Errors: 0, Skipped: 0, Time elapsed: 94.939 sec - in org.apache.atlas.query.GremlinTest
Tests run: 23, Failures: 0, Errors: 0, Skipped: 0, Time elapsed: 98.73 sec - in org.apache.atlas.lineage.EntityLineageServiceTest
Tests run: 338, Failures: 0, Errors: 0, Skipped: 0, Time elapsed: 226.784 sec - in org.apache.atlas.discovery.GraphBackedDiscoveryServiceTest
Tests run: 2, Failures: 0, Errors: 0, Skipped: 0, Time elapsed: 349.9 sec - in org.apache.atlas.repository.graph.GraphRepoMapperScaleTest

Results :

Failed tests: 
  ExportImportAuditServiceTest.numberOfSavedEntries_Retrieved:96 NullPointer
  SoftReferenceTest.typeCreationFromFile:75 » FileNotFound File '/home/jenkins/j...

Tests run: 831, Failures: 2, Errors: 0, Skipped: 4

[INFO] ------------------------------------------------------------------------
[INFO] Reactor Summary:
[INFO] 
[INFO] Apache Atlas Server Build Tools 1.0 ................ SUCCESS [  0.564 s]
[INFO] apache-atlas 0.8.3-SNAPSHOT ........................ SUCCESS [  1.944 s]
[INFO] Apache Atlas Integration ........................... SUCCESS [ 10.461 s]
[INFO] Apache Atlas Common ................................ SUCCESS [  1.983 s]
[INFO] Apache Atlas Typesystem ............................ SUCCESS [ 33.641 s]
[INFO] Apache Atlas Client ................................ SUCCESS [  0.152 s]
[INFO] atlas-client-common ................................ SUCCESS [  0.769 s]
[INFO] atlas-client-v1 .................................... SUCCESS [  3.508 s]
[INFO] Apache Atlas Server API ............................ SUCCESS [  0.937 s]
[INFO] Apache Atlas Notification .......................... SUCCESS [ 13.005 s]
[INFO] atlas-client-v2 .................................... SUCCESS [  0.656 s]
[INFO] Apache Atlas Graph Database Projects ............... SUCCESS [  0.096 s]
[INFO] Apache Atlas Graph Database API .................... SUCCESS [  0.550 s]
[INFO] Graph Database Common Code ......................... SUCCESS [  0.740 s]
[INFO] Apache Atlas Titan 1.0.0 GraphDB Impl .............. SUCCESS [ 28.394 s]
[INFO] Shaded version of Apache hbase client .............. SUCCESS [  7.399 s]
[INFO] Apache Atlas Titan 0.5.4 Graph DB Impl ............. SUCCESS [01:07 min]
[INFO] Apache Atlas Graph Database Implementation Dependencies SUCCESS [  0.133 s]
[INFO] Shaded version of Apache hbase server .............. SUCCESS [ 20.825 s]
[INFO] Apache Atlas Repository ............................ FAILURE [06:36 min]
[INFO] Apache Atlas Authorization ......................... SKIPPED
[INFO] Apache Atlas Business Catalog ...................... SKIPPED
[INFO] Apache Atlas UI .................................... SKIPPED
[INFO] Apache Atlas Web Application ....................... SKIPPED
[INFO] Apache Atlas Documentation ......................... SKIPPED
[INFO] Apache Atlas FileSystem Model ...................... SKIPPED
[INFO] Apache Atlas Plugin Classloader .................... SKIPPED
[INFO] Apache Atlas Hive Bridge Shim ...................... SKIPPED
[INFO] Apache Atlas Hive Bridge ........................... SKIPPED
[INFO] Apache Atlas Falcon Bridge Shim .................... SKIPPED
[INFO] Apache Atlas Falcon Bridge ......................... SKIPPED
[INFO] Apache Atlas Sqoop Bridge Shim ..................... SKIPPED
[INFO] Apache Atlas Sqoop Bridge .......................... SKIPPED
[INFO] Apache Atlas Storm Bridge Shim ..................... SKIPPED
[INFO] Apache Atlas Storm Bridge .......................... SKIPPED
[INFO] Apache Atlas Hbase Bridge Shim ..................... SKIPPED
[INFO] Apache Atlas Hbase Bridge .......................... SKIPPED
[INFO] Apache Atlas Migration Exporter .................... SKIPPED
[INFO] Apache Atlas Distribution 0.8.3-SNAPSHOT ........... SKIPPED
[INFO] ------------------------------------------------------------------------
[INFO] BUILD FAILURE
[INFO] ------------------------------------------------------------------------
[INFO] Total time: 09:50 min
[INFO] Finished at: 2018-08-13T23:44:11Z
[INFO] ------------------------------------------------------------------------
[ERROR] Failed to execute goal org.apache.maven.plugins:maven-surefire-plugin:2.18.1:test
(default-test) on project atlas-repository: There are test failures.
[ERROR] 
[ERROR] Please refer to <https://builds.apache.org/job/Atlas-0.8-UnitTests/ws/repository/target/surefire-reports>
for the individual test results.
[ERROR] -> [Help 1]
[ERROR] 
[ERROR] To see the full stack trace of the errors, re-run Maven with the -e switch.
[ERROR] Re-run Maven using the -X switch to enable full debug logging.
[ERROR] 
[ERROR] For more information about the errors and possible solutions, please read the following
articles:
[ERROR] [Help 1] http://cwiki.apache.org/confluence/display/MAVEN/MojoFailureException
[ERROR] 
[ERROR] After correcting the problems, you can resume the build with the command
[ERROR]   mvn <goals> -rf :atlas-repository
Build step 'Execute shell' marked build as failure
[CHECKSTYLE] Collecting checkstyle analysis files...
[CHECKSTYLE] Searching for all files in <https://builds.apache.org/job/Atlas-0.8-UnitTests/ws/>
that match the pattern **/target/checkstyle-result.xml
[CHECKSTYLE] No files found. Configuration error?
<Git Blamer> Using GitBlamer to create author and commit information for all warnings.
<Git Blamer> GIT_COMMIT=c850bcad4a9adc3b3870e59ac1dc12d483aef89b, workspace=<https://builds.apache.org/job/Atlas-0.8-UnitTests/ws/>
[CHECKSTYLE] Computing warning deltas based on reference build #230
[FINDBUGS] Collecting findbugs analysis files...
[FINDBUGS] Searching for all files in <https://builds.apache.org/job/Atlas-0.8-UnitTests/ws/>
that match the pattern **/target/findbugs.xml
[FINDBUGS] No files found. Configuration error?
<Git Blamer> Using GitBlamer to create author and commit information for all warnings.
<Git Blamer> GIT_COMMIT=c850bcad4a9adc3b3870e59ac1dc12d483aef89b, workspace=<https://builds.apache.org/job/Atlas-0.8-UnitTests/ws/>
[FINDBUGS] Computing warning deltas based on reference build #230
Archiving artifacts
TestNG Reports Processing: START
Looking for TestNG results report in workspace using pattern: **/target/surefire-reports/testng-results.xml,**/target/failsafe-reports/testng-results.xml
Saving reports...
Processing '/x1/jenkins/jenkins-home/jobs/Atlas-0.8-UnitTests/builds/235/testng/testng-results-1.xml'
Processing '/x1/jenkins/jenkins-home/jobs/Atlas-0.8-UnitTests/builds/235/testng/testng-results-2.xml'
Processing '/x1/jenkins/jenkins-home/jobs/Atlas-0.8-UnitTests/builds/235/testng/testng-results-3.xml'
Processing '/x1/jenkins/jenkins-home/jobs/Atlas-0.8-UnitTests/builds/235/testng/testng-results-4.xml'
Processing '/x1/jenkins/jenkins-home/jobs/Atlas-0.8-UnitTests/builds/235/testng/testng-results-5.xml'
Processing '/x1/jenkins/jenkins-home/jobs/Atlas-0.8-UnitTests/builds/235/testng/testng-results-6.xml'
Processing '/x1/jenkins/jenkins-home/jobs/Atlas-0.8-UnitTests/builds/235/testng/testng-results.xml'
TestNG Reports Processing: FINISH

Mime
View raw message