atlas-dev mailing list archives

Site index · List index
Message view « Date » · « Thread »
Top « Date » · « Thread »
From Apache Jenkins Server <jenk...@builds.apache.org>
Subject Build failed in Jenkins: Atlas-1.0-NoTests #850
Date Wed, 22 Aug 2018 15:58:16 GMT
See <https://builds.apache.org/job/Atlas-1.0-NoTests/850/display/redirect>

------------------------------------------
[...truncated 155.62 KB...]
[INFO] --- maven-resources-plugin:2.7:resources (default-resources) @ atlas-authorization
---
[INFO] Using 'UTF-8' encoding to copy filtered resources.
[INFO] Copying 1 resource
[INFO] Copying 2 resources to META-INF
[INFO] Copying 3 resources
[INFO] 
[INFO] --- maven-compiler-plugin:3.7.0:compile (default-compile) @ atlas-authorization ---
[INFO] Changes detected - recompiling the module!
[INFO] Compiling 15 source files to <https://builds.apache.org/job/Atlas-1.0-NoTests/ws/authorization/target/classes>
[INFO] <https://builds.apache.org/job/Atlas-1.0-NoTests/ws/authorization/src/main/java/org/apache/atlas/authorize/simple/AtlasSimpleAuthzPolicy.java>:
<https://builds.apache.org/job/Atlas-1.0-NoTests/ws/authorization/src/main/java/org/apache/atlas/authorize/simple/AtlasSimpleAuthzPolicy.java>
uses or overrides a deprecated API.
[INFO] <https://builds.apache.org/job/Atlas-1.0-NoTests/ws/authorization/src/main/java/org/apache/atlas/authorize/simple/AtlasSimpleAuthzPolicy.java>:
Recompile with -Xlint:deprecation for details.
[INFO] 
[INFO] --- maven-resources-plugin:2.7:testResources (default-testResources) @ atlas-authorization
---
[INFO] Using 'UTF-8' encoding to copy filtered resources.
[INFO] Copying 2 resources
[INFO] Copying 3 resources
[INFO] 
[INFO] --- maven-compiler-plugin:3.7.0:testCompile (default-testCompile) @ atlas-authorization
---
[INFO] Changes detected - recompiling the module!
[INFO] Compiling 1 source file to <https://builds.apache.org/job/Atlas-1.0-NoTests/ws/authorization/target/test-classes>
[INFO] 
[INFO] --- maven-surefire-plugin:2.18.1:test (default-test) @ atlas-authorization ---
[INFO] Tests are skipped.
[INFO] 
[INFO] --- maven-jar-plugin:2.5:jar (default-jar) @ atlas-authorization ---
[INFO] Building jar: <https://builds.apache.org/job/Atlas-1.0-NoTests/ws/authorization/target/atlas-authorization-1.1.0-SNAPSHOT.jar>
[INFO] 
[INFO] --- maven-site-plugin:3.7:attach-descriptor (attach-descriptor) @ atlas-authorization
---
[INFO] Skipping because packaging 'jar' is not pom.
[INFO] 
[INFO] --- maven-failsafe-plugin:2.18.1:integration-test (integration-test) @ atlas-authorization
---
[INFO] Tests are skipped.
[INFO] 
[INFO] --- maven-source-plugin:2.4:jar-no-fork (attach-sources) @ atlas-authorization ---
[INFO] Building jar: <https://builds.apache.org/job/Atlas-1.0-NoTests/ws/authorization/target/atlas-authorization-1.1.0-SNAPSHOT-sources.jar>
[INFO] 
[INFO] --- maven-source-plugin:2.4:test-jar-no-fork (attach-sources) @ atlas-authorization
---
[INFO] Building jar: <https://builds.apache.org/job/Atlas-1.0-NoTests/ws/authorization/target/atlas-authorization-1.1.0-SNAPSHOT-test-sources.jar>
[INFO] 
[INFO] --- maven-failsafe-plugin:2.18.1:verify (verify) @ atlas-authorization ---
[INFO] Tests are skipped.
[INFO] 
[INFO] --- maven-checkstyle-plugin:2.9.1:check (checkstyle-check) @ atlas-authorization ---
[INFO] 
[INFO] >>> findbugs-maven-plugin:3.0.1:check (findbugs-check) > :findbugs @ atlas-authorization
>>>
[INFO] 
[INFO] --- findbugs-maven-plugin:3.0.1:findbugs (findbugs) @ atlas-authorization ---
[INFO] 
[INFO] <<< findbugs-maven-plugin:3.0.1:check (findbugs-check) < :findbugs @ atlas-authorization
<<<
[INFO] 
[INFO] 
[INFO] --- findbugs-maven-plugin:3.0.1:check (findbugs-check) @ atlas-authorization ---
[INFO] 
[INFO] --- maven-install-plugin:2.5.2:install (default-install) @ atlas-authorization ---
[INFO] Installing <https://builds.apache.org/job/Atlas-1.0-NoTests/ws/authorization/target/atlas-authorization-1.1.0-SNAPSHOT.jar>
to /home/jenkins/.m2/repository/org/apache/atlas/atlas-authorization/1.1.0-SNAPSHOT/atlas-authorization-1.1.0-SNAPSHOT.jar
[INFO] Installing <https://builds.apache.org/job/Atlas-1.0-NoTests/ws/authorization/pom.xml>
to /home/jenkins/.m2/repository/org/apache/atlas/atlas-authorization/1.1.0-SNAPSHOT/atlas-authorization-1.1.0-SNAPSHOT.pom
[INFO] Installing <https://builds.apache.org/job/Atlas-1.0-NoTests/ws/authorization/target/atlas-authorization-1.1.0-SNAPSHOT-sources.jar>
to /home/jenkins/.m2/repository/org/apache/atlas/atlas-authorization/1.1.0-SNAPSHOT/atlas-authorization-1.1.0-SNAPSHOT-sources.jar
[INFO] Installing <https://builds.apache.org/job/Atlas-1.0-NoTests/ws/authorization/target/atlas-authorization-1.1.0-SNAPSHOT-test-sources.jar>
to /home/jenkins/.m2/repository/org/apache/atlas/atlas-authorization/1.1.0-SNAPSHOT/atlas-authorization-1.1.0-SNAPSHOT-test-sources.jar
[INFO] 
[INFO] -----------------< org.apache.atlas:atlas-repository >------------------
[INFO] Building Apache Atlas Repository 1.1.0-SNAPSHOT                  [20/37]
[INFO] --------------------------------[ jar ]---------------------------------
[INFO] 
[INFO] --- maven-clean-plugin:2.5:clean (default-clean) @ atlas-repository ---
[INFO] Deleting <https://builds.apache.org/job/Atlas-1.0-NoTests/ws/repository> (includes
= [**/*.pyc], excludes = [])
[INFO] 
[INFO] --- maven-enforcer-plugin:3.0.0-M1:enforce (enforce-versions) @ atlas-repository ---
[INFO] 
[INFO] --- buildnumber-maven-plugin:1.4:create (default) @ atlas-repository ---
[INFO] Executing: /bin/sh -c cd '<https://builds.apache.org/job/Atlas-1.0-NoTests/ws/repository'>
&& 'git' 'rev-parse' '--verify' 'HEAD'
[INFO] Working directory: <https://builds.apache.org/job/Atlas-1.0-NoTests/ws/repository>
[INFO] Storing buildNumber: 165d6cfccac83bd74876cb0cda8fe159490e465e at timestamp: 1534953486004
[WARNING] Cannot get the branch information from the git repository: 
Detecting the current branch failed: fatal: ref HEAD is not a symbolic ref

[INFO] Executing: /bin/sh -c cd '<https://builds.apache.org/job/Atlas-1.0-NoTests/ws/repository'>
&& 'git' 'rev-parse' '--verify' 'HEAD'
[INFO] Working directory: <https://builds.apache.org/job/Atlas-1.0-NoTests/ws/repository>
[INFO] Storing buildScmBranch: UNKNOWN
[INFO] 
[INFO] --- apache-rat-plugin:0.12:check (rat-check) @ atlas-repository ---
[INFO] Enabled default license matchers.
[INFO] Will parse SCM ignores for exclusions...
[INFO] Finished adding exclusions from SCM ignore files.
[INFO] 61 implicit excludes (use -debug for more details).
[INFO] Exclude: **/antlr4/**
[INFO] Exclude: **/dependency-reduced-pom.xml
[INFO] Exclude: **/javax.script.ScriptEngineFactory
[INFO] Exclude: .reviewboardrc
[INFO] Exclude: 3party-licenses/**
[INFO] Exclude: **/.cache
[INFO] Exclude: **/.cache-main
[INFO] Exclude: **/.cache-tests
[INFO] Exclude: **/.checkstyle
[INFO] Exclude: **/*.txt
[INFO] Exclude: **/*.json
[INFO] Exclude: .pc/**
[INFO] Exclude: debian/**
[INFO] Exclude: .svn/**
[INFO] Exclude: .git/**
[INFO] Exclude: .gitignore
[INFO] Exclude: **/.idea/**
[INFO] Exclude: **/*.twiki
[INFO] Exclude: **/*.iml
[INFO] Exclude: **/*.json
[INFO] Exclude: **/*.log
[INFO] Exclude: **/target/**
[INFO] Exclude: **/target*/**
[INFO] Exclude: **/build/**
[INFO] Exclude: **/*.patch
[INFO] Exclude: derby.log
[INFO] Exclude: **/logs/**
[INFO] Exclude: **/.classpath
[INFO] Exclude: **/.project
[INFO] Exclude: **/.settings/**
[INFO] Exclude: **/test-output/**
[INFO] Exclude: **/mock/**
[INFO] Exclude: **/data/**
[INFO] Exclude: **/maven-eclipse.xml
[INFO] Exclude: **/.externalToolBuilders/**
[INFO] Exclude: **/build.log
[INFO] Exclude: **/.bowerrc
[INFO] Exclude: *.json
[INFO] Exclude: **/overlays/**
[INFO] Exclude: dev-support/**
[INFO] Exclude: **/users-credentials.properties
[INFO] Exclude: **/public/css/animate.min.css
[INFO] Exclude: **/public/css/bootstrap-sidebar.css
[INFO] Exclude: **/public/js/external_lib/**
[INFO] Exclude: **/node_modules/**
[INFO] Exclude: **/public/js/libs/**
[INFO] Exclude: **/atlas.data/**
[INFO] Exclude: **/${sys:atlas.data}/**
[INFO] Exclude: **/policy-store.txt
[INFO] Exclude: **/*rebel*.xml
[INFO] Exclude: **/*rebel*.xml.bak
[INFO] Exclude: **/test/resources/**
[INFO] 177 resources included (use -debug for more details)
[INFO] Rat check: Summary over all files. Unapproved: 0, unknown: 0, generated: 0, approved:
177 licenses.
[INFO] 
[INFO] --- maven-resources-plugin:2.7:copy-resources (copy-resources-solr) @ atlas-repository
---
[INFO] Using 'UTF-8' encoding to copy filtered resources.
[INFO] Copying 9 resources
[INFO] 
[INFO] --- maven-remote-resources-plugin:1.5:process (default) @ atlas-repository ---
[INFO] 
[INFO] --- maven-resources-plugin:2.7:resources (default-resources) @ atlas-repository ---
[INFO] Using 'UTF-8' encoding to copy filtered resources.
[INFO] skip non existing resourceDirectory <https://builds.apache.org/job/Atlas-1.0-NoTests/ws/repository/src/main/resources>
[INFO] Copying 2 resources to META-INF
[INFO] Copying 3 resources
[INFO] 
[INFO] --- maven-compiler-plugin:3.7.0:compile (default-compile) @ atlas-repository ---
[INFO] Changes detected - recompiling the module!
[INFO] Compiling 131 source files to <https://builds.apache.org/job/Atlas-1.0-NoTests/ws/repository/target/classes>
[INFO] <https://builds.apache.org/job/Atlas-1.0-NoTests/ws/repository/src/main/java/org/apache/atlas/repository/converters/AtlasInstanceConverter.java>:
Some input files use or override a deprecated API.
[INFO] <https://builds.apache.org/job/Atlas-1.0-NoTests/ws/repository/src/main/java/org/apache/atlas/repository/converters/AtlasInstanceConverter.java>:
Recompile with -Xlint:deprecation for details.
[INFO] <https://builds.apache.org/job/Atlas-1.0-NoTests/ws/repository/src/main/java/org/apache/atlas/repository/store/graph/v2/AtlasGraphUtilsV2.java>:
Some input files use unchecked or unsafe operations.
[INFO] <https://builds.apache.org/job/Atlas-1.0-NoTests/ws/repository/src/main/java/org/apache/atlas/repository/store/graph/v2/AtlasGraphUtilsV2.java>:
Recompile with -Xlint:unchecked for details.
[INFO] -------------------------------------------------------------
[ERROR] COMPILATION ERROR : 
[INFO] -------------------------------------------------------------
[ERROR] <https://builds.apache.org/job/Atlas-1.0-NoTests/ws/repository/src/main/java/org/apache/atlas/repository/store/graph/v2/EntityGraphMapper.java>:[1683,17]
cannot find symbol
  symbol:   method isActive(org.apache.atlas.model.instance.AtlasEntity)
  location: class org.apache.atlas.repository.store.graph.v2.EntityGraphMapper
[ERROR] <https://builds.apache.org/job/Atlas-1.0-NoTests/ws/repository/src/main/java/org/apache/atlas/repository/store/graph/v2/EntityGraphMapper.java>:[1696,21]
cannot find symbol
  symbol:   method isActive(org.apache.atlas.model.instance.AtlasEntity)
  location: class org.apache.atlas.repository.store.graph.v2.EntityGraphMapper
[INFO] 2 errors 
[INFO] -------------------------------------------------------------
[INFO] ------------------------------------------------------------------------
[INFO] Reactor Summary:
[INFO] 
[INFO] Apache Atlas Server Build Tools 1.0 ................ SUCCESS [  0.608 s]
[INFO] apache-atlas 1.1.0-SNAPSHOT ........................ SUCCESS [  2.923 s]
[INFO] Apache Atlas Test Utility Tools .................... SUCCESS [  4.458 s]
[INFO] Apache Atlas Integration ........................... SUCCESS [  5.016 s]
[INFO] Apache Atlas Common ................................ SUCCESS [  1.066 s]
[INFO] Apache Atlas Client ................................ SUCCESS [  0.143 s]
[INFO] atlas-client-common ................................ SUCCESS [  0.680 s]
[INFO] atlas-client-v1 .................................... SUCCESS [  1.042 s]
[INFO] Apache Atlas Server API ............................ SUCCESS [  0.760 s]
[INFO] Apache Atlas Notification .......................... SUCCESS [  1.695 s]
[INFO] atlas-client-v2 .................................... SUCCESS [  0.798 s]
[INFO] Apache Atlas Graph Database Projects ............... SUCCESS [  0.129 s]
[INFO] Apache Atlas Graph Database API .................... SUCCESS [  0.613 s]
[INFO] Graph Database Common Code ......................... SUCCESS [  0.720 s]
[INFO] Apache Atlas JanusGraph DB Impl .................... SUCCESS [  5.465 s]
[INFO] Apache Atlas Graph Database Implementation Dependencies SUCCESS [  1.621 s]
[INFO] Shaded version of Apache hbase client .............. SUCCESS [  7.147 s]
[INFO] Shaded version of Apache hbase server .............. SUCCESS [ 19.082 s]
[INFO] Apache Atlas Authorization ......................... SUCCESS [  1.092 s]
[INFO] Apache Atlas Repository ............................ FAILURE [  7.103 s]
[INFO] Apache Atlas UI .................................... SKIPPED
[INFO] Apache Atlas Web Application ....................... SKIPPED
[INFO] Apache Atlas Documentation ......................... SKIPPED
[INFO] Apache Atlas FileSystem Model ...................... SKIPPED
[INFO] Apache Atlas Plugin Classloader .................... SKIPPED
[INFO] Apache Atlas Hive Bridge Shim ...................... SKIPPED
[INFO] Apache Atlas Hive Bridge ........................... SKIPPED
[INFO] Apache Atlas Falcon Bridge Shim .................... SKIPPED
[INFO] Apache Atlas Falcon Bridge ......................... SKIPPED
[INFO] Apache Atlas Sqoop Bridge Shim ..................... SKIPPED
[INFO] Apache Atlas Sqoop Bridge .......................... SKIPPED
[INFO] Apache Atlas Storm Bridge Shim ..................... SKIPPED
[INFO] Apache Atlas Storm Bridge .......................... SKIPPED
[INFO] Apache Atlas Hbase Bridge Shim ..................... SKIPPED
[INFO] Apache Atlas Hbase Bridge .......................... SKIPPED
[INFO] Apache Atlas Kafka Bridge .......................... SKIPPED
[INFO] Apache Atlas Distribution 1.1.0-SNAPSHOT ........... SKIPPED
[INFO] ------------------------------------------------------------------------
[INFO] BUILD FAILURE
[INFO] ------------------------------------------------------------------------
[INFO] Total time: 01:03 min
[INFO] Finished at: 2018-08-22T15:58:13Z
[INFO] ------------------------------------------------------------------------
[ERROR] Failed to execute goal org.apache.maven.plugins:maven-compiler-plugin:3.7.0:compile
(default-compile) on project atlas-repository: Compilation failure: Compilation failure: 
[ERROR] <https://builds.apache.org/job/Atlas-1.0-NoTests/ws/repository/src/main/java/org/apache/atlas/repository/store/graph/v2/EntityGraphMapper.java>:[1683,17]
cannot find symbol
[ERROR]   symbol:   method isActive(org.apache.atlas.model.instance.AtlasEntity)
[ERROR]   location: class org.apache.atlas.repository.store.graph.v2.EntityGraphMapper
[ERROR] <https://builds.apache.org/job/Atlas-1.0-NoTests/ws/repository/src/main/java/org/apache/atlas/repository/store/graph/v2/EntityGraphMapper.java>:[1696,21]
cannot find symbol
[ERROR]   symbol:   method isActive(org.apache.atlas.model.instance.AtlasEntity)
[ERROR]   location: class org.apache.atlas.repository.store.graph.v2.EntityGraphMapper
[ERROR] -> [Help 1]
[ERROR] 
[ERROR] To see the full stack trace of the errors, re-run Maven with the -e switch.
[ERROR] Re-run Maven using the -X switch to enable full debug logging.
[ERROR] 
[ERROR] For more information about the errors and possible solutions, please read the following
articles:
[ERROR] [Help 1] http://cwiki.apache.org/confluence/display/MAVEN/MojoFailureException
[ERROR] 
[ERROR] After correcting the problems, you can resume the build with the command
[ERROR]   mvn <goals> -rf :atlas-repository
Build step 'Execute shell' marked build as failure
[CHECKSTYLE] Collecting checkstyle analysis files...
[CHECKSTYLE] Searching for all files in <https://builds.apache.org/job/Atlas-1.0-NoTests/ws/>
that match the pattern **/target/checkstyle-result.xml
[CHECKSTYLE] No files found. Configuration error?
<Git Blamer> Using GitBlamer to create author and commit information for all warnings.
<Git Blamer> GIT_COMMIT=165d6cfccac83bd74876cb0cda8fe159490e465e, workspace=<https://builds.apache.org/job/Atlas-1.0-NoTests/ws/>
[CHECKSTYLE] Computing warning deltas based on reference build #840
[FINDBUGS] Collecting findbugs analysis files...
[FINDBUGS] Searching for all files in <https://builds.apache.org/job/Atlas-1.0-NoTests/ws/>
that match the pattern **/target/findbugs.xml
[FINDBUGS] No files found. Configuration error?
<Git Blamer> Using GitBlamer to create author and commit information for all warnings.
<Git Blamer> GIT_COMMIT=165d6cfccac83bd74876cb0cda8fe159490e465e, workspace=<https://builds.apache.org/job/Atlas-1.0-NoTests/ws/>
[FINDBUGS] Computing warning deltas based on reference build #840
Archiving artifacts
TestNG Reports Processing: START
Looking for TestNG results report in workspace using pattern: **/target/surefire-reports/testng-results.xml,**/target/failsafe-reports/testng-results.xml
Did not find any matching files.

Mime
View raw message