atlas-dev mailing list archives

Site index · List index
Message view « Date » · « Thread »
Top « Date » · « Thread »
From Apache Jenkins Server <jenk...@builds.apache.org>
Subject Build failed in Jenkins: Atlas-0.8-IntegrationTests #226
Date Mon, 06 Aug 2018 21:54:49 GMT
See <https://builds.apache.org/job/Atlas-0.8-IntegrationTests/226/display/redirect?page=changes>

Changes:

[amestry] ATLAS-2806: Using replication attributes during export and import

------------------------------------------
[...truncated 558.47 KB...]
127.0.0.1 - - [06/Aug/2018:21:50:31 +0000] "POST /api/atlas/entities HTTP/1.1" 201 - "-" "Java/1.8.0_172"
127.0.0.1 - - [06/Aug/2018:21:50:31 +0000] "GET /api/atlas/lineage/hive/table/sales_fact_monthly_mvPN5nsJLL5J/inputs/graph
HTTP/1.1" 200 - "-" "Java/1.8.0_172"
127.0.0.1 - - [06/Aug/2018:21:50:34 +0000] "GET /api/atlas/lineage/hive/table/Saleshmwkmk45EV/schema
HTTP/1.1" 404 - "-" "Java/1.8.0_172"
127.0.0.1 - - [06/Aug/2018:21:50:34 +0000] "GET /api/atlas/lineage/hive/table/sales_factuxJxI4R7Zx/schema
HTTP/1.1" 200 - "-" "Java/1.8.0_172"
127.0.0.1 - - [06/Aug/2018:21:50:35 +0000] "GET /api/atlas/lineage/hive/table/sales_factuxJxI4R7Zx/outputs/graph
HTTP/1.1" 200 - "-" "Java/1.8.0_172"
127.0.0.1 - - [06/Aug/2018:21:50:37 +0000] "GET /api/atlas/entities?type=hive_table_v1&property=qualifiedName&value=sales_factuxJxI4R7Zx
HTTP/1.1" 200 - "-" "Java/1.8.0_172"
127.0.0.1 - - [06/Aug/2018:21:50:37 +0000] "GET /api/atlas/lineage/7f65ed9d-5a28-4417-b299-398296ff4dbd/schema
HTTP/1.1" 200 - "-" "Java/1.8.0_172"
127.0.0.1 - - [06/Aug/2018:21:50:38 +0000] "GET /api/atlas/entities?type=hive_table_v1&property=qualifiedName&value=sales_factuxJxI4R7Zx
HTTP/1.1" 200 - "-" "Java/1.8.0_172"
127.0.0.1 - - [06/Aug/2018:21:50:38 +0000] "GET /api/atlas/lineage/7f65ed9d-5a28-4417-b299-398296ff4dbd/outputs/graph
HTTP/1.1" 200 - "-" "Java/1.8.0_172"
127.0.0.1 - - [06/Aug/2018:21:50:39 +0000] "GET /api/atlas/lineage/hive/table/blah/schema
HTTP/1.1" 404 - "-" "Java/1.8.0_172"
127.0.0.1 - - [06/Aug/2018:21:50:39 +0000] "GET /api/atlas/entities?type=hive_table_v1&property=qualifiedName&value=sales_fact_monthly_mvPN5nsJLL5J
HTTP/1.1" 200 - "-" "Java/1.8.0_172"
127.0.0.1 - - [06/Aug/2018:21:50:39 +0000] "GET /api/atlas/lineage/828f67f3-c13e-4cf1-80d7-a218a3f4010a/inputs/graph
HTTP/1.1" 200 - "-" "Java/1.8.0_172"
127.0.0.1 - - [06/Aug/2018:21:50:40 +0000] "GET /api/atlas/v2/types/typedef/name/tableType
HTTP/1.1" 200 - "-" "Java/1.8.0_172"
127.0.0.1 - - [06/Aug/2018:21:50:40 +0000] "GET /api/atlas/v2/types/typedef/name/serdeType
HTTP/1.1" 200 - "-" "Java/1.8.0_172"
127.0.0.1 - - [06/Aug/2018:21:50:40 +0000] "GET /api/atlas/v2/types/typedef/name/classification
HTTP/1.1" 200 - "-" "Java/1.8.0_172"
127.0.0.1 - - [06/Aug/2018:21:50:40 +0000] "GET /api/atlas/v2/types/typedef/name/pii_Tag HTTP/1.1"
200 - "-" "Java/1.8.0_172"
127.0.0.1 - - [06/Aug/2018:21:50:40 +0000] "GET /api/atlas/v2/types/typedef/name/phi_Tag HTTP/1.1"
200 - "-" "Java/1.8.0_172"
127.0.0.1 - - [06/Aug/2018:21:50:40 +0000] "GET /api/atlas/v2/types/typedef/name/pci_Tag HTTP/1.1"
200 - "-" "Java/1.8.0_172"
127.0.0.1 - - [06/Aug/2018:21:50:40 +0000] "GET /api/atlas/v2/types/typedef/name/sox_Tag HTTP/1.1"
200 - "-" "Java/1.8.0_172"
127.0.0.1 - - [06/Aug/2018:21:50:40 +0000] "GET /api/atlas/v2/types/typedef/name/sec_Tag HTTP/1.1"
200 - "-" "Java/1.8.0_172"
127.0.0.1 - - [06/Aug/2018:21:50:40 +0000] "GET /api/atlas/v2/types/typedef/name/finance_Tag
HTTP/1.1" 200 - "-" "Java/1.8.0_172"
127.0.0.1 - - [06/Aug/2018:21:50:40 +0000] "GET /api/atlas/v2/types/typedef/name/FactWxHfbiQCcM
HTTP/1.1" 404 - "-" "Java/1.8.0_172"
127.0.0.1 - - [06/Aug/2018:21:50:40 +0000] "GET /api/atlas/v2/types/typedef/name/ETLLGy6eawMPG
HTTP/1.1" 404 - "-" "Java/1.8.0_172"
127.0.0.1 - - [06/Aug/2018:21:50:40 +0000] "GET /api/atlas/v2/types/typedef/name/Dimensionr7Mc6WdrAr
HTTP/1.1" 404 - "-" "Java/1.8.0_172"
127.0.0.1 - - [06/Aug/2018:21:50:40 +0000] "GET /api/atlas/v2/types/typedef/name/MetricgQWBBTgQjE
HTTP/1.1" 404 - "-" "Java/1.8.0_172"
127.0.0.1 - - [06/Aug/2018:21:50:40 +0000] "GET /api/atlas/v2/types/typedef/name/hive_db_v1
HTTP/1.1" 200 - "-" "Java/1.8.0_172"
127.0.0.1 - - [06/Aug/2018:21:50:40 +0000] "GET /api/atlas/v2/types/typedef/name/hive_column_v1
HTTP/1.1" 200 - "-" "Java/1.8.0_172"
127.0.0.1 - - [06/Aug/2018:21:50:40 +0000] "GET /api/atlas/v2/types/typedef/name/hive_table_v1
HTTP/1.1" 200 - "-" "Java/1.8.0_172"
127.0.0.1 - - [06/Aug/2018:21:50:40 +0000] "GET /api/atlas/v2/types/typedef/name/hive_process_v1
HTTP/1.1" 200 - "-" "Java/1.8.0_172"
127.0.0.1 - - [06/Aug/2018:21:50:40 +0000] "POST /api/atlas/types HTTP/1.1" 201 - "-" "Java/1.8.0_172"
127.0.0.1 - - [06/Aug/2018:21:50:41 +0000] "GET /api/atlas/v2/types/typedef/name/Classification
HTTP/1.1" 200 - "-" "Java/1.8.0_172"
127.0.0.1 - - [06/Aug/2018:21:50:41 +0000] "GET /api/atlas/v2/types/typedef/name/dsl_test_type
HTTP/1.1" 200 - "-" "Java/1.8.0_172"
127.0.0.1 - - [06/Aug/2018:21:50:41 +0000] "POST /api/atlas/types HTTP/1.1" 201 - "-" "Java/1.8.0_172"
127.0.0.1 - - [06/Aug/2018:21:50:41 +0000] "POST /api/atlas/entities HTTP/1.1" 201 - "-" "Java/1.8.0_172"
127.0.0.1 - - [06/Aug/2018:21:50:41 +0000] "GET /api/atlas/discovery/search/dsl?query=from+hive_db_v1+name%3D%22dblOKVpS9gM6%22
HTTP/1.1" 200 - "-" "Java/1.8.0_172"
127.0.0.1 - - [06/Aug/2018:21:50:42 +0000] "GET /api/atlas/discovery/search/dsl?query=from+blah
HTTP/1.1" 400 - "-" "Java/1.8.0_172"
127.0.0.1 - - [06/Aug/2018:21:50:42 +0000] "GET /api/atlas/discovery/search/dsl?query=from+hive_db_v1+name%3D%22dblOKVpS9gM6%22
HTTP/1.1" 200 - "-" "Java/1.8.0_172"
127.0.0.1 - - [06/Aug/2018:21:50:42 +0000] "GET /api/atlas/discovery/search/dsl?query=from+hive_db_v1+name%3D%22dblOKVpS9gM6%22&limit=10&offset=0
HTTP/1.1" 200 - "-" "Java/1.8.0_172"
127.0.0.1 - - [06/Aug/2018:21:50:43 +0000] "GET /api/atlas/discovery/search/dsl?query=from+hive_db_v1+name%3D%22dblOKVpS9gM6%22&limit=-1&offset=-1
HTTP/1.1" 200 - "-" "Java/1.8.0_172"
127.0.0.1 - - [06/Aug/2018:21:50:44 +0000] "GET /api/atlas/discovery/search/dsl?query=from+hive_db_v1+name%3D%22dblOKVpS9gM6%22&limit=1&offset=0
HTTP/1.1" 200 - "-" "Java/1.8.0_172"
127.0.0.1 - - [06/Aug/2018:21:50:44 +0000] "GET /api/atlas/discovery/search/dsl?query=from+hive_db_v1+name%3D%22dblOKVpS9gM6%22&limit=10&offset=1
HTTP/1.1" 200 - "-" "Java/1.8.0_172"
127.0.0.1 - - [06/Aug/2018:21:50:45 +0000] "GET /api/atlas/discovery/search/dsl?query=from+hive_db_v1+name%3D%22dblOKVpS9gM6%22&limit=0&offset=10
HTTP/1.1" 400 - "-" "Java/1.8.0_172"
127.0.0.1 - - [06/Aug/2018:21:50:45 +0000] "GET /api/atlas/discovery/search/dsl?query=from+hive_db_v1+name%3D%22dblOKVpS9gM6%22&limit=2147483647&offset=10
HTTP/1.1" 400 - "-" "Java/1.8.0_172"
127.0.0.1 - - [06/Aug/2018:21:50:45 +0000] "GET /api/atlas/discovery/search/dsl?query=from+hive_db_v1+name%3D%22dblOKVpS9gM6%22&limit=10&offset=-2
HTTP/1.1" 400 - "-" "Java/1.8.0_172"
127.0.0.1 - - [06/Aug/2018:21:50:45 +0000] "GET /api/atlas/discovery/search?query=* HTTP/1.1"
200 - "-" "Java/1.8.0_172"
127.0.0.1 - - [06/Aug/2018:21:50:45 +0000] "GET /api/atlas/discovery/search?query=from+hive_db_v1+name%3D%22dblOKVpS9gM6%22
HTTP/1.1" 200 - "-" "Java/1.8.0_172"
127.0.0.1 - - [06/Aug/2018:21:50:46 +0000] "GET /api/atlas/discovery/search/gremlin?query=g.V.has('type',+'hive_table_v1').toList()
HTTP/1.1" 200 - "-" "Java/1.8.0_172"
127.0.0.1 - - [06/Aug/2018:21:50:47 +0000] "GET /api/atlas/discovery/search/fulltext?query=dblOKVpS9gM6&limit=10&offset=0
HTTP/1.1" 200 - "-" "Java/1.8.0_172"
127.0.0.1 - - [06/Aug/2018:21:50:47 +0000] "GET /api/atlas/discovery/search/fulltext?query=dblOKVpS9gM6
HTTP/1.1" 200 - "-" "Java/1.8.0_172"
127.0.0.1 - - [06/Aug/2018:21:50:47 +0000] "GET /api/atlas/discovery/search/fulltext?query=dblOKVpS9gM6&limit=10&offset=0
HTTP/1.1" 200 - "-" "Java/1.8.0_172"
127.0.0.1 - - [06/Aug/2018:21:50:47 +0000] "GET /api/atlas/discovery/search/fulltext?query=dblOKVpS9gM6&limit=10&offset=1
HTTP/1.1" 200 - "-" "Java/1.8.0_172"
127.0.0.1 - - [06/Aug/2018:21:50:47 +0000] "GET /api/atlas/discovery/search/fulltext?query=dblOKVpS9gM6&limit=1&offset=0
HTTP/1.1" 200 - "-" "Java/1.8.0_172"
127.0.0.1 - - [06/Aug/2018:21:50:47 +0000] "GET /api/atlas/discovery/search/fulltext?query=dblOKVpS9gM6&limit=1&offset=2
HTTP/1.1" 200 - "-" "Java/1.8.0_172"
Tests run: 134, Failures: 5, Errors: 0, Skipped: 1, Time elapsed: 208.922 sec <<<
FAILURE! - in TestSuite
testCreate(org.apache.atlas.web.integration.TypedefsJerseyResourceIT)  Time elapsed: 0.15
sec  <<< FAILURE!
org.apache.atlas.AtlasServiceException: Metadata service API org.apache.atlas.AtlasBaseClient$API@7924cd02
failed with status 404 (Not Found) Response Body ({"errorCode":"ATLAS-404-00-001","errorMessage":"Given
typename fetl was invalid"})
	at org.apache.atlas.AtlasBaseClient.callAPIWithResource(AtlasBaseClient.java:411)
	at org.apache.atlas.AtlasBaseClient.callAPIWithResource(AtlasBaseClient.java:340)
	at org.apache.atlas.AtlasBaseClient.callAPI(AtlasBaseClient.java:252)
	at org.apache.atlas.AtlasClientV2.getTypeDefByName(AtlasClientV2.java:409)
	at org.apache.atlas.AtlasClientV2.getClassificationDefByName(AtlasClientV2.java:158)
	at org.apache.atlas.web.integration.TypedefsJerseyResourceIT.testCreate(TypedefsJerseyResourceIT.java:95)

testCompleteUpdate(org.apache.atlas.web.integration.EntityJerseyResourceIT)  Time elapsed:
0.469 sec  <<< FAILURE!
java.lang.AssertionError: expected [true] but found [false]
	at org.testng.Assert.fail(Assert.java:94)
	at org.testng.Assert.failNotEquals(Assert.java:496)
	at org.testng.Assert.assertTrue(Assert.java:42)
	at org.testng.Assert.assertTrue(Assert.java:52)
	at org.apache.atlas.web.integration.EntityJerseyResourceIT.testCompleteUpdate(EntityJerseyResourceIT.java:989)

testPartialUpdateByGuid(org.apache.atlas.web.integration.EntityJerseyResourceIT)  Time elapsed:
0.408 sec  <<< FAILURE!
java.lang.AssertionError: expected [true] but found [false]
	at org.testng.Assert.fail(Assert.java:94)
	at org.testng.Assert.failNotEquals(Assert.java:496)
	at org.testng.Assert.assertTrue(Assert.java:42)
	at org.testng.Assert.assertTrue(Assert.java:52)
	at org.apache.atlas.web.integration.EntityJerseyResourceIT.testPartialUpdateByGuid(EntityJerseyResourceIT.java:880)

testPartialUpdateByUniqueAttributes(org.apache.atlas.web.integration.EntityJerseyResourceIT)
 Time elapsed: 0.446 sec  <<< FAILURE!
java.lang.AssertionError: expected [true] but found [false]
	at org.testng.Assert.fail(Assert.java:94)
	at org.testng.Assert.failNotEquals(Assert.java:496)
	at org.testng.Assert.assertTrue(Assert.java:42)
	at org.testng.Assert.assertTrue(Assert.java:52)
	at org.apache.atlas.web.integration.EntityJerseyResourceIT.testPartialUpdateByUniqueAttributes(EntityJerseyResourceIT.java:932)

testDiscoveryWithSearchParameters(org.apache.atlas.web.integration.BasicSearchIT)  Time elapsed:
0.517 sec  <<< FAILURE!
java.lang.AssertionError: expected [3] but found [24]
	at org.testng.Assert.fail(Assert.java:94)
	at org.testng.Assert.failNotEquals(Assert.java:496)
	at org.testng.Assert.assertEquals(Assert.java:125)
	at org.testng.Assert.assertEquals(Assert.java:372)
	at org.testng.Assert.assertEquals(Assert.java:382)
	at org.apache.atlas.web.integration.BasicSearchIT.testDiscoveryWithSearchParameters(BasicSearchIT.java:127)


Results :

Failed tests: 
org.apache.atlas.web.integration.BasicSearchIT.testDiscoveryWithSearchParameters(org.apache.atlas.web.integration.BasicSearchIT)
  Run 1: BasicSearchIT.testDiscoveryWithSearchParameters:127 expected [3] but found [24]
  Run 2: PASS
  Run 3: PASS

  EntityJerseyResourceIT.testCompleteUpdate:989 expected [true] but found [false]
  EntityJerseyResourceIT.testPartialUpdateByGuid:880 expected [true] but found [false]
  EntityJerseyResourceIT.testPartialUpdateByUniqueAttributes:932 expected [true] but found
[false]
  TypedefsJerseyResourceIT.testCreate:95 » AtlasService Metadata service API org...

Tests run: 132, Failures: 5, Errors: 0, Skipped: 1

[INFO] 
[INFO] --- jetty-maven-plugin:9.2.12.v20150709:stop (stop-jetty) @ atlas-webapp ---
[INFO] Waiting 10 seconds for jetty to stop
[INFO] Stopped ServerConnector@1ca1a0a7{HTTP/1.1}{0.0.0.0:31000}
[INFO] Closing Spring root WebApplicationContext
[INFO] Shutting down log4j
[INFO] Not cleaning cached beans: no such field javax.el.BeanELResolver.properties
[INFO] Stopped o.e.j.m.p.JettyWebAppContext@171f3438{/,<https://builds.apache.org/job/Atlas-0.8-IntegrationTests/ws/webapp/target/atlas-webapp-0.8.3-SNAPSHOT/,UNAVAILABLE}{/home/jenkins/jenkins-slave/workspace/Atlas-0.8-IntegrationTests/webapp/target/atlas-webapp-0.8.3-SNAPSHOT.war}>
[INFO] Server reports itself as stopped
[INFO] 
[INFO] --- maven-source-plugin:2.4:jar-no-fork (attach-sources) @ atlas-webapp ---
[INFO] Building jar: <https://builds.apache.org/job/Atlas-0.8-IntegrationTests/ws/webapp/target/atlas-webapp-0.8.3-SNAPSHOT-sources.jar>
[INFO] 
[INFO] --- maven-source-plugin:2.4:test-jar-no-fork (attach-sources) @ atlas-webapp ---
[INFO] Building jar: <https://builds.apache.org/job/Atlas-0.8-IntegrationTests/ws/webapp/target/atlas-webapp-0.8.3-SNAPSHOT-test-sources.jar>
[INFO] 
[INFO] --- maven-failsafe-plugin:2.18.1:verify (verify) @ atlas-webapp ---
[INFO] Failsafe report directory: <https://builds.apache.org/job/Atlas-0.8-IntegrationTests/ws/webapp/target/failsafe-reports>
[INFO] ------------------------------------------------------------------------
[INFO] Reactor Summary:
[INFO] 
[INFO] Apache Atlas Server Build Tools 1.0 ................ SUCCESS [  0.605 s]
[INFO] apache-atlas 0.8.3-SNAPSHOT ........................ SUCCESS [  3.574 s]
[INFO] Apache Atlas Integration ........................... SUCCESS [ 19.349 s]
[INFO] Apache Atlas Common ................................ SUCCESS [  7.723 s]
[INFO] Apache Atlas Typesystem ............................ SUCCESS [ 43.774 s]
[INFO] Apache Atlas Client ................................ SUCCESS [  0.645 s]
[INFO] atlas-client-common ................................ SUCCESS [  6.545 s]
[INFO] atlas-client-v1 .................................... SUCCESS [  7.113 s]
[INFO] Apache Atlas Server API ............................ SUCCESS [  6.127 s]
[INFO] Apache Atlas Notification .......................... SUCCESS [  9.942 s]
[INFO] atlas-client-v2 .................................... SUCCESS [  5.977 s]
[INFO] Apache Atlas Graph Database Projects ............... SUCCESS [  0.619 s]
[INFO] Apache Atlas Graph Database API .................... SUCCESS [  5.262 s]
[INFO] Graph Database Common Code ......................... SUCCESS [  5.162 s]
[INFO] Apache Atlas Titan 1.0.0 GraphDB Impl .............. SUCCESS [ 36.164 s]
[INFO] Shaded version of Apache hbase client .............. SUCCESS [  8.483 s]
[INFO] Apache Atlas Titan 0.5.4 Graph DB Impl ............. SUCCESS [ 34.975 s]
[INFO] Apache Atlas Graph Database Implementation Dependencies SUCCESS [  0.647 s]
[INFO] Shaded version of Apache hbase server .............. SUCCESS [ 21.942 s]
[INFO] Apache Atlas Repository ............................ SUCCESS [01:16 min]
[INFO] Apache Atlas Authorization ......................... SUCCESS [  6.815 s]
[INFO] Apache Atlas Business Catalog ...................... SUCCESS [ 10.561 s]
[INFO] Apache Atlas UI .................................... SUCCESS [01:14 min]
[INFO] Apache Atlas Web Application ....................... FAILURE [05:00 min]
[INFO] Apache Atlas Documentation ......................... SKIPPED
[INFO] Apache Atlas FileSystem Model ...................... SKIPPED
[INFO] Apache Atlas Plugin Classloader .................... SKIPPED
[INFO] Apache Atlas Hive Bridge Shim ...................... SKIPPED
[INFO] Apache Atlas Hive Bridge ........................... SKIPPED
[INFO] Apache Atlas Falcon Bridge Shim .................... SKIPPED
[INFO] Apache Atlas Falcon Bridge ......................... SKIPPED
[INFO] Apache Atlas Sqoop Bridge Shim ..................... SKIPPED
[INFO] Apache Atlas Sqoop Bridge .......................... SKIPPED
[INFO] Apache Atlas Storm Bridge Shim ..................... SKIPPED
[INFO] Apache Atlas Storm Bridge .......................... SKIPPED
[INFO] Apache Atlas Hbase Bridge Shim ..................... SKIPPED
[INFO] Apache Atlas Hbase Bridge .......................... SKIPPED
[INFO] Apache Atlas Migration Exporter .................... SKIPPED
[INFO] Apache Atlas Distribution 0.8.3-SNAPSHOT ........... SKIPPED
[INFO] ------------------------------------------------------------------------
[INFO] BUILD FAILURE
[INFO] ------------------------------------------------------------------------
[INFO] Total time: 11:35 min
[INFO] Finished at: 2018-08-06T21:50:52Z
[INFO] ------------------------------------------------------------------------
[ERROR] Failed to execute goal org.apache.maven.plugins:maven-failsafe-plugin:2.18.1:verify
(verify) on project atlas-webapp: There are test failures.
[ERROR] 
[ERROR] Please refer to <https://builds.apache.org/job/Atlas-0.8-IntegrationTests/ws/webapp/target/failsafe-reports>
for the individual test results.
[ERROR] -> [Help 1]
[ERROR] 
[ERROR] To see the full stack trace of the errors, re-run Maven with the -e switch.
[ERROR] Re-run Maven using the -X switch to enable full debug logging.
[ERROR] 
[ERROR] For more information about the errors and possible solutions, please read the following
articles:
[ERROR] [Help 1] http://cwiki.apache.org/confluence/display/MAVEN/MojoFailureException
[ERROR] 
[ERROR] After correcting the problems, you can resume the build with the command
[ERROR]   mvn <goals> -rf :atlas-webapp
Build step 'Execute shell' marked build as failure
[CHECKSTYLE] Collecting checkstyle analysis files...
[CHECKSTYLE] Searching for all files in <https://builds.apache.org/job/Atlas-0.8-IntegrationTests/ws/>
that match the pattern **/target/checkstyle-result.xml
[CHECKSTYLE] Parsing 22 files in <https://builds.apache.org/job/Atlas-0.8-IntegrationTests/ws/>
[CHECKSTYLE] Successfully parsed file <https://builds.apache.org/job/Atlas-0.8-IntegrationTests/ws/authorization/target/checkstyle-result.xml>
with 471 unique warnings and 0 duplicates.
[CHECKSTYLE] Successfully parsed file <https://builds.apache.org/job/Atlas-0.8-IntegrationTests/ws/catalog/target/checkstyle-result.xml>
with 2608 unique warnings and 0 duplicates.
[CHECKSTYLE] Successfully parsed file <https://builds.apache.org/job/Atlas-0.8-IntegrationTests/ws/client/client-v1/target/checkstyle-result.xml>
with 3484 unique warnings and 0 duplicates.
[CHECKSTYLE] Successfully parsed file <https://builds.apache.org/job/Atlas-0.8-IntegrationTests/ws/client/client-v2/target/checkstyle-result.xml>
with 3814 unique warnings and 0 duplicates.
[CHECKSTYLE] Successfully parsed file <https://builds.apache.org/job/Atlas-0.8-IntegrationTests/ws/client/common/target/checkstyle-result.xml>
with 4337 unique warnings and 0 duplicates.
[CHECKSTYLE] Successfully parsed file <https://builds.apache.org/job/Atlas-0.8-IntegrationTests/ws/client/target/checkstyle-result.xml>
with 4337 unique warnings and 0 duplicates.
[CHECKSTYLE] Successfully parsed file <https://builds.apache.org/job/Atlas-0.8-IntegrationTests/ws/common/target/checkstyle-result.xml>
with 5299 unique warnings and 0 duplicates.
[CHECKSTYLE] Successfully parsed file <https://builds.apache.org/job/Atlas-0.8-IntegrationTests/ws/dashboardv2/target/checkstyle-result.xml>
with 5299 unique warnings and 0 duplicates.
[CHECKSTYLE] Successfully parsed file <https://builds.apache.org/job/Atlas-0.8-IntegrationTests/ws/graphdb/api/target/checkstyle-result.xml>
with 5572 unique warnings and 0 duplicates.
[CHECKSTYLE] Successfully parsed file <https://builds.apache.org/job/Atlas-0.8-IntegrationTests/ws/graphdb/common/target/checkstyle-result.xml>
with 5759 unique warnings and 0 duplicates.
[CHECKSTYLE] Successfully parsed file <https://builds.apache.org/job/Atlas-0.8-IntegrationTests/ws/graphdb/graphdb-impls/target/checkstyle-result.xml>
with 5759 unique warnings and 0 duplicates.
[CHECKSTYLE] Successfully parsed file <https://builds.apache.org/job/Atlas-0.8-IntegrationTests/ws/graphdb/target/checkstyle-result.xml>
with 5759 unique warnings and 0 duplicates.
[CHECKSTYLE] Successfully parsed file <https://builds.apache.org/job/Atlas-0.8-IntegrationTests/ws/graphdb/titan0/target/checkstyle-result.xml>
with 8214 unique warnings and 0 duplicates.
[CHECKSTYLE] Successfully parsed file <https://builds.apache.org/job/Atlas-0.8-IntegrationTests/ws/graphdb/titan1/target/checkstyle-result.xml>
with 9181 unique warnings and 0 duplicates.
[CHECKSTYLE] Successfully parsed file <https://builds.apache.org/job/Atlas-0.8-IntegrationTests/ws/intg/target/checkstyle-result.xml>
with 16249 unique warnings and 0 duplicates.
[CHECKSTYLE] Successfully parsed file <https://builds.apache.org/job/Atlas-0.8-IntegrationTests/ws/notification/target/checkstyle-result.xml>
with 18006 unique warnings and 0 duplicates.
[CHECKSTYLE] Successfully parsed file <https://builds.apache.org/job/Atlas-0.8-IntegrationTests/ws/repository/target/checkstyle-result.xml>
with 37819 unique warnings and 0 duplicates.
[CHECKSTYLE] Successfully parsed file <https://builds.apache.org/job/Atlas-0.8-IntegrationTests/ws/server-api/target/checkstyle-result.xml>
with 38211 unique warnings and 0 duplicates.
[CHECKSTYLE] Successfully parsed file <https://builds.apache.org/job/Atlas-0.8-IntegrationTests/ws/shaded/hbase-client-shaded/target/checkstyle-result.xml>
with 38211 unique warnings and 0 duplicates.
[CHECKSTYLE] Successfully parsed file <https://builds.apache.org/job/Atlas-0.8-IntegrationTests/ws/shaded/hbase-server-shaded/target/checkstyle-result.xml>
with 38211 unique warnings and 0 duplicates.
[CHECKSTYLE] Successfully parsed file <https://builds.apache.org/job/Atlas-0.8-IntegrationTests/ws/target/checkstyle-result.xml>
with 38211 unique warnings and 0 duplicates.
[CHECKSTYLE] Successfully parsed file <https://builds.apache.org/job/Atlas-0.8-IntegrationTests/ws/typesystem/target/checkstyle-result.xml>
with 42452 unique warnings and 0 duplicates.
<Git Blamer> Using GitBlamer to create author and commit information for all warnings.
<Git Blamer> GIT_COMMIT=c3b01a6f1e0b8c640c865c82ed22e2e4d66ae190, workspace=<https://builds.apache.org/job/Atlas-0.8-IntegrationTests/ws/>
 > git rev-parse c3b01a6f1e0b8c640c865c82ed22e2e4d66ae190^{commit} # timeout=10
<Git Blamer> Skipping file <https://builds.apache.org/job/Atlas-0.8-IntegrationTests/ws/typesystem/src/main/java/org/apache/atlas/typesystem/IStruct.java,>
no result found.
[FINDBUGS] Collecting findbugs analysis files...
[FINDBUGS] Searching for all files in <https://builds.apache.org/job/Atlas-0.8-IntegrationTests/ws/>
that match the pattern **/target/findbugs.xml
[FINDBUGS] Parsing 15 files in <https://builds.apache.org/job/Atlas-0.8-IntegrationTests/ws/>
[FINDBUGS] Successfully parsed file <https://builds.apache.org/job/Atlas-0.8-IntegrationTests/ws/authorization/target/findbugs.xml>
with 0 unique warnings and 0 duplicates.
[FINDBUGS] Successfully parsed file <https://builds.apache.org/job/Atlas-0.8-IntegrationTests/ws/catalog/target/findbugs.xml>
with 0 unique warnings and 0 duplicates.
[FINDBUGS] Successfully parsed file <https://builds.apache.org/job/Atlas-0.8-IntegrationTests/ws/client/client-v1/target/findbugs.xml>
with 0 unique warnings and 0 duplicates.
[FINDBUGS] Successfully parsed file <https://builds.apache.org/job/Atlas-0.8-IntegrationTests/ws/client/client-v2/target/findbugs.xml>
with 0 unique warnings and 0 duplicates.
[FINDBUGS] Successfully parsed file <https://builds.apache.org/job/Atlas-0.8-IntegrationTests/ws/client/common/target/findbugs.xml>
with 0 unique warnings and 0 duplicates.
[FINDBUGS] Successfully parsed file <https://builds.apache.org/job/Atlas-0.8-IntegrationTests/ws/common/target/findbugs.xml>
with 0 unique warnings and 0 duplicates.
[FINDBUGS] Successfully parsed file <https://builds.apache.org/job/Atlas-0.8-IntegrationTests/ws/graphdb/api/target/findbugs.xml>
with 0 unique warnings and 0 duplicates.
[FINDBUGS] Successfully parsed file <https://builds.apache.org/job/Atlas-0.8-IntegrationTests/ws/graphdb/common/target/findbugs.xml>
with 0 unique warnings and 0 duplicates.
[FINDBUGS] Successfully parsed file <https://builds.apache.org/job/Atlas-0.8-IntegrationTests/ws/graphdb/titan0/target/findbugs.xml>
with 0 unique warnings and 0 duplicates.
[FINDBUGS] Successfully parsed file <https://builds.apache.org/job/Atlas-0.8-IntegrationTests/ws/graphdb/titan1/target/findbugs.xml>
with 0 unique warnings and 0 duplicates.
[FINDBUGS] Successfully parsed file <https://builds.apache.org/job/Atlas-0.8-IntegrationTests/ws/intg/target/findbugs.xml>
with 0 unique warnings and 0 duplicates.
[FINDBUGS] Successfully parsed file <https://builds.apache.org/job/Atlas-0.8-IntegrationTests/ws/notification/target/findbugs.xml>
with 0 unique warnings and 0 duplicates.
[FINDBUGS] Successfully parsed file <https://builds.apache.org/job/Atlas-0.8-IntegrationTests/ws/repository/target/findbugs.xml>
with 0 unique warnings and 0 duplicates.
[FINDBUGS] Successfully parsed file <https://builds.apache.org/job/Atlas-0.8-IntegrationTests/ws/server-api/target/findbugs.xml>
with 0 unique warnings and 0 duplicates.
[FINDBUGS] Successfully parsed file <https://builds.apache.org/job/Atlas-0.8-IntegrationTests/ws/typesystem/target/findbugs.xml>
with 0 unique warnings and 0 duplicates.
<Git Blamer> Using GitBlamer to create author and commit information for all warnings.
<Git Blamer> GIT_COMMIT=c3b01a6f1e0b8c640c865c82ed22e2e4d66ae190, workspace=<https://builds.apache.org/job/Atlas-0.8-IntegrationTests/ws/>
Archiving artifacts
[Fast Archiver] No prior successful build to compare, so performing full copy of artifacts
TestNG Reports Processing: START
Looking for TestNG results report in workspace using pattern: **/target/surefire-reports/testng-results.xml,**/target/failsafe-reports/testng-results.xml
Saving reports...
Processing '/x1/jenkins/jenkins-home/jobs/Atlas-0.8-IntegrationTests/builds/226/testng/testng-results.xml'
3.731343% of tests failed, which exceeded threshold of 0%. Marking build as UNSTABLE
TestNG Reports Processing: FINISH

Mime
View raw message