atlas-dev mailing list archives

Site index · List index
Message view « Date » · « Thread »
Top « Date » · « Thread »
From Apache Jenkins Server <jenk...@builds.apache.org>
Subject Build failed in Jenkins: Atlas-1.0-AllTests #887
Date Mon, 27 Aug 2018 12:59:02 GMT
See <https://builds.apache.org/job/Atlas-1.0-AllTests/887/display/redirect>

------------------------------------------
[...truncated 214.21 KB...]
Tests run: 0, Failures: 0, Errors: 0, Skipped: 0, Time elapsed: 3.447 sec - in org.apache.atlas.repository.store.graph.v2.InverseReferenceUpdateV2Test
Running org.apache.atlas.repository.tagpropagation.ClassificationPropagationTest
Running org.apache.atlas.repository.impexp.ExportServiceTest
Tests run: 0, Failures: 0, Errors: 0, Skipped: 0, Time elapsed: 3.691 sec - in org.apache.atlas.TestModules
Running org.apache.atlas.repository.impexp.ImportServiceTest
Tests run: 6, Failures: 0, Errors: 0, Skipped: 0, Time elapsed: 3.93 sec - in org.apache.atlas.repository.audit.InMemoryAuditRepositoryTest
Running org.apache.atlas.repository.migration.HiveStocksTest
Running org.apache.atlas.repository.migration.ComplexAttributesTest
Running org.apache.atlas.repository.migration.HiveParititionTest
Tests run: 8, Failures: 0, Errors: 0, Skipped: 0, Time elapsed: 3.185 sec - in org.apache.atlas.repository.impexp.ImportTransformerTest
Running org.apache.atlas.repository.migration.TypesWithCollectionsFinderTest
Running org.apache.atlas.repository.migration.TypesDefScrubberTest
Tests run: 9, Failures: 0, Errors: 0, Skipped: 0, Time elapsed: 7.02 sec - in org.apache.atlas.utils.ObjectUpdateSynchronizerTest
Running org.apache.atlas.repository.migration.TypesWithClassificationTest
Tests run: 9, Failures: 0, Errors: 0, Skipped: 0, Time elapsed: 7.328 sec - in org.apache.atlas.repository.store.graph.v2.AtlasEntityStoreV2BulkImportPercentTest
Tests run: 6, Failures: 0, Errors: 0, Skipped: 0, Time elapsed: 6.13 sec - in org.apache.atlas.repository.impexp.TypeAttributeDifferenceTest
Tests run: 1, Failures: 0, Errors: 0, Skipped: 0, Time elapsed: 7.527 sec - in org.apache.atlas.repository.impexp.ImportTransformerJSONTest
Tests run: 6, Failures: 0, Errors: 0, Skipped: 0, Time elapsed: 5.984 sec - in org.apache.atlas.repository.impexp.AtlasImportRequestTest
Tests run: 3, Failures: 0, Errors: 0, Skipped: 0, Time elapsed: 6.919 sec - in org.apache.atlas.repository.impexp.ImportTransformsTest
Running org.apache.atlas.glossary.GlossaryServiceTest
Running org.apache.atlas.query.DSLQueriesTest
Running org.apache.atlas.query.GremlinQueryComposerTest
Running org.apache.atlas.glossary.PaginationHelperTest
Tests run: 8, Failures: 0, Errors: 0, Skipped: 0, Time elapsed: 9.726 sec - in org.apache.atlas.repository.impexp.ZipSinkTest
Tests run: 6, Failures: 0, Errors: 0, Skipped: 0, Time elapsed: 8.533 sec - in org.apache.atlas.repository.impexp.ZipSourceTest
Running org.apache.atlas.query.DSLParsingTest
Running org.apache.atlas.services.MetricsServiceTest
Tests run: 4, Failures: 0, Errors: 0, Skipped: 0, Time elapsed: 9.837 sec - in org.apache.atlas.repository.migration.MigrationProgressServiceTest
Tests run: 1, Failures: 0, Errors: 0, Skipped: 0, Time elapsed: 5.682 sec - in org.apache.atlas.repository.migration.TypesDefScrubberTest
Tests run: 20, Failures: 0, Errors: 0, Skipped: 0, Time elapsed: 2.97 sec - in org.apache.atlas.glossary.PaginationHelperTest
Tests run: 8, Failures: 0, Errors: 0, Skipped: 0, Time elapsed: 4.308 sec - in org.apache.atlas.query.DSLParsingTest
Tests run: 39, Failures: 0, Errors: 0, Skipped: 0, Time elapsed: 22.987 sec - in org.apache.atlas.query.GremlinQueryComposerTest
Tests run: 6, Failures: 0, Errors: 0, Skipped: 0, Time elapsed: 37.374 sec - in org.apache.atlas.repository.audit.CassandraAuditRepositoryTest
Tests run: 1, Failures: 0, Errors: 0, Skipped: 0, Time elapsed: 41.28 sec - in org.apache.atlas.services.MetricsServiceTest
Tests run: 10, Failures: 0, Errors: 0, Skipped: 0, Time elapsed: 68.207 sec - in org.apache.atlas.repository.store.graph.v2.AtlasRelationshipDefStoreV2Test
Tests run: 1, Failures: 0, Errors: 0, Skipped: 0, Time elapsed: 70.79 sec - in org.apache.atlas.repository.store.graph.v2.AtlasEntityDefStoreV2Test
Tests run: 1, Failures: 0, Errors: 0, Skipped: 0, Time elapsed: 83.199 sec - in org.apache.atlas.repository.migration.RelationshipCacheGeneratorTest
Tests run: 4, Failures: 0, Errors: 0, Skipped: 0, Time elapsed: 91.856 sec - in org.apache.atlas.repository.store.graph.v2.AtlasRelationshipStoreHardDeleteV2Test
Tests run: 5, Failures: 0, Errors: 0, Skipped: 0, Time elapsed: 94.912 sec - in org.apache.atlas.repository.store.graph.v2.InverseReferenceUpdateSoftDeleteV2Test
Tests run: 4, Failures: 0, Errors: 0, Skipped: 0, Time elapsed: 100.884 sec - in org.apache.atlas.repository.store.graph.v2.AtlasRelationshipStoreSoftDeleteV2Test
Tests run: 1, Failures: 0, Errors: 0, Skipped: 0, Time elapsed: 95.412 sec - in org.apache.atlas.repository.migration.TypesWithCollectionsFinderTest
Tests run: 5, Failures: 4, Errors: 0, Skipped: 0, Time elapsed: 91.445 sec <<< FAILURE!
- in org.apache.atlas.repository.store.graph.v2.InverseReferenceUpdateHardDeleteV2Test
testInverseReferenceAutoUpdate_Map(org.apache.atlas.repository.store.graph.v2.InverseReferenceUpdateHardDeleteV2Test)
 Time elapsed: 3.909 sec  <<< FAILURE!
java.lang.AssertionError: expected [null] but found [AtlasObjectId{guid='ce48a725-4ce4-40d1-9860-0549bdbbc372',
typeName='A', uniqueAttributes={}}]
	at org.testng.Assert.fail(Assert.java:94)
	at org.testng.Assert.failNotSame(Assert.java:492)
	at org.testng.Assert.assertNull(Assert.java:428)
	at org.testng.Assert.assertNull(Assert.java:417)
	at org.apache.atlas.repository.store.graph.v2.InverseReferenceUpdateV2Test.verifyReferenceValue(InverseReferenceUpdateV2Test.java:362)
	at org.apache.atlas.repository.store.graph.v2.InverseReferenceUpdateHardDeleteV2Test.verify_testInverseReferenceAutoUpdate_Map(InverseReferenceUpdateHardDeleteV2Test.java:72)

testInverseReferenceAutoUpdate_NonCompositeManyToOne(org.apache.atlas.repository.store.graph.v2.InverseReferenceUpdateHardDeleteV2Test)
 Time elapsed: 1.728 sec  <<< FAILURE!
java.lang.AssertionError: expected [null] but found [AtlasObjectId{guid='9ffb2d7d-fd96-49e9-9a65-dc94fb9ac832',
typeName='B', uniqueAttributes={}}]
	at org.testng.Assert.fail(Assert.java:94)
	at org.testng.Assert.failNotSame(Assert.java:492)
	at org.testng.Assert.assertNull(Assert.java:428)
	at org.testng.Assert.assertNull(Assert.java:417)
	at org.apache.atlas.repository.store.graph.v2.InverseReferenceUpdateV2Test.verifyReferenceValue(InverseReferenceUpdateV2Test.java:362)
	at org.apache.atlas.repository.store.graph.v2.InverseReferenceUpdateHardDeleteV2Test.verify_testInverseReferenceAutoUpdate_NonCompositeManyToOne(InverseReferenceUpdateHardDeleteV2Test.java:49)

testInverseReferenceAutoUpdate_NonComposite_OneToMany(org.apache.atlas.repository.store.graph.v2.InverseReferenceUpdateHardDeleteV2Test)
 Time elapsed: 0.824 sec  <<< FAILURE!
java.lang.AssertionError: expected [1] but found [2]
	at org.testng.Assert.fail(Assert.java:94)
	at org.testng.Assert.failNotEquals(Assert.java:496)
	at org.testng.Assert.assertEquals(Assert.java:125)
	at org.testng.Assert.assertEquals(Assert.java:372)
	at org.testng.Assert.assertEquals(Assert.java:382)
	at org.apache.atlas.repository.store.graph.v2.InverseReferenceUpdateV2Test.verifyReferenceList(InverseReferenceUpdateV2Test.java:375)
	at org.apache.atlas.repository.store.graph.v2.InverseReferenceUpdateHardDeleteV2Test.verify_testInverseReferenceAutoUpdate_NonComposite_OneToMany(InverseReferenceUpdateHardDeleteV2Test.java:43)

testInverseReferenceAutoUpdate_NonComposite_OneToOne(org.apache.atlas.repository.store.graph.v2.InverseReferenceUpdateHardDeleteV2Test)
 Time elapsed: 1.334 sec  <<< FAILURE!
java.lang.AssertionError: expected [null] but found [AtlasObjectId{guid='621c62ec-2137-4555-8e7c-4bd4d4a992bd',
typeName='B', uniqueAttributes={}}]
	at org.testng.Assert.fail(Assert.java:94)
	at org.testng.Assert.failNotSame(Assert.java:492)
	at org.testng.Assert.assertNull(Assert.java:428)
	at org.testng.Assert.assertNull(Assert.java:417)
	at org.apache.atlas.repository.store.graph.v2.InverseReferenceUpdateV2Test.verifyReferenceValue(InverseReferenceUpdateV2Test.java:362)
	at org.apache.atlas.repository.store.graph.v2.InverseReferenceUpdateHardDeleteV2Test.verify_testInverseReferenceAutoUpdate_NonComposite_OneToOne(InverseReferenceUpdateHardDeleteV2Test.java:59)

Tests run: 7, Failures: 0, Errors: 0, Skipped: 0, Time elapsed: 106.668 sec - in org.apache.atlas.repository.store.graph.v2.AtlasComplexAttributesTest
Tests run: 12, Failures: 0, Errors: 0, Skipped: 0, Time elapsed: 112.306 sec - in org.apache.atlas.repository.userprofile.UserProfileServiceTest
Tests run: 12, Failures: 0, Errors: 0, Skipped: 0, Time elapsed: 114.287 sec - in org.apache.atlas.repository.impexp.ExportServiceTest
Tests run: 18, Failures: 0, Errors: 0, Skipped: 0, Time elapsed: 119.052 sec - in org.apache.atlas.repository.store.graph.AtlasTypeDefGraphStoreTest
Tests run: 1, Failures: 0, Errors: 0, Skipped: 0, Time elapsed: 117.378 sec - in org.apache.atlas.repository.migration.HiveStocksTest
Tests run: 1, Failures: 0, Errors: 0, Skipped: 0, Time elapsed: 117.834 sec - in org.apache.atlas.repository.migration.HiveParititionTest
Tests run: 1, Failures: 0, Errors: 0, Skipped: 0, Time elapsed: 116.797 sec - in org.apache.atlas.repository.migration.TypesWithClassificationTest
Tests run: 16, Failures: 1, Errors: 0, Skipped: 0, Time elapsed: 125.167 sec <<<
FAILURE! - in org.apache.atlas.repository.store.graph.v2.AtlasEntityStoreV2Test
testMapOfPrimitivesUpdate(org.apache.atlas.repository.store.graph.v2.AtlasEntityStoreV2Test)
 Time elapsed: 0.061 sec  <<< FAILURE!
java.lang.AssertionError: expected [1] but found [2]
	at org.testng.Assert.fail(Assert.java:94)
	at org.testng.Assert.failNotEquals(Assert.java:496)
	at org.testng.Assert.assertEquals(Assert.java:125)
	at org.testng.Assert.assertEquals(Assert.java:372)
	at org.testng.Assert.assertEquals(Assert.java:382)
	at org.apache.atlas.repository.store.graph.v2.AtlasEntityTestBase.validateMutationResponse(AtlasEntityTestBase.java:144)
	at org.apache.atlas.repository.store.graph.v2.AtlasEntityStoreV2Test.testMapOfPrimitivesUpdate(AtlasEntityStoreV2Test.java:404)

Tests run: 1, Failures: 0, Errors: 0, Skipped: 0, Time elapsed: 122.673 sec - in org.apache.atlas.repository.migration.PathTest
Tests run: 1, Failures: 0, Errors: 0, Skipped: 0, Time elapsed: 122.069 sec - in org.apache.atlas.repository.migration.ComplexAttributesTest
Tests run: 35, Failures: 0, Errors: 0, Skipped: 0, Time elapsed: 119.762 sec - in org.apache.atlas.glossary.GlossaryServiceTest
Tests run: 14, Failures: 0, Errors: 0, Skipped: 0, Time elapsed: 144.544 sec - in org.apache.atlas.repository.impexp.ImportServiceTest
Tests run: 11, Failures: 0, Errors: 0, Skipped: 0, Time elapsed: 164.24 sec - in org.apache.atlas.repository.tagpropagation.ClassificationPropagationTest
Tests run: 246, Failures: 0, Errors: 0, Skipped: 0, Time elapsed: 409.341 sec - in org.apache.atlas.query.DSLQueriesTest

Results :

Failed tests: 
  AtlasEntityStoreV2Test.testMapOfPrimitivesUpdate:404->AtlasEntityTestBase.validateMutationResponse:144
expected [1] but found [2]
  InverseReferenceUpdateHardDeleteV2Test>InverseReferenceUpdateV2Test.testInverseReferenceAutoUpdate_Map:354->verify_testInverseReferenceAutoUpdate_Map:72->InverseReferenceUpdateV2Test.verifyReferenceValue:362
expected [null] but found [AtlasObjectId{guid='ce48a725-4ce4-40d1-9860-0549bdbbc372', typeName='A',
uniqueAttributes={}}]
  InverseReferenceUpdateHardDeleteV2Test>InverseReferenceUpdateV2Test.testInverseReferenceAutoUpdate_NonCompositeManyToOne:201->verify_testInverseReferenceAutoUpdate_NonCompositeManyToOne:49->InverseReferenceUpdateV2Test.verifyReferenceValue:362
expected [null] but found [AtlasObjectId{guid='9ffb2d7d-fd96-49e9-9a65-dc94fb9ac832', typeName='B',
uniqueAttributes={}}]
  InverseReferenceUpdateHardDeleteV2Test>InverseReferenceUpdateV2Test.testInverseReferenceAutoUpdate_NonComposite_OneToMany:141->verify_testInverseReferenceAutoUpdate_NonComposite_OneToMany:43->InverseReferenceUpdateV2Test.verifyReferenceList:375
expected [1] but found [2]
  InverseReferenceUpdateHardDeleteV2Test>InverseReferenceUpdateV2Test.testInverseReferenceAutoUpdate_NonComposite_OneToOne:255->verify_testInverseReferenceAutoUpdate_NonComposite_OneToOne:59->InverseReferenceUpdateV2Test.verifyReferenceValue:362
expected [null] but found [AtlasObjectId{guid='621c62ec-2137-4555-8e7c-4bd4d4a992bd', typeName='B',
uniqueAttributes={}}]

Tests run: 552, Failures: 5, Errors: 0, Skipped: 0

[INFO] ------------------------------------------------------------------------
[INFO] Reactor Summary:
[INFO] 
[INFO] Apache Atlas Server Build Tools 1.0 ................ SUCCESS [  0.715 s]
[INFO] apache-atlas 1.1.0-SNAPSHOT ........................ SUCCESS [  4.566 s]
[INFO] Apache Atlas Test Utility Tools .................... SUCCESS [ 11.593 s]
[INFO] Apache Atlas Integration ........................... SUCCESS [01:03 min]
[INFO] Apache Atlas Common ................................ SUCCESS [  9.784 s]
[INFO] Apache Atlas Client ................................ SUCCESS [  0.725 s]
[INFO] atlas-client-common ................................ SUCCESS [  7.164 s]
[INFO] atlas-client-v1 .................................... SUCCESS [  9.438 s]
[INFO] Apache Atlas Server API ............................ SUCCESS [  6.116 s]
[INFO] Apache Atlas Notification .......................... SUCCESS [ 23.568 s]
[INFO] atlas-client-v2 .................................... SUCCESS [  6.362 s]
[INFO] Apache Atlas Graph Database Projects ............... SUCCESS [  0.555 s]
[INFO] Apache Atlas Graph Database API .................... SUCCESS [  4.999 s]
[INFO] Graph Database Common Code ......................... SUCCESS [  5.211 s]
[INFO] Apache Atlas JanusGraph DB Impl .................... SUCCESS [02:42 min]
[INFO] Apache Atlas Graph Database Implementation Dependencies SUCCESS [  2.478 s]
[INFO] Shaded version of Apache hbase client .............. SUCCESS [  7.998 s]
[INFO] Shaded version of Apache hbase server .............. SUCCESS [ 21.187 s]
[INFO] Apache Atlas Authorization ......................... SUCCESS [  9.658 s]
[INFO] Apache Atlas Repository ............................ FAILURE [07:10 min]
[INFO] Apache Atlas UI .................................... SKIPPED
[INFO] Apache Atlas Web Application ....................... SKIPPED
[INFO] Apache Atlas Documentation ......................... SKIPPED
[INFO] Apache Atlas FileSystem Model ...................... SKIPPED
[INFO] Apache Atlas Plugin Classloader .................... SKIPPED
[INFO] Apache Atlas Hive Bridge Shim ...................... SKIPPED
[INFO] Apache Atlas Hive Bridge ........................... SKIPPED
[INFO] Apache Atlas Falcon Bridge Shim .................... SKIPPED
[INFO] Apache Atlas Falcon Bridge ......................... SKIPPED
[INFO] Apache Atlas Sqoop Bridge Shim ..................... SKIPPED
[INFO] Apache Atlas Sqoop Bridge .......................... SKIPPED
[INFO] Apache Atlas Storm Bridge Shim ..................... SKIPPED
[INFO] Apache Atlas Storm Bridge .......................... SKIPPED
[INFO] Apache Atlas Hbase Bridge Shim ..................... SKIPPED
[INFO] Apache Atlas Hbase Bridge .......................... SKIPPED
[INFO] Apache Atlas Kafka Bridge .......................... SKIPPED
[INFO] Apache Atlas Distribution 1.1.0-SNAPSHOT ........... SKIPPED
[INFO] ------------------------------------------------------------------------
[INFO] BUILD FAILURE
[INFO] ------------------------------------------------------------------------
[INFO] Total time: 13:10 min
[INFO] Finished at: 2018-08-27T12:53:20Z
[INFO] ------------------------------------------------------------------------
[ERROR] Failed to execute goal org.apache.maven.plugins:maven-surefire-plugin:2.18.1:test
(default-test) on project atlas-repository: There are test failures.
[ERROR] 
[ERROR] Please refer to <https://builds.apache.org/job/Atlas-1.0-AllTests/ws/repository/target/surefire-reports>
for the individual test results.
[ERROR] -> [Help 1]
[ERROR] 
[ERROR] To see the full stack trace of the errors, re-run Maven with the -e switch.
[ERROR] Re-run Maven using the -X switch to enable full debug logging.
[ERROR] 
[ERROR] For more information about the errors and possible solutions, please read the following
articles:
[ERROR] [Help 1] http://cwiki.apache.org/confluence/display/MAVEN/MojoFailureException
[ERROR] 
[ERROR] After correcting the problems, you can resume the build with the command
[ERROR]   mvn <goals> -rf :atlas-repository
Build step 'Execute shell' marked build as failure
[CHECKSTYLE] Collecting checkstyle analysis files...
[CHECKSTYLE] Searching for all files in <https://builds.apache.org/job/Atlas-1.0-AllTests/ws/>
that match the pattern **/target/checkstyle-result.xml
[CHECKSTYLE] Parsing 18 files in <https://builds.apache.org/job/Atlas-1.0-AllTests/ws/>
[CHECKSTYLE] Successfully parsed file <https://builds.apache.org/job/Atlas-1.0-AllTests/ws/authorization/target/checkstyle-result.xml>
with 973 unique warnings and 0 duplicates.
[CHECKSTYLE] Successfully parsed file <https://builds.apache.org/job/Atlas-1.0-AllTests/ws/client/client-v1/target/checkstyle-result.xml>
with 1872 unique warnings and 0 duplicates.
[CHECKSTYLE] Successfully parsed file <https://builds.apache.org/job/Atlas-1.0-AllTests/ws/client/client-v2/target/checkstyle-result.xml>
with 2231 unique warnings and 0 duplicates.
[CHECKSTYLE] Successfully parsed file <https://builds.apache.org/job/Atlas-1.0-AllTests/ws/client/common/target/checkstyle-result.xml>
with 2723 unique warnings and 0 duplicates.
[CHECKSTYLE] Successfully parsed file <https://builds.apache.org/job/Atlas-1.0-AllTests/ws/client/target/checkstyle-result.xml>
with 2723 unique warnings and 0 duplicates.
[CHECKSTYLE] Successfully parsed file <https://builds.apache.org/job/Atlas-1.0-AllTests/ws/common/target/checkstyle-result.xml>
with 3800 unique warnings and 0 duplicates.
[CHECKSTYLE] Successfully parsed file <https://builds.apache.org/job/Atlas-1.0-AllTests/ws/graphdb/api/target/checkstyle-result.xml>
with 4102 unique warnings and 0 duplicates.
[CHECKSTYLE] Successfully parsed file <https://builds.apache.org/job/Atlas-1.0-AllTests/ws/graphdb/common/target/checkstyle-result.xml>
with 4328 unique warnings and 0 duplicates.
[CHECKSTYLE] Successfully parsed file <https://builds.apache.org/job/Atlas-1.0-AllTests/ws/graphdb/graphdb-impls/target/checkstyle-result.xml>
with 4328 unique warnings and 0 duplicates.
[CHECKSTYLE] Successfully parsed file <https://builds.apache.org/job/Atlas-1.0-AllTests/ws/graphdb/janus/target/checkstyle-result.xml>
with 6654 unique warnings and 0 duplicates.
[CHECKSTYLE] Successfully parsed file <https://builds.apache.org/job/Atlas-1.0-AllTests/ws/graphdb/target/checkstyle-result.xml>
with 6654 unique warnings and 0 duplicates.
[CHECKSTYLE] Successfully parsed file <https://builds.apache.org/job/Atlas-1.0-AllTests/ws/intg/target/checkstyle-result.xml>
with 18753 unique warnings and 0 duplicates.
[CHECKSTYLE] Successfully parsed file <https://builds.apache.org/job/Atlas-1.0-AllTests/ws/notification/target/checkstyle-result.xml>
with 20027 unique warnings and 0 duplicates.
[CHECKSTYLE] Successfully parsed file <https://builds.apache.org/job/Atlas-1.0-AllTests/ws/server-api/target/checkstyle-result.xml>
with 20195 unique warnings and 0 duplicates.
[CHECKSTYLE] Successfully parsed file <https://builds.apache.org/job/Atlas-1.0-AllTests/ws/shaded/hbase-client-shaded/target/checkstyle-result.xml>
with 20195 unique warnings and 0 duplicates.
[CHECKSTYLE] Successfully parsed file <https://builds.apache.org/job/Atlas-1.0-AllTests/ws/shaded/hbase-server-shaded/target/checkstyle-result.xml>
with 20195 unique warnings and 0 duplicates.
[CHECKSTYLE] Successfully parsed file <https://builds.apache.org/job/Atlas-1.0-AllTests/ws/target/checkstyle-result.xml>
with 20195 unique warnings and 0 duplicates.
[CHECKSTYLE] Successfully parsed file <https://builds.apache.org/job/Atlas-1.0-AllTests/ws/test-tools/target/checkstyle-result.xml>
with 20233 unique warnings and 0 duplicates.
<Git Blamer> Using GitBlamer to create author and commit information for all warnings.
<Git Blamer> GIT_COMMIT=5c0a2023ab72f5b02b603d9f94e1590bacfedfbb, workspace=<https://builds.apache.org/job/Atlas-1.0-AllTests/ws/>
 > git rev-parse 5c0a2023ab72f5b02b603d9f94e1590bacfedfbb^{commit} # timeout=10
[CHECKSTYLE] Computing warning deltas based on reference build #883
[FINDBUGS] Collecting findbugs analysis files...
[FINDBUGS] Searching for all files in <https://builds.apache.org/job/Atlas-1.0-AllTests/ws/>
that match the pattern **/target/findbugs.xml
[FINDBUGS] Parsing 12 files in <https://builds.apache.org/job/Atlas-1.0-AllTests/ws/>
[FINDBUGS] Successfully parsed file <https://builds.apache.org/job/Atlas-1.0-AllTests/ws/authorization/target/findbugs.xml>
with 0 unique warnings and 0 duplicates.
[FINDBUGS] Successfully parsed file <https://builds.apache.org/job/Atlas-1.0-AllTests/ws/client/client-v1/target/findbugs.xml>
with 0 unique warnings and 0 duplicates.
[FINDBUGS] Successfully parsed file <https://builds.apache.org/job/Atlas-1.0-AllTests/ws/client/client-v2/target/findbugs.xml>
with 0 unique warnings and 0 duplicates.
[FINDBUGS] Successfully parsed file <https://builds.apache.org/job/Atlas-1.0-AllTests/ws/client/common/target/findbugs.xml>
with 0 unique warnings and 0 duplicates.
[FINDBUGS] Successfully parsed file <https://builds.apache.org/job/Atlas-1.0-AllTests/ws/common/target/findbugs.xml>
with 0 unique warnings and 0 duplicates.
[FINDBUGS] Successfully parsed file <https://builds.apache.org/job/Atlas-1.0-AllTests/ws/graphdb/api/target/findbugs.xml>
with 0 unique warnings and 0 duplicates.
[FINDBUGS] Successfully parsed file <https://builds.apache.org/job/Atlas-1.0-AllTests/ws/graphdb/common/target/findbugs.xml>
with 0 unique warnings and 0 duplicates.
[FINDBUGS] Successfully parsed file <https://builds.apache.org/job/Atlas-1.0-AllTests/ws/graphdb/janus/target/findbugs.xml>
with 0 unique warnings and 0 duplicates.
[FINDBUGS] Successfully parsed file <https://builds.apache.org/job/Atlas-1.0-AllTests/ws/intg/target/findbugs.xml>
with 0 unique warnings and 0 duplicates.
[FINDBUGS] Successfully parsed file <https://builds.apache.org/job/Atlas-1.0-AllTests/ws/notification/target/findbugs.xml>
with 0 unique warnings and 0 duplicates.
[FINDBUGS] Successfully parsed file <https://builds.apache.org/job/Atlas-1.0-AllTests/ws/server-api/target/findbugs.xml>
with 0 unique warnings and 0 duplicates.
[FINDBUGS] Successfully parsed file <https://builds.apache.org/job/Atlas-1.0-AllTests/ws/test-tools/target/findbugs.xml>
with 0 unique warnings and 0 duplicates.
<Git Blamer> Using GitBlamer to create author and commit information for all warnings.
<Git Blamer> GIT_COMMIT=5c0a2023ab72f5b02b603d9f94e1590bacfedfbb, workspace=<https://builds.apache.org/job/Atlas-1.0-AllTests/ws/>
[FINDBUGS] Computing warning deltas based on reference build #883
Archiving artifacts
ERROR: Step ?Archive the artifacts? aborted due to exception: 
java.io.IOException: Too many open files
	at java.io.UnixFileSystem.createFileExclusively(Native Method)
	at java.io.File.createNewFile(File.java:1012)
	at com.google.common.io.Files.touch(Files.java:441)
	at jsync.protocol.FileSequenceReader.read(FileSequenceReader.java:30)
	at com.cloudbees.jenkins.plugins.jsync.archiver.JSyncArtifactManager.remoteSync(JSyncArtifactManager.java:158)
	at com.cloudbees.jenkins.plugins.jsync.archiver.JSyncArtifactManager.archive(JSyncArtifactManager.java:76)
	at hudson.tasks.ArtifactArchiver.perform(ArtifactArchiver.java:235)
	at hudson.tasks.BuildStepCompatibilityLayer.perform(BuildStepCompatibilityLayer.java:81)
	at hudson.tasks.BuildStepMonitor$1.perform(BuildStepMonitor.java:20)
	at hudson.model.AbstractBuild$AbstractBuildExecution.perform(AbstractBuild.java:744)
	at hudson.model.AbstractBuild$AbstractBuildExecution.performAllBuildSteps(AbstractBuild.java:690)
	at hudson.model.Build$BuildExecution.post2(Build.java:186)
	at hudson.model.AbstractBuild$AbstractBuildExecution.post(AbstractBuild.java:635)
	at hudson.model.Run.execute(Run.java:1819)
	at hudson.model.FreeStyleBuild.run(FreeStyleBuild.java:43)
	at hudson.model.ResourceController.execute(ResourceController.java:97)
	at hudson.model.Executor.run(Executor.java:429)
TestNG Reports Processing: START
Looking for TestNG results report in workspace using pattern: **/target/surefire-reports/testng-results.xml,**/target/failsafe-reports/testng-results.xml
Saving reports...
Processing '/x1/jenkins/jenkins-home/jobs/Atlas-1.0-AllTests/builds/887/testng/testng-results-1.xml'
Processing '/x1/jenkins/jenkins-home/jobs/Atlas-1.0-AllTests/builds/887/testng/testng-results-2.xml'
Processing '/x1/jenkins/jenkins-home/jobs/Atlas-1.0-AllTests/builds/887/testng/testng-results-3.xml'
Processing '/x1/jenkins/jenkins-home/jobs/Atlas-1.0-AllTests/builds/887/testng/testng-results-4.xml'
Processing '/x1/jenkins/jenkins-home/jobs/Atlas-1.0-AllTests/builds/887/testng/testng-results-5.xml'
Processing '/x1/jenkins/jenkins-home/jobs/Atlas-1.0-AllTests/builds/887/testng/testng-results-6.xml'
Processing '/x1/jenkins/jenkins-home/jobs/Atlas-1.0-AllTests/builds/887/testng/testng-results.xml'
TestNG Reports Processing: FINISH

Mime
View raw message