atlas-dev mailing list archives

Site index · List index
Message view « Date » · « Thread »
Top « Date » · « Thread »
From Apache Jenkins Server <jenk...@builds.apache.org>
Subject Build failed in Jenkins: Atlas-1.0-UnitTests #903
Date Mon, 27 Aug 2018 12:21:21 GMT
See <https://builds.apache.org/job/Atlas-1.0-UnitTests/903/display/redirect>

------------------------------------------
[...truncated 140.94 KB...]
[INFO] Copying 41 resources
[INFO] Copying 3 resources
[INFO] 
[INFO] --- maven-compiler-plugin:3.7.0:testCompile (default-testCompile) @ atlas-repository
---
[INFO] Changes detected - recompiling the module!
[INFO] Compiling 49 source files to <https://builds.apache.org/job/Atlas-1.0-UnitTests/ws/repository/target/test-classes>
[INFO] <https://builds.apache.org/job/Atlas-1.0-UnitTests/ws/repository/src/test/java/org/apache/atlas/query/BasicTestSetup.java>:
Some input files use or override a deprecated API.
[INFO] <https://builds.apache.org/job/Atlas-1.0-UnitTests/ws/repository/src/test/java/org/apache/atlas/query/BasicTestSetup.java>:
Recompile with -Xlint:deprecation for details.
[INFO] <https://builds.apache.org/job/Atlas-1.0-UnitTests/ws/repository/src/test/java/org/apache/atlas/repository/impexp/ImportServiceTest.java>:
Some input files use unchecked or unsafe operations.
[INFO] <https://builds.apache.org/job/Atlas-1.0-UnitTests/ws/repository/src/test/java/org/apache/atlas/repository/impexp/ImportServiceTest.java>:
Recompile with -Xlint:unchecked for details.
[INFO] 
[INFO] --- maven-surefire-plugin:2.18.1:test (default-test) @ atlas-repository ---
[INFO] Surefire report directory: <https://builds.apache.org/job/Atlas-1.0-UnitTests/ws/repository/target/surefire-reports>
[INFO] Using configured provider org.apache.maven.surefire.testng.TestNGProvider

-------------------------------------------------------
 T E S T S
-------------------------------------------------------
Running org.apache.atlas.repository.migration.PathTest
Running org.apache.atlas.repository.store.graph.v2.AtlasRelationshipDefStoreV2Test
Running org.apache.atlas.repository.impexp.ImportServiceTest
Running org.apache.atlas.repository.store.graph.v2.AtlasRelationshipStoreSoftDeleteV2Test
Running org.apache.atlas.repository.impexp.ZipSinkTest
Running org.apache.atlas.repository.impexp.ImportTransformsTest
Running org.apache.atlas.repository.migration.MigrationProgressServiceTest
Running org.apache.atlas.TestModules
Running org.apache.atlas.repository.store.graph.AtlasTypeDefGraphStoreTest
Running org.apache.atlas.repository.store.graph.v2.AtlasEntityStoreV2BulkImportPercentTest
Running org.apache.atlas.repository.audit.CassandraAuditRepositoryTest
Running org.apache.atlas.repository.userprofile.UserProfileServiceTest
Running org.apache.atlas.utils.ObjectUpdateSynchronizerTest
Running org.apache.atlas.repository.impexp.AtlasImportRequestTest
Running org.apache.atlas.repository.store.graph.v2.AtlasRelationshipStoreHardDeleteV2Test
Running org.apache.atlas.repository.store.graph.v2.AtlasRelationshipStoreV2Test
Running org.apache.atlas.repository.tagpropagation.ClassificationPropagationTest
Running org.apache.atlas.repository.store.graph.v2.AtlasEntityStoreV2Test
Running org.apache.atlas.repository.impexp.ZipSourceTest
Running org.apache.atlas.repository.impexp.ImportTransformerTest
Running org.apache.atlas.repository.store.graph.v2.AtlasEntityDefStoreV2Test
Running org.apache.atlas.repository.store.graph.v2.InverseReferenceUpdateSoftDeleteV2Test
Running org.apache.atlas.repository.store.graph.v2.AtlasComplexAttributesTest
Running org.apache.atlas.repository.impexp.UniqueListTest
Running org.apache.atlas.utils.TestResourceFileUtils
Running org.apache.atlas.repository.impexp.TypeAttributeDifferenceTest
Running org.apache.atlas.repository.impexp.ExportServiceTest
Running org.apache.atlas.repository.store.graph.v2.InverseReferenceUpdateHardDeleteV2Test
Running org.apache.atlas.repository.store.graph.v2.InverseReferenceUpdateV2Test
Running org.apache.atlas.repository.impexp.ImportTransformerJSONTest
Running org.apache.atlas.repository.migration.RelationshipCacheGeneratorTest
Running org.apache.atlas.repository.audit.InMemoryAuditRepositoryTest
Tests run: 0, Failures: 0, Errors: 0, Skipped: 0, Time elapsed: 2.74 sec - in org.apache.atlas.repository.store.graph.v2.AtlasRelationshipStoreV2Test
Tests run: 0, Failures: 0, Errors: 0, Skipped: 0, Time elapsed: 3.026 sec - in org.apache.atlas.TestModules
Tests run: 8, Failures: 0, Errors: 0, Skipped: 0, Time elapsed: 2.786 sec - in org.apache.atlas.repository.impexp.ImportTransformerTest
Tests run: 0, Failures: 0, Errors: 0, Skipped: 0, Time elapsed: 2.544 sec - in org.apache.atlas.utils.TestResourceFileUtils
Tests run: 0, Failures: 0, Errors: 0, Skipped: 0, Time elapsed: 2.68 sec - in org.apache.atlas.repository.store.graph.v2.InverseReferenceUpdateV2Test
Tests run: 4, Failures: 0, Errors: 0, Skipped: 0, Time elapsed: 3.792 sec - in org.apache.atlas.repository.impexp.UniqueListTest
Tests run: 6, Failures: 0, Errors: 0, Skipped: 0, Time elapsed: 2.576 sec - in org.apache.atlas.repository.audit.InMemoryAuditRepositoryTest
Running org.apache.atlas.repository.migration.HiveStocksTest
Running org.apache.atlas.repository.migration.ComplexAttributesTest
Running org.apache.atlas.repository.migration.HiveParititionTest
Tests run: 6, Failures: 0, Errors: 0, Skipped: 0, Time elapsed: 4.403 sec - in org.apache.atlas.repository.impexp.TypeAttributeDifferenceTest
Running org.apache.atlas.repository.migration.TypesWithCollectionsFinderTest
Tests run: 8, Failures: 0, Errors: 0, Skipped: 0, Time elapsed: 6.008 sec - in org.apache.atlas.repository.impexp.ZipSinkTest
Tests run: 9, Failures: 0, Errors: 0, Skipped: 0, Time elapsed: 5.902 sec - in org.apache.atlas.repository.store.graph.v2.AtlasEntityStoreV2BulkImportPercentTest
Tests run: 9, Failures: 0, Errors: 0, Skipped: 0, Time elapsed: 6.009 sec - in org.apache.atlas.utils.ObjectUpdateSynchronizerTest
Tests run: 6, Failures: 0, Errors: 0, Skipped: 0, Time elapsed: 6.134 sec - in org.apache.atlas.repository.impexp.AtlasImportRequestTest
Running org.apache.atlas.repository.migration.TypesDefScrubberTest
Tests run: 3, Failures: 0, Errors: 0, Skipped: 0, Time elapsed: 6.819 sec - in org.apache.atlas.repository.impexp.ImportTransformsTest
Tests run: 6, Failures: 0, Errors: 0, Skipped: 0, Time elapsed: 6.617 sec - in org.apache.atlas.repository.impexp.ZipSourceTest
Running org.apache.atlas.repository.migration.TypesWithClassificationTest
Running org.apache.atlas.glossary.GlossaryServiceTest
Tests run: 1, Failures: 0, Errors: 0, Skipped: 0, Time elapsed: 5.539 sec - in org.apache.atlas.repository.impexp.ImportTransformerJSONTest
Running org.apache.atlas.query.GremlinQueryComposerTest
Tests run: 4, Failures: 0, Errors: 0, Skipped: 0, Time elapsed: 8.073 sec - in org.apache.atlas.repository.migration.MigrationProgressServiceTest
Running org.apache.atlas.glossary.PaginationHelperTest
Running org.apache.atlas.query.DSLQueriesTest
Running org.apache.atlas.query.DSLParsingTest
Running org.apache.atlas.services.MetricsServiceTest
Tests run: 20, Failures: 0, Errors: 0, Skipped: 0, Time elapsed: 2.371 sec - in org.apache.atlas.glossary.PaginationHelperTest
Tests run: 1, Failures: 0, Errors: 0, Skipped: 0, Time elapsed: 4.709 sec - in org.apache.atlas.repository.migration.TypesDefScrubberTest
Tests run: 8, Failures: 0, Errors: 0, Skipped: 0, Time elapsed: 4.753 sec - in org.apache.atlas.query.DSLParsingTest
Tests run: 39, Failures: 0, Errors: 0, Skipped: 0, Time elapsed: 20.723 sec - in org.apache.atlas.query.GremlinQueryComposerTest
Tests run: 6, Failures: 0, Errors: 0, Skipped: 0, Time elapsed: 32.127 sec - in org.apache.atlas.repository.audit.CassandraAuditRepositoryTest
Tests run: 1, Failures: 0, Errors: 0, Skipped: 0, Time elapsed: 38.316 sec - in org.apache.atlas.services.MetricsServiceTest
Tests run: 10, Failures: 0, Errors: 0, Skipped: 0, Time elapsed: 60.35 sec - in org.apache.atlas.repository.store.graph.v2.AtlasRelationshipDefStoreV2Test
Tests run: 1, Failures: 0, Errors: 0, Skipped: 0, Time elapsed: 62.913 sec - in org.apache.atlas.repository.store.graph.v2.AtlasEntityDefStoreV2Test
Tests run: 5, Failures: 0, Errors: 0, Skipped: 0, Time elapsed: 78.141 sec - in org.apache.atlas.repository.store.graph.v2.InverseReferenceUpdateSoftDeleteV2Test
Tests run: 1, Failures: 0, Errors: 0, Skipped: 0, Time elapsed: 84.726 sec - in org.apache.atlas.repository.migration.RelationshipCacheGeneratorTest
Tests run: 4, Failures: 0, Errors: 0, Skipped: 0, Time elapsed: 89.541 sec - in org.apache.atlas.repository.store.graph.v2.AtlasRelationshipStoreSoftDeleteV2Test
Tests run: 4, Failures: 0, Errors: 0, Skipped: 0, Time elapsed: 93.109 sec - in org.apache.atlas.repository.store.graph.v2.AtlasRelationshipStoreHardDeleteV2Test
Tests run: 1, Failures: 0, Errors: 0, Skipped: 0, Time elapsed: 88.792 sec - in org.apache.atlas.repository.migration.TypesWithCollectionsFinderTest
Tests run: 5, Failures: 4, Errors: 0, Skipped: 0, Time elapsed: 87.104 sec <<< FAILURE!
- in org.apache.atlas.repository.store.graph.v2.InverseReferenceUpdateHardDeleteV2Test
testInverseReferenceAutoUpdate_Map(org.apache.atlas.repository.store.graph.v2.InverseReferenceUpdateHardDeleteV2Test)
 Time elapsed: 3.999 sec  <<< FAILURE!
java.lang.AssertionError: expected [null] but found [AtlasObjectId{guid='5ad1440e-a3cc-47ca-95dd-8d64d13c39a9',
typeName='A', uniqueAttributes={}}]
	at org.testng.Assert.fail(Assert.java:94)
	at org.testng.Assert.failNotSame(Assert.java:492)
	at org.testng.Assert.assertNull(Assert.java:428)
	at org.testng.Assert.assertNull(Assert.java:417)
	at org.apache.atlas.repository.store.graph.v2.InverseReferenceUpdateV2Test.verifyReferenceValue(InverseReferenceUpdateV2Test.java:362)
	at org.apache.atlas.repository.store.graph.v2.InverseReferenceUpdateHardDeleteV2Test.verify_testInverseReferenceAutoUpdate_Map(InverseReferenceUpdateHardDeleteV2Test.java:72)

testInverseReferenceAutoUpdate_NonCompositeManyToOne(org.apache.atlas.repository.store.graph.v2.InverseReferenceUpdateHardDeleteV2Test)
 Time elapsed: 2.383 sec  <<< FAILURE!
java.lang.AssertionError: expected [null] but found [AtlasObjectId{guid='25084c8f-9f65-49da-811e-f2b814d7d71f',
typeName='B', uniqueAttributes={}}]
	at org.testng.Assert.fail(Assert.java:94)
	at org.testng.Assert.failNotSame(Assert.java:492)
	at org.testng.Assert.assertNull(Assert.java:428)
	at org.testng.Assert.assertNull(Assert.java:417)
	at org.apache.atlas.repository.store.graph.v2.InverseReferenceUpdateV2Test.verifyReferenceValue(InverseReferenceUpdateV2Test.java:362)
	at org.apache.atlas.repository.store.graph.v2.InverseReferenceUpdateHardDeleteV2Test.verify_testInverseReferenceAutoUpdate_NonCompositeManyToOne(InverseReferenceUpdateHardDeleteV2Test.java:49)

testInverseReferenceAutoUpdate_NonComposite_OneToMany(org.apache.atlas.repository.store.graph.v2.InverseReferenceUpdateHardDeleteV2Test)
 Time elapsed: 1.315 sec  <<< FAILURE!
java.lang.AssertionError: expected [1] but found [2]
	at org.testng.Assert.fail(Assert.java:94)
	at org.testng.Assert.failNotEquals(Assert.java:496)
	at org.testng.Assert.assertEquals(Assert.java:125)
	at org.testng.Assert.assertEquals(Assert.java:372)
	at org.testng.Assert.assertEquals(Assert.java:382)
	at org.apache.atlas.repository.store.graph.v2.InverseReferenceUpdateV2Test.verifyReferenceList(InverseReferenceUpdateV2Test.java:375)
	at org.apache.atlas.repository.store.graph.v2.InverseReferenceUpdateHardDeleteV2Test.verify_testInverseReferenceAutoUpdate_NonComposite_OneToMany(InverseReferenceUpdateHardDeleteV2Test.java:43)

testInverseReferenceAutoUpdate_NonComposite_OneToOne(org.apache.atlas.repository.store.graph.v2.InverseReferenceUpdateHardDeleteV2Test)
 Time elapsed: 2.079 sec  <<< FAILURE!
java.lang.AssertionError: expected [null] but found [AtlasObjectId{guid='67900f4a-0eb0-4f04-b907-4a6b6557a453',
typeName='B', uniqueAttributes={}}]
	at org.testng.Assert.fail(Assert.java:94)
	at org.testng.Assert.failNotSame(Assert.java:492)
	at org.testng.Assert.assertNull(Assert.java:428)
	at org.testng.Assert.assertNull(Assert.java:417)
	at org.apache.atlas.repository.store.graph.v2.InverseReferenceUpdateV2Test.verifyReferenceValue(InverseReferenceUpdateV2Test.java:362)
	at org.apache.atlas.repository.store.graph.v2.InverseReferenceUpdateHardDeleteV2Test.verify_testInverseReferenceAutoUpdate_NonComposite_OneToOne(InverseReferenceUpdateHardDeleteV2Test.java:59)

Tests run: 7, Failures: 0, Errors: 0, Skipped: 0, Time elapsed: 98.941 sec - in org.apache.atlas.repository.store.graph.v2.AtlasComplexAttributesTest
Tests run: 12, Failures: 0, Errors: 0, Skipped: 0, Time elapsed: 105.777 sec - in org.apache.atlas.repository.userprofile.UserProfileServiceTest
Tests run: 12, Failures: 0, Errors: 0, Skipped: 0, Time elapsed: 107.646 sec - in org.apache.atlas.repository.impexp.ExportServiceTest
Tests run: 18, Failures: 0, Errors: 0, Skipped: 0, Time elapsed: 109.039 sec - in org.apache.atlas.repository.store.graph.AtlasTypeDefGraphStoreTest
Tests run: 1, Failures: 0, Errors: 0, Skipped: 0, Time elapsed: 113.042 sec - in org.apache.atlas.repository.migration.PathTest
Tests run: 1, Failures: 0, Errors: 0, Skipped: 0, Time elapsed: 106.058 sec - in org.apache.atlas.repository.migration.TypesWithClassificationTest
Tests run: 1, Failures: 0, Errors: 0, Skipped: 0, Time elapsed: 109.431 sec - in org.apache.atlas.repository.migration.HiveParititionTest
Tests run: 1, Failures: 0, Errors: 0, Skipped: 0, Time elapsed: 110.101 sec - in org.apache.atlas.repository.migration.HiveStocksTest
Tests run: 16, Failures: 1, Errors: 0, Skipped: 0, Time elapsed: 115.612 sec <<<
FAILURE! - in org.apache.atlas.repository.store.graph.v2.AtlasEntityStoreV2Test
testMapOfPrimitivesUpdate(org.apache.atlas.repository.store.graph.v2.AtlasEntityStoreV2Test)
 Time elapsed: 0.05 sec  <<< FAILURE!
java.lang.AssertionError: expected [1] but found [2]
	at org.testng.Assert.fail(Assert.java:94)
	at org.testng.Assert.failNotEquals(Assert.java:496)
	at org.testng.Assert.assertEquals(Assert.java:125)
	at org.testng.Assert.assertEquals(Assert.java:372)
	at org.testng.Assert.assertEquals(Assert.java:382)
	at org.apache.atlas.repository.store.graph.v2.AtlasEntityTestBase.validateMutationResponse(AtlasEntityTestBase.java:144)
	at org.apache.atlas.repository.store.graph.v2.AtlasEntityStoreV2Test.testMapOfPrimitivesUpdate(AtlasEntityStoreV2Test.java:404)

Tests run: 1, Failures: 0, Errors: 0, Skipped: 0, Time elapsed: 112.806 sec - in org.apache.atlas.repository.migration.ComplexAttributesTest
Tests run: 35, Failures: 0, Errors: 0, Skipped: 0, Time elapsed: 113.018 sec - in org.apache.atlas.glossary.GlossaryServiceTest
Tests run: 14, Failures: 0, Errors: 0, Skipped: 0, Time elapsed: 141.766 sec - in org.apache.atlas.repository.impexp.ImportServiceTest
Tests run: 11, Failures: 0, Errors: 0, Skipped: 0, Time elapsed: 157.024 sec - in org.apache.atlas.repository.tagpropagation.ClassificationPropagationTest
Tests run: 246, Failures: 0, Errors: 0, Skipped: 0, Time elapsed: 406.422 sec - in org.apache.atlas.query.DSLQueriesTest

Results :

Failed tests: 
  AtlasEntityStoreV2Test.testMapOfPrimitivesUpdate:404->AtlasEntityTestBase.validateMutationResponse:144
expected [1] but found [2]
  InverseReferenceUpdateHardDeleteV2Test>InverseReferenceUpdateV2Test.testInverseReferenceAutoUpdate_Map:354->verify_testInverseReferenceAutoUpdate_Map:72->InverseReferenceUpdateV2Test.verifyReferenceValue:362
expected [null] but found [AtlasObjectId{guid='5ad1440e-a3cc-47ca-95dd-8d64d13c39a9', typeName='A',
uniqueAttributes={}}]
  InverseReferenceUpdateHardDeleteV2Test>InverseReferenceUpdateV2Test.testInverseReferenceAutoUpdate_NonCompositeManyToOne:201->verify_testInverseReferenceAutoUpdate_NonCompositeManyToOne:49->InverseReferenceUpdateV2Test.verifyReferenceValue:362
expected [null] but found [AtlasObjectId{guid='25084c8f-9f65-49da-811e-f2b814d7d71f', typeName='B',
uniqueAttributes={}}]
  InverseReferenceUpdateHardDeleteV2Test>InverseReferenceUpdateV2Test.testInverseReferenceAutoUpdate_NonComposite_OneToMany:141->verify_testInverseReferenceAutoUpdate_NonComposite_OneToMany:43->InverseReferenceUpdateV2Test.verifyReferenceList:375
expected [1] but found [2]
  InverseReferenceUpdateHardDeleteV2Test>InverseReferenceUpdateV2Test.testInverseReferenceAutoUpdate_NonComposite_OneToOne:255->verify_testInverseReferenceAutoUpdate_NonComposite_OneToOne:59->InverseReferenceUpdateV2Test.verifyReferenceValue:362
expected [null] but found [AtlasObjectId{guid='67900f4a-0eb0-4f04-b907-4a6b6557a453', typeName='B',
uniqueAttributes={}}]

Tests run: 552, Failures: 5, Errors: 0, Skipped: 0

[INFO] ------------------------------------------------------------------------
[INFO] Reactor Summary:
[INFO] 
[INFO] Apache Atlas Server Build Tools 1.0 ................ SUCCESS [  0.592 s]
[INFO] apache-atlas 1.1.0-SNAPSHOT ........................ SUCCESS [  2.074 s]
[INFO] Apache Atlas Test Utility Tools .................... SUCCESS [  4.728 s]
[INFO] Apache Atlas Integration ........................... SUCCESS [ 40.582 s]
[INFO] Apache Atlas Common ................................ SUCCESS [  2.315 s]
[INFO] Apache Atlas Client ................................ SUCCESS [  0.129 s]
[INFO] atlas-client-common ................................ SUCCESS [  0.746 s]
[INFO] atlas-client-v1 .................................... SUCCESS [  2.806 s]
[INFO] Apache Atlas Server API ............................ SUCCESS [  0.752 s]
[INFO] Apache Atlas Notification .......................... SUCCESS [ 15.766 s]
[INFO] atlas-client-v2 .................................... SUCCESS [  0.761 s]
[INFO] Apache Atlas Graph Database Projects ............... SUCCESS [  0.079 s]
[INFO] Apache Atlas Graph Database API .................... SUCCESS [  0.657 s]
[INFO] Graph Database Common Code ......................... SUCCESS [  0.725 s]
[INFO] Apache Atlas JanusGraph DB Impl .................... SUCCESS [02:11 min]
[INFO] Apache Atlas Graph Database Implementation Dependencies SUCCESS [  2.145 s]
[INFO] Shaded version of Apache hbase client .............. SUCCESS [  7.746 s]
[INFO] Shaded version of Apache hbase server .............. SUCCESS [ 20.527 s]
[INFO] Apache Atlas Authorization ......................... SUCCESS [  2.284 s]
[INFO] Apache Atlas Repository ............................ FAILURE [07:06 min]
[INFO] Apache Atlas UI .................................... SKIPPED
[INFO] Apache Atlas Web Application ....................... SKIPPED
[INFO] Apache Atlas Documentation ......................... SKIPPED
[INFO] Apache Atlas FileSystem Model ...................... SKIPPED
[INFO] Apache Atlas Plugin Classloader .................... SKIPPED
[INFO] Apache Atlas Hive Bridge Shim ...................... SKIPPED
[INFO] Apache Atlas Hive Bridge ........................... SKIPPED
[INFO] Apache Atlas Falcon Bridge Shim .................... SKIPPED
[INFO] Apache Atlas Falcon Bridge ......................... SKIPPED
[INFO] Apache Atlas Sqoop Bridge Shim ..................... SKIPPED
[INFO] Apache Atlas Sqoop Bridge .......................... SKIPPED
[INFO] Apache Atlas Storm Bridge Shim ..................... SKIPPED
[INFO] Apache Atlas Storm Bridge .......................... SKIPPED
[INFO] Apache Atlas Hbase Bridge Shim ..................... SKIPPED
[INFO] Apache Atlas Hbase Bridge .......................... SKIPPED
[INFO] Apache Atlas Kafka Bridge .......................... SKIPPED
[INFO] Apache Atlas Distribution 1.1.0-SNAPSHOT ........... SKIPPED
[INFO] ------------------------------------------------------------------------
[INFO] BUILD FAILURE
[INFO] ------------------------------------------------------------------------
[INFO] Total time: 11:05 min
[INFO] Finished at: 2018-08-27T12:21:15Z
[INFO] ------------------------------------------------------------------------
[ERROR] Failed to execute goal org.apache.maven.plugins:maven-surefire-plugin:2.18.1:test
(default-test) on project atlas-repository: There are test failures.
[ERROR] 
[ERROR] Please refer to <https://builds.apache.org/job/Atlas-1.0-UnitTests/ws/repository/target/surefire-reports>
for the individual test results.
[ERROR] -> [Help 1]
[ERROR] 
[ERROR] To see the full stack trace of the errors, re-run Maven with the -e switch.
[ERROR] Re-run Maven using the -X switch to enable full debug logging.
[ERROR] 
[ERROR] For more information about the errors and possible solutions, please read the following
articles:
[ERROR] [Help 1] http://cwiki.apache.org/confluence/display/MAVEN/MojoFailureException
[ERROR] 
[ERROR] After correcting the problems, you can resume the build with the command
[ERROR]   mvn <goals> -rf :atlas-repository
Build step 'Execute shell' marked build as failure
[CHECKSTYLE] Collecting checkstyle analysis files...
[CHECKSTYLE] Searching for all files in <https://builds.apache.org/job/Atlas-1.0-UnitTests/ws/>
that match the pattern **/target/checkstyle-result.xml
[CHECKSTYLE] No files found. Configuration error?
<Git Blamer> Using GitBlamer to create author and commit information for all warnings.
<Git Blamer> GIT_COMMIT=5c0a2023ab72f5b02b603d9f94e1590bacfedfbb, workspace=<https://builds.apache.org/job/Atlas-1.0-UnitTests/ws/>
[CHECKSTYLE] Computing warning deltas based on reference build #900
[FINDBUGS] Collecting findbugs analysis files...
[FINDBUGS] Searching for all files in <https://builds.apache.org/job/Atlas-1.0-UnitTests/ws/>
that match the pattern **/target/findbugs.xml
[FINDBUGS] No files found. Configuration error?
<Git Blamer> Using GitBlamer to create author and commit information for all warnings.
<Git Blamer> GIT_COMMIT=5c0a2023ab72f5b02b603d9f94e1590bacfedfbb, workspace=<https://builds.apache.org/job/Atlas-1.0-UnitTests/ws/>
[FINDBUGS] Computing warning deltas based on reference build #900
Archiving artifacts
TestNG Reports Processing: START
Looking for TestNG results report in workspace using pattern: **/target/surefire-reports/testng-results.xml,**/target/failsafe-reports/testng-results.xml
Saving reports...
Processing '/x1/jenkins/jenkins-home/jobs/Atlas-1.0-UnitTests/builds/903/testng/testng-results-1.xml'
Processing '/x1/jenkins/jenkins-home/jobs/Atlas-1.0-UnitTests/builds/903/testng/testng-results-2.xml'
Processing '/x1/jenkins/jenkins-home/jobs/Atlas-1.0-UnitTests/builds/903/testng/testng-results-3.xml'
Processing '/x1/jenkins/jenkins-home/jobs/Atlas-1.0-UnitTests/builds/903/testng/testng-results-4.xml'
Processing '/x1/jenkins/jenkins-home/jobs/Atlas-1.0-UnitTests/builds/903/testng/testng-results-5.xml'
Processing '/x1/jenkins/jenkins-home/jobs/Atlas-1.0-UnitTests/builds/903/testng/testng-results-6.xml'
Processing '/x1/jenkins/jenkins-home/jobs/Atlas-1.0-UnitTests/builds/903/testng/testng-results.xml'
TestNG Reports Processing: FINISH

Mime
View raw message