atlas-dev mailing list archives

Site index · List index
Message view « Date » · « Thread »
Top « Date » · « Thread »
From Apache Jenkins Server <jenk...@builds.apache.org>
Subject Build failed in Jenkins: Atlas-0.8-IntegrationTests #237
Date Thu, 16 Aug 2018 19:55:09 GMT
See <https://builds.apache.org/job/Atlas-0.8-IntegrationTests/237/display/redirect?page=changes>

Changes:

[madhan] ATLAS-2355/ATLAS-2362: Fix IT failures (branch-0.8) (picked from master

------------------------------------------
[...truncated 539.44 KB...]
127.0.0.1 - - [16/Aug/2018:19:50:30 +0000] "GET /api/atlas/v2/search/dsl?offset=0&query=Column+select+Column.name&limit=10
HTTP/1.1" 200 - "-" "Java/1.8.0_172"
127.0.0.1 - - [16/Aug/2018:19:50:31 +0000] "GET /api/atlas/v2/search/dsl?offset=0&query=Column+select+name&limit=10
HTTP/1.1" 200 - "-" "Java/1.8.0_172"
127.0.0.1 - - [16/Aug/2018:19:50:32 +0000] "GET /api/atlas/v2/search/dsl?offset=0&query=Column+where+Column.name%3D%22customer_id%22&limit=10
HTTP/1.1" 200 - "-" "Java/1.8.0_172"
127.0.0.1 - - [16/Aug/2018:19:50:33 +0000] "GET /api/atlas/v2/search/dsl?offset=0&query=from+Table+select+Table.name&limit=10
HTTP/1.1" 200 - "-" "Java/1.8.0_172"
127.0.0.1 - - [16/Aug/2018:19:50:34 +0000] "GET /api/atlas/v2/search/dsl?offset=0&query=DB+where+(name+%3D+%22Reporting%22)&limit=10
HTTP/1.1" 200 - "-" "Java/1.8.0_172"
127.0.0.1 - - [16/Aug/2018:19:50:35 +0000] "GET /api/atlas/v2/search/dsl?offset=0&query=DB+where+(name+%3D+%22Reporting%22)+select+name+as+_col_0,+owner+as+_col_1&limit=10
HTTP/1.1" 200 - "-" "Java/1.8.0_172"
127.0.0.1 - - [16/Aug/2018:19:50:36 +0000] "GET /api/atlas/v2/search/dsl?offset=0&query=DB+where+DB+is+JdbcAccess&limit=10
HTTP/1.1" 200 - "-" "Java/1.8.0_172"
127.0.0.1 - - [16/Aug/2018:19:50:37 +0000] "GET /api/atlas/v2/search/dsl?offset=0&query=DB+where+DB+has+name&limit=10
HTTP/1.1" 200 - "-" "Java/1.8.0_172"
127.0.0.1 - - [16/Aug/2018:19:50:38 +0000] "GET /api/atlas/v2/search/dsl?offset=0&query=DB+Table&limit=10
HTTP/1.1" 200 - "-" "Java/1.8.0_172"
127.0.0.1 - - [16/Aug/2018:19:50:38 +0000] "GET /api/atlas/v2/search/dsl?offset=0&query=DB+as+db1+Table+where+(db1.name+%3D+%22Reporting%22)&limit=10
HTTP/1.1" 200 - "-" "Java/1.8.0_172"
127.0.0.1 - - [16/Aug/2018:19:50:39 +0000] "GET /api/atlas/v2/search/dsl?offset=0&query=DB+where+(name+%3D+%22Reporting%22)+select+name+as+_col_0,+(createTime+%2B+1)+as+_col_1+&limit=10
HTTP/1.1" 200 - "-" "Java/1.8.0_172"
127.0.0.1 - - [16/Aug/2018:19:50:41 +0000] "GET /api/atlas/v2/search/dsl?offset=0&query=Dimension&limit=10
HTTP/1.1" 200 - "-" "Java/1.8.0_172"
127.0.0.1 - - [16/Aug/2018:19:50:41 +0000] "GET /api/atlas/v2/search/dsl?offset=0&query=JdbcAccess&limit=10
HTTP/1.1" 200 - "-" "Java/1.8.0_172"
127.0.0.1 - - [16/Aug/2018:19:50:42 +0000] "GET /api/atlas/v2/search/dsl?offset=0&query=ETL&limit=10
HTTP/1.1" 200 - "-" "Java/1.8.0_172"
127.0.0.1 - - [16/Aug/2018:19:50:43 +0000] "GET /api/atlas/v2/search/dsl?offset=0&query=Metric&limit=10
HTTP/1.1" 200 - "-" "Java/1.8.0_172"
127.0.0.1 - - [16/Aug/2018:19:50:44 +0000] "GET /api/atlas/v2/search/dsl?offset=0&query=PII&limit=10
HTTP/1.1" 200 - "-" "Java/1.8.0_172"
127.0.0.1 - - [16/Aug/2018:19:50:45 +0000] "GET /api/atlas/v2/search/dsl?offset=0&query=%60Log+Data%60&limit=10
HTTP/1.1" 200 - "-" "Java/1.8.0_172"
127.0.0.1 - - [16/Aug/2018:19:50:46 +0000] "GET /api/atlas/v2/search/dsl?offset=0&query=Table+where+name%3D%22sales_fact%22,+columns&limit=10
HTTP/1.1" 200 - "-" "Java/1.8.0_172"
127.0.0.1 - - [16/Aug/2018:19:50:46 +0000] "GET /api/atlas/v2/search/dsl?offset=0&query=Table+where+name%3D%22sales_fact%22,+columns+as+column+select+column.name,+column.dataType,+column.comment&limit=10
HTTP/1.1" 200 - "-" "Java/1.8.0_172"
127.0.0.1 - - [16/Aug/2018:19:50:48 +0000] "GET /api/atlas/v2/search/dsl?offset=0&query=from+DataSet&limit=10
HTTP/1.1" 200 - "-" "Java/1.8.0_172"
127.0.0.1 - - [16/Aug/2018:19:50:49 +0000] "GET /api/atlas/v2/search/dsl?offset=0&query=from+Process&limit=10
HTTP/1.1" 200 - "-" "Java/1.8.0_172"
127.0.0.1 - - [16/Aug/2018:19:50:49 +0000] "GET /api/atlas/v2/entity/uniqueAttribute/type/Table?attr:qualifiedName=sales_fact_daily_mv
HTTP/1.1" 200 - "-" "Java/1.8.0_172"
127.0.0.1 - - [16/Aug/2018:19:50:49 +0000] "GET /api/atlas/v2/lineage/5eab8545-81ee-4596-8dc1-40ce19b2426c?depth=0&direction=BOTH
HTTP/1.1" 200 - "-" "Java/1.8.0_172"
127.0.0.1 - - [16/Aug/2018:19:50:51 +0000] "GET /api/atlas/v2/entity/uniqueAttribute/type/DB?attr:name=Sales
HTTP/1.1" 200 - "-" "Java/1.8.0_172"
127.0.0.1 - - [16/Aug/2018:19:50:51 +0000] "GET /api/atlas/v2/entity/uniqueAttribute/type/Table?attr:qualifiedName=sales_fact
HTTP/1.1" 200 - "-" "Java/1.8.0_172"
127.0.0.1 - - [16/Aug/2018:19:50:51 +0000] "GET /api/atlas/v2/entity/uniqueAttribute/type/Table?attr:qualifiedName=time_dim
HTTP/1.1" 200 - "-" "Java/1.8.0_172"
127.0.0.1 - - [16/Aug/2018:19:50:51 +0000] "GET /api/atlas/v2/entity/uniqueAttribute/type/Table?attr:qualifiedName=sales_fact_daily_mv
HTTP/1.1" 200 - "-" "Java/1.8.0_172"
127.0.0.1 - - [16/Aug/2018:19:50:51 +0000] "GET /api/atlas/v2/entity/uniqueAttribute/type/Table?attr:qualifiedName=sales_fact_monthly_mv
HTTP/1.1" 200 - "-" "Java/1.8.0_172"
127.0.0.1 - - [16/Aug/2018:19:50:51 +0000] "GET /api/atlas/v2/entity/uniqueAttribute/type/LoadProcess?attr:qualifiedName=loadSalesDaily
HTTP/1.1" 200 - "-" "Java/1.8.0_172"
127.0.0.1 - - [16/Aug/2018:19:50:51 +0000] "GET /api/atlas/v2/entity/uniqueAttribute/type/LoadProcess?attr:qualifiedName=loadSalesMonthly
HTTP/1.1" 200 - "-" "Java/1.8.0_172"
127.0.0.1 - - [16/Aug/2018:19:50:51 +0000] "GET /api/atlas/v2/lineage/5eab8545-81ee-4596-8dc1-40ce19b2426c?depth=0&direction=BOTH
HTTP/1.1" 200 - "-" "Java/1.8.0_172"
127.0.0.1 - - [16/Aug/2018:19:50:53 +0000] "GET /api/atlas/v2/entity/uniqueAttribute/type/LoadProcess?attr:qualifiedName=loadSalesDaily
HTTP/1.1" 200 - "-" "Java/1.8.0_172"
127.0.0.1 - - [16/Aug/2018:19:50:53 +0000] "GET /api/atlas/v2/entity/uniqueAttribute/type/Table?attr:qualifiedName=sales_fact
HTTP/1.1" 200 - "-" "Java/1.8.0_172"
127.0.0.1 - - [16/Aug/2018:19:50:53 +0000] "GET /api/atlas/v2/entity/uniqueAttribute/type/Table?attr:qualifiedName=time_dim
HTTP/1.1" 200 - "-" "Java/1.8.0_172"
127.0.0.1 - - [16/Aug/2018:19:50:53 +0000] "GET /api/atlas/v2/entity/uniqueAttribute/type/Table?attr:qualifiedName=sales_fact_daily_mv
HTTP/1.1" 200 - "-" "Java/1.8.0_172"
127.0.0.1 - - [16/Aug/2018:19:50:53 +0000] "GET /api/atlas/v2/entity/uniqueAttribute/type/Table?attr:qualifiedName=sales_fact
HTTP/1.1" 200 - "-" "Java/1.8.0_172"
127.0.0.1 - - [16/Aug/2018:19:50:53 +0000] "GET /api/atlas/v2/entity/uniqueAttribute/type/DB?attr:name=Sales
HTTP/1.1" 200 - "-" "Java/1.8.0_172"
127.0.0.1 - - [16/Aug/2018:19:50:53 +0000] "GET /api/atlas/v2/entity/guid/c5aea7cf-fd4f-44fb-bcfc-bf7ab6a10349/classifications
HTTP/1.1" 200 - "-" "Java/1.8.0_172"
127.0.0.1 - - [16/Aug/2018:19:50:53 +0000] "GET /api/atlas/v2/entity/uniqueAttribute/type/View?attr:qualifiedName=product_dim_view
HTTP/1.1" 200 - "-" "Java/1.8.0_172"
127.0.0.1 - - [16/Aug/2018:19:50:53 +0000] "GET /api/atlas/v2/entity/uniqueAttribute/type/Table?attr:qualifiedName=product_dim
HTTP/1.1" 200 - "-" "Java/1.8.0_172"
127.0.0.1 - - [16/Aug/2018:19:50:53 +0000] "GET /api/atlas/v2/types/typedef/name/tableType
HTTP/1.1" 200 - "-" "Java/1.8.0_172"
127.0.0.1 - - [16/Aug/2018:19:50:53 +0000] "GET /api/atlas/v2/types/typedef/name/serdeType
HTTP/1.1" 200 - "-" "Java/1.8.0_172"
127.0.0.1 - - [16/Aug/2018:19:50:53 +0000] "GET /api/atlas/v2/types/typedef/name/classification
HTTP/1.1" 200 - "-" "Java/1.8.0_172"
127.0.0.1 - - [16/Aug/2018:19:50:54 +0000] "GET /api/atlas/v2/types/typedef/name/pii_Tag HTTP/1.1"
200 - "-" "Java/1.8.0_172"
127.0.0.1 - - [16/Aug/2018:19:50:54 +0000] "GET /api/atlas/v2/types/typedef/name/phi_Tag HTTP/1.1"
200 - "-" "Java/1.8.0_172"
127.0.0.1 - - [16/Aug/2018:19:50:54 +0000] "GET /api/atlas/v2/types/typedef/name/pci_Tag HTTP/1.1"
200 - "-" "Java/1.8.0_172"
127.0.0.1 - - [16/Aug/2018:19:50:54 +0000] "GET /api/atlas/v2/types/typedef/name/sox_Tag HTTP/1.1"
200 - "-" "Java/1.8.0_172"
127.0.0.1 - - [16/Aug/2018:19:50:54 +0000] "GET /api/atlas/v2/types/typedef/name/sec_Tag HTTP/1.1"
200 - "-" "Java/1.8.0_172"
127.0.0.1 - - [16/Aug/2018:19:50:54 +0000] "GET /api/atlas/v2/types/typedef/name/finance_Tag
HTTP/1.1" 200 - "-" "Java/1.8.0_172"
127.0.0.1 - - [16/Aug/2018:19:50:54 +0000] "GET /api/atlas/v2/types/typedef/name/FactID1oVx5wHf
HTTP/1.1" 404 - "-" "Java/1.8.0_172"
127.0.0.1 - - [16/Aug/2018:19:50:54 +0000] "GET /api/atlas/v2/types/typedef/name/ETLHp9bySNR2i
HTTP/1.1" 404 - "-" "Java/1.8.0_172"
127.0.0.1 - - [16/Aug/2018:19:50:54 +0000] "GET /api/atlas/v2/types/typedef/name/DimensionH9KVgreabJ
HTTP/1.1" 404 - "-" "Java/1.8.0_172"
127.0.0.1 - - [16/Aug/2018:19:50:54 +0000] "GET /api/atlas/v2/types/typedef/name/MetriceV6zb12jTp
HTTP/1.1" 404 - "-" "Java/1.8.0_172"
127.0.0.1 - - [16/Aug/2018:19:50:54 +0000] "GET /api/atlas/v2/types/typedef/name/hive_db_v1
HTTP/1.1" 200 - "-" "Java/1.8.0_172"
127.0.0.1 - - [16/Aug/2018:19:50:54 +0000] "GET /api/atlas/v2/types/typedef/name/hive_column_v1
HTTP/1.1" 200 - "-" "Java/1.8.0_172"
127.0.0.1 - - [16/Aug/2018:19:50:54 +0000] "GET /api/atlas/v2/types/typedef/name/hive_table_v1
HTTP/1.1" 200 - "-" "Java/1.8.0_172"
127.0.0.1 - - [16/Aug/2018:19:50:54 +0000] "GET /api/atlas/v2/types/typedef/name/hive_process_v1
HTTP/1.1" 200 - "-" "Java/1.8.0_172"
127.0.0.1 - - [16/Aug/2018:19:50:54 +0000] "POST /api/atlas/types HTTP/1.1" 201 - "-" "Java/1.8.0_172"
127.0.0.1 - - [16/Aug/2018:19:50:54 +0000] "GET /api/atlas/v2/types/typedef/name/Classification
HTTP/1.1" 200 - "-" "Java/1.8.0_172"
127.0.0.1 - - [16/Aug/2018:19:50:54 +0000] "GET /api/atlas/v2/types/typedef/name/dsl_test_type
HTTP/1.1" 200 - "-" "Java/1.8.0_172"
127.0.0.1 - - [16/Aug/2018:19:50:54 +0000] "POST /api/atlas/types HTTP/1.1" 201 - "-" "Java/1.8.0_172"
127.0.0.1 - - [16/Aug/2018:19:50:54 +0000] "POST /api/atlas/entities HTTP/1.1" 201 - "-" "Java/1.8.0_172"
127.0.0.1 - - [16/Aug/2018:19:50:54 +0000] "GET /api/atlas/discovery/search/dsl?query=from+hive_db_v1+name%3D%22dbrNY4x0mT8g%22
HTTP/1.1" 200 - "-" "Java/1.8.0_172"
127.0.0.1 - - [16/Aug/2018:19:50:55 +0000] "GET /api/atlas/discovery/search/dsl?query=from+hive_db_v1+name%3D%22dbrNY4x0mT8g%22&limit=10&offset=0
HTTP/1.1" 200 - "-" "Java/1.8.0_172"
127.0.0.1 - - [16/Aug/2018:19:50:55 +0000] "GET /api/atlas/discovery/search/dsl?query=from+hive_db_v1+name%3D%22dbrNY4x0mT8g%22&limit=-1&offset=-1
HTTP/1.1" 200 - "-" "Java/1.8.0_172"
127.0.0.1 - - [16/Aug/2018:19:50:56 +0000] "GET /api/atlas/discovery/search/dsl?query=from+hive_db_v1+name%3D%22dbrNY4x0mT8g%22&limit=1&offset=0
HTTP/1.1" 200 - "-" "Java/1.8.0_172"
127.0.0.1 - - [16/Aug/2018:19:50:57 +0000] "GET /api/atlas/discovery/search/dsl?query=from+hive_db_v1+name%3D%22dbrNY4x0mT8g%22&limit=10&offset=1
HTTP/1.1" 200 - "-" "Java/1.8.0_172"
127.0.0.1 - - [16/Aug/2018:19:50:58 +0000] "GET /api/atlas/discovery/search/dsl?query=from+hive_db_v1+name%3D%22dbrNY4x0mT8g%22&limit=0&offset=10
HTTP/1.1" 400 - "-" "Java/1.8.0_172"
127.0.0.1 - - [16/Aug/2018:19:50:58 +0000] "GET /api/atlas/discovery/search/dsl?query=from+hive_db_v1+name%3D%22dbrNY4x0mT8g%22&limit=2147483647&offset=10
HTTP/1.1" 400 - "-" "Java/1.8.0_172"
127.0.0.1 - - [16/Aug/2018:19:50:58 +0000] "GET /api/atlas/discovery/search/dsl?query=from+hive_db_v1+name%3D%22dbrNY4x0mT8g%22&limit=10&offset=-2
HTTP/1.1" 400 - "-" "Java/1.8.0_172"
127.0.0.1 - - [16/Aug/2018:19:50:58 +0000] "GET /api/atlas/discovery/search?query=* HTTP/1.1"
200 - "-" "Java/1.8.0_172"
127.0.0.1 - - [16/Aug/2018:19:50:58 +0000] "GET /api/atlas/discovery/search/dsl?query=from+hive_db_v1+name%3D%22dbrNY4x0mT8g%22
HTTP/1.1" 200 - "-" "Java/1.8.0_172"
127.0.0.1 - - [16/Aug/2018:19:50:58 +0000] "GET /api/atlas/discovery/search/gremlin?query=g.V.has('type',+'hive_table_v1').toList()
HTTP/1.1" 200 - "-" "Java/1.8.0_172"
127.0.0.1 - - [16/Aug/2018:19:50:59 +0000] "GET /api/atlas/discovery/search?query=from+hive_db_v1+name%3D%22dbrNY4x0mT8g%22
HTTP/1.1" 200 - "-" "Java/1.8.0_172"
127.0.0.1 - - [16/Aug/2018:19:51:00 +0000] "GET /api/atlas/discovery/search/dsl?query=from+blah
HTTP/1.1" 400 - "-" "Java/1.8.0_172"
127.0.0.1 - - [16/Aug/2018:19:51:00 +0000] "GET /api/atlas/discovery/search/fulltext?query=dbrNY4x0mT8g&limit=10&offset=0
HTTP/1.1" 200 - "-" "Java/1.8.0_172"
127.0.0.1 - - [16/Aug/2018:19:51:00 +0000] "GET /api/atlas/discovery/search/fulltext?query=dbrNY4x0mT8g
HTTP/1.1" 200 - "-" "Java/1.8.0_172"
127.0.0.1 - - [16/Aug/2018:19:51:00 +0000] "GET /api/atlas/discovery/search/fulltext?query=dbrNY4x0mT8g&limit=10&offset=0
HTTP/1.1" 200 - "-" "Java/1.8.0_172"
127.0.0.1 - - [16/Aug/2018:19:51:00 +0000] "GET /api/atlas/discovery/search/fulltext?query=dbrNY4x0mT8g&limit=10&offset=1
HTTP/1.1" 200 - "-" "Java/1.8.0_172"
127.0.0.1 - - [16/Aug/2018:19:51:00 +0000] "GET /api/atlas/discovery/search/fulltext?query=dbrNY4x0mT8g&limit=1&offset=0
HTTP/1.1" 200 - "-" "Java/1.8.0_172"
127.0.0.1 - - [16/Aug/2018:19:51:00 +0000] "GET /api/atlas/discovery/search/fulltext?query=dbrNY4x0mT8g&limit=1&offset=2
HTTP/1.1" 200 - "-" "Java/1.8.0_172"
Tests run: 134, Failures: 2, Errors: 0, Skipped: 1, Time elapsed: 206.603 sec <<<
FAILURE! - in TestSuite
testCreate(org.apache.atlas.web.integration.TypedefsJerseyResourceIT)  Time elapsed: 0.145
sec  <<< FAILURE!
org.apache.atlas.AtlasServiceException: Metadata service API org.apache.atlas.AtlasBaseClient$API@602b0635
failed with status 404 (Not Found) Response Body ({"errorCode":"ATLAS-404-00-001","errorMessage":"Given
typename fetl was invalid"})
	at org.apache.atlas.AtlasBaseClient.callAPIWithResource(AtlasBaseClient.java:411)
	at org.apache.atlas.AtlasBaseClient.callAPIWithResource(AtlasBaseClient.java:340)
	at org.apache.atlas.AtlasBaseClient.callAPI(AtlasBaseClient.java:252)
	at org.apache.atlas.AtlasClientV2.getTypeDefByName(AtlasClientV2.java:409)
	at org.apache.atlas.AtlasClientV2.getClassificationDefByName(AtlasClientV2.java:158)
	at org.apache.atlas.web.integration.TypedefsJerseyResourceIT.testCreate(TypedefsJerseyResourceIT.java:95)

testDiscoveryWithSearchParameters(org.apache.atlas.web.integration.BasicSearchIT)  Time elapsed:
0.467 sec  <<< FAILURE!
java.lang.AssertionError: jsonFile: search-parameters/entity-filters, description: hive_table:
name != 'dummy /Table_1@0'; result=[AtlasEntityHeader{guid='ec912e0c-6e62-4045-8299-9fa6245a1468',
status=ACTIVE, displayText=testtable_1, classificationNames=[], classifications=[], AtlasStruct{typeName='hive_table',
attributes=[owner:hdfs, createTime:1491248909000, qualifiedName:default.testtable_1@cl1, name:testtable_1]}},
AtlasEntityHeader{guid='d9c3a723-9920-4185-a88f-b21c466bb5f2', status=ACTIVE, displayText=stocks_daily,
classificationNames=[], classifications=[], AtlasStruct{typeName='hive_table', attributes=[owner:anonymous,
createTime:1528318571000, qualifiedName:stocks.stocks_daily@cl1, name:stocks_daily]}}, AtlasEntityHeader{guid='c54400d8-79b7-45ba-9c01-b662b36ceb0e',
status=ACTIVE, displayText=stocks_view, classificationNames=[], classifications=[], AtlasStruct{typeName='hive_table',
attributes=[owner:anonymous, createTime:1529605199000, qualifiedName:stocks.stocks_view@cl1,
name:stocks_view]}}, AtlasEntityHeader{guid='9df08fe3-4768-4d40-bc34-72e98de6b693', status=ACTIVE,
displayText=testtable_3, classificationNames=[], classifications=[], AtlasStruct{typeName='hive_table',
attributes=[owner:hdfs, createTime:1491248911000, qualifiedName:default.testtable_3@cl1, name:testtable_3]}},
AtlasEntityHeader{guid='39c1be76-23f7-4ec5-a0fc-bb25fb570c29', status=ACTIVE, displayText=stocks_yearly,
classificationNames=[], classifications=[], AtlasStruct{typeName='hive_table', attributes=[owner:anonymous,
createTime:1528318626000, qualifiedName:stocks.stocks_yearly@cl1, name:stocks_yearly]}}, AtlasEntityHeader{guid='d4105d01-07a5-46e4-988f-1ab60177fb65',
status=ACTIVE, displayText=testtable_0, classificationNames=[], classifications=[], AtlasStruct{typeName='hive_table',
attributes=[owner:hdfs, createTime:1491248907000, qualifiedName:default.testtable_0@cl1, name:testtable_0]}}]
expected [3] but found [6]
	at org.testng.Assert.fail(Assert.java:94)
	at org.testng.Assert.failNotEquals(Assert.java:496)
	at org.testng.Assert.assertEquals(Assert.java:125)
	at org.testng.Assert.assertEquals(Assert.java:372)
	at org.apache.atlas.web.integration.BasicSearchIT.testDiscoveryWithSearchParameters(BasicSearchIT.java:127)


Results :

Failed tests: 
org.apache.atlas.web.integration.BasicSearchIT.testDiscoveryWithSearchParameters(org.apache.atlas.web.integration.BasicSearchIT)
  Run 1: BasicSearchIT.testDiscoveryWithSearchParameters:127 jsonFile: search-parameters/entity-filters,
description: hive_table: name != 'dummy /Table_1@0'; result=[AtlasEntityHeader{guid='ec912e0c-6e62-4045-8299-9fa6245a1468',
status=ACTIVE, displayText=testtable_1, classificationNames=[], classifications=[], AtlasStruct{typeName='hive_table',
attributes=[owner:hdfs, createTime:1491248909000, qualifiedName:default.testtable_1@cl1, name:testtable_1]}},
AtlasEntityHeader{guid='d9c3a723-9920-4185-a88f-b21c466bb5f2', status=ACTIVE, displayText=stocks_daily,
classificationNames=[], classifications=[], AtlasStruct{typeName='hive_table', attributes=[owner:anonymous,
createTime:1528318571000, qualifiedName:stocks.stocks_daily@cl1, name:stocks_daily]}}, AtlasEntityHeader{guid='c54400d8-79b7-45ba-9c01-b662b36ceb0e',
status=ACTIVE, displayText=stocks_view, classificationNames=[], classifications=[], AtlasStruct{typeName='hive_table',
attributes=[owner:anonymous, createTime:1529605199000, qualifiedName:stocks.stocks_view@cl1,
name:stocks_view]}}, AtlasEntityHeader{guid='9df08fe3-4768-4d40-bc34-72e98de6b693', status=ACTIVE,
displayText=testtable_3, classificationNames=[], classifications=[], AtlasStruct{typeName='hive_table',
attributes=[owner:hdfs, createTime:1491248911000, qualifiedName:default.testtable_3@cl1, name:testtable_3]}},
AtlasEntityHeader{guid='39c1be76-23f7-4ec5-a0fc-bb25fb570c29', status=ACTIVE, displayText=stocks_yearly,
classificationNames=[], classifications=[], AtlasStruct{typeName='hive_table', attributes=[owner:anonymous,
createTime:1528318626000, qualifiedName:stocks.stocks_yearly@cl1, name:stocks_yearly]}}, AtlasEntityHeader{guid='d4105d01-07a5-46e4-988f-1ab60177fb65',
status=ACTIVE, displayText=testtable_0, classificationNames=[], classifications=[], AtlasStruct{typeName='hive_table',
attributes=[owner:hdfs, createTime:1491248907000, qualifiedName:default.testtable_0@cl1, name:testtable_0]}}]
expected [3] but found [6]
  Run 2: PASS
  Run 3: PASS

  TypedefsJerseyResourceIT.testCreate:95 » AtlasService Metadata service API org...

Tests run: 132, Failures: 2, Errors: 0, Skipped: 1

[INFO] 
[INFO] --- jetty-maven-plugin:9.2.12.v20150709:stop (stop-jetty) @ atlas-webapp ---
[INFO] Waiting 10 seconds for jetty to stop
[INFO] Stopped ServerConnector@3f3e7b5c{HTTP/1.1}{0.0.0.0:31000}
[INFO] Closing Spring root WebApplicationContext
[INFO] Shutting down log4j
[INFO] Not cleaning cached beans: no such field javax.el.BeanELResolver.properties
[INFO] Stopped o.e.j.m.p.JettyWebAppContext@261d4138{/,<https://builds.apache.org/job/Atlas-0.8-IntegrationTests/ws/webapp/target/atlas-webapp-0.8.3-SNAPSHOT/,UNAVAILABLE}{/home/jenkins/jenkins-slave/workspace/Atlas-0.8-IntegrationTests/webapp/target/atlas-webapp-0.8.3-SNAPSHOT.war}>
[INFO] Server reports itself as stopped
[INFO] 
[INFO] --- maven-source-plugin:2.4:jar-no-fork (attach-sources) @ atlas-webapp ---
[INFO] Building jar: <https://builds.apache.org/job/Atlas-0.8-IntegrationTests/ws/webapp/target/atlas-webapp-0.8.3-SNAPSHOT-sources.jar>
[INFO] 
[INFO] --- maven-source-plugin:2.4:test-jar-no-fork (attach-sources) @ atlas-webapp ---
[INFO] Building jar: <https://builds.apache.org/job/Atlas-0.8-IntegrationTests/ws/webapp/target/atlas-webapp-0.8.3-SNAPSHOT-test-sources.jar>
[INFO] 
[INFO] --- maven-failsafe-plugin:2.18.1:verify (verify) @ atlas-webapp ---
[INFO] Failsafe report directory: <https://builds.apache.org/job/Atlas-0.8-IntegrationTests/ws/webapp/target/failsafe-reports>
[INFO] ------------------------------------------------------------------------
[INFO] Reactor Summary:
[INFO] 
[INFO] Apache Atlas Server Build Tools 1.0 ................ SUCCESS [  0.664 s]
[INFO] apache-atlas 0.8.3-SNAPSHOT ........................ SUCCESS [  3.778 s]
[INFO] Apache Atlas Integration ........................... SUCCESS [ 18.869 s]
[INFO] Apache Atlas Common ................................ SUCCESS [  7.767 s]
[INFO] Apache Atlas Typesystem ............................ SUCCESS [ 46.182 s]
[INFO] Apache Atlas Client ................................ SUCCESS [  0.654 s]
[INFO] atlas-client-common ................................ SUCCESS [  6.774 s]
[INFO] atlas-client-v1 .................................... SUCCESS [  7.023 s]
[INFO] Apache Atlas Server API ............................ SUCCESS [  5.892 s]
[INFO] Apache Atlas Notification .......................... SUCCESS [ 10.100 s]
[INFO] atlas-client-v2 .................................... SUCCESS [  5.517 s]
[INFO] Apache Atlas Graph Database Projects ............... SUCCESS [  0.482 s]
[INFO] Apache Atlas Graph Database API .................... SUCCESS [  5.061 s]
[INFO] Graph Database Common Code ......................... SUCCESS [  5.402 s]
[INFO] Apache Atlas Titan 1.0.0 GraphDB Impl .............. SUCCESS [ 36.700 s]
[INFO] Shaded version of Apache hbase client .............. SUCCESS [  8.556 s]
[INFO] Apache Atlas Titan 0.5.4 Graph DB Impl ............. SUCCESS [ 36.270 s]
[INFO] Apache Atlas Graph Database Implementation Dependencies SUCCESS [  0.808 s]
[INFO] Shaded version of Apache hbase server .............. SUCCESS [ 23.259 s]
[INFO] Apache Atlas Repository ............................ SUCCESS [01:16 min]
[INFO] Apache Atlas Authorization ......................... SUCCESS [  6.610 s]
[INFO] Apache Atlas Business Catalog ...................... SUCCESS [ 10.203 s]
[INFO] Apache Atlas UI .................................... SUCCESS [01:22 min]
[INFO] Apache Atlas Web Application ....................... FAILURE [04:59 min]
[INFO] Apache Atlas Documentation ......................... SKIPPED
[INFO] Apache Atlas FileSystem Model ...................... SKIPPED
[INFO] Apache Atlas Plugin Classloader .................... SKIPPED
[INFO] Apache Atlas Hive Bridge Shim ...................... SKIPPED
[INFO] Apache Atlas Hive Bridge ........................... SKIPPED
[INFO] Apache Atlas Falcon Bridge Shim .................... SKIPPED
[INFO] Apache Atlas Falcon Bridge ......................... SKIPPED
[INFO] Apache Atlas Sqoop Bridge Shim ..................... SKIPPED
[INFO] Apache Atlas Sqoop Bridge .......................... SKIPPED
[INFO] Apache Atlas Storm Bridge Shim ..................... SKIPPED
[INFO] Apache Atlas Storm Bridge .......................... SKIPPED
[INFO] Apache Atlas Hbase Bridge Shim ..................... SKIPPED
[INFO] Apache Atlas Hbase Bridge .......................... SKIPPED
[INFO] Apache Atlas Migration Exporter .................... SKIPPED
[INFO] Apache Atlas Distribution 0.8.3-SNAPSHOT ........... SKIPPED
[INFO] ------------------------------------------------------------------------
[INFO] BUILD FAILURE
[INFO] ------------------------------------------------------------------------
[INFO] Total time: 11:46 min
[INFO] Finished at: 2018-08-16T19:51:05Z
[INFO] ------------------------------------------------------------------------
[ERROR] Failed to execute goal org.apache.maven.plugins:maven-failsafe-plugin:2.18.1:verify
(verify) on project atlas-webapp: There are test failures.
[ERROR] 
[ERROR] Please refer to <https://builds.apache.org/job/Atlas-0.8-IntegrationTests/ws/webapp/target/failsafe-reports>
for the individual test results.
[ERROR] -> [Help 1]
[ERROR] 
[ERROR] To see the full stack trace of the errors, re-run Maven with the -e switch.
[ERROR] Re-run Maven using the -X switch to enable full debug logging.
[ERROR] 
[ERROR] For more information about the errors and possible solutions, please read the following
articles:
[ERROR] [Help 1] http://cwiki.apache.org/confluence/display/MAVEN/MojoFailureException
[ERROR] 
[ERROR] After correcting the problems, you can resume the build with the command
[ERROR]   mvn <goals> -rf :atlas-webapp
Build step 'Execute shell' marked build as failure
[CHECKSTYLE] Collecting checkstyle analysis files...
[CHECKSTYLE] Searching for all files in <https://builds.apache.org/job/Atlas-0.8-IntegrationTests/ws/>
that match the pattern **/target/checkstyle-result.xml
[CHECKSTYLE] Parsing 22 files in <https://builds.apache.org/job/Atlas-0.8-IntegrationTests/ws/>
[CHECKSTYLE] Successfully parsed file <https://builds.apache.org/job/Atlas-0.8-IntegrationTests/ws/authorization/target/checkstyle-result.xml>
with 471 unique warnings and 0 duplicates.
[CHECKSTYLE] Successfully parsed file <https://builds.apache.org/job/Atlas-0.8-IntegrationTests/ws/catalog/target/checkstyle-result.xml>
with 2608 unique warnings and 0 duplicates.
[CHECKSTYLE] Successfully parsed file <https://builds.apache.org/job/Atlas-0.8-IntegrationTests/ws/client/client-v1/target/checkstyle-result.xml>
with 3484 unique warnings and 0 duplicates.
[CHECKSTYLE] Successfully parsed file <https://builds.apache.org/job/Atlas-0.8-IntegrationTests/ws/client/client-v2/target/checkstyle-result.xml>
with 3814 unique warnings and 0 duplicates.
[CHECKSTYLE] Successfully parsed file <https://builds.apache.org/job/Atlas-0.8-IntegrationTests/ws/client/common/target/checkstyle-result.xml>
with 4337 unique warnings and 0 duplicates.
[CHECKSTYLE] Successfully parsed file <https://builds.apache.org/job/Atlas-0.8-IntegrationTests/ws/client/target/checkstyle-result.xml>
with 4337 unique warnings and 0 duplicates.
[CHECKSTYLE] Successfully parsed file <https://builds.apache.org/job/Atlas-0.8-IntegrationTests/ws/common/target/checkstyle-result.xml>
with 5299 unique warnings and 0 duplicates.
[CHECKSTYLE] Successfully parsed file <https://builds.apache.org/job/Atlas-0.8-IntegrationTests/ws/dashboardv2/target/checkstyle-result.xml>
with 5299 unique warnings and 0 duplicates.
[CHECKSTYLE] Successfully parsed file <https://builds.apache.org/job/Atlas-0.8-IntegrationTests/ws/graphdb/api/target/checkstyle-result.xml>
with 5572 unique warnings and 0 duplicates.
[CHECKSTYLE] Successfully parsed file <https://builds.apache.org/job/Atlas-0.8-IntegrationTests/ws/graphdb/common/target/checkstyle-result.xml>
with 5759 unique warnings and 0 duplicates.
[CHECKSTYLE] Successfully parsed file <https://builds.apache.org/job/Atlas-0.8-IntegrationTests/ws/graphdb/graphdb-impls/target/checkstyle-result.xml>
with 5759 unique warnings and 0 duplicates.
[CHECKSTYLE] Successfully parsed file <https://builds.apache.org/job/Atlas-0.8-IntegrationTests/ws/graphdb/target/checkstyle-result.xml>
with 5759 unique warnings and 0 duplicates.
[CHECKSTYLE] Successfully parsed file <https://builds.apache.org/job/Atlas-0.8-IntegrationTests/ws/graphdb/titan0/target/checkstyle-result.xml>
with 8214 unique warnings and 0 duplicates.
[CHECKSTYLE] Successfully parsed file <https://builds.apache.org/job/Atlas-0.8-IntegrationTests/ws/graphdb/titan1/target/checkstyle-result.xml>
with 9181 unique warnings and 0 duplicates.
[CHECKSTYLE] Successfully parsed file <https://builds.apache.org/job/Atlas-0.8-IntegrationTests/ws/intg/target/checkstyle-result.xml>
with 16320 unique warnings and 0 duplicates.
[CHECKSTYLE] Successfully parsed file <https://builds.apache.org/job/Atlas-0.8-IntegrationTests/ws/notification/target/checkstyle-result.xml>
with 18077 unique warnings and 0 duplicates.
[CHECKSTYLE] Successfully parsed file <https://builds.apache.org/job/Atlas-0.8-IntegrationTests/ws/repository/target/checkstyle-result.xml>
with 38301 unique warnings and 0 duplicates.
[CHECKSTYLE] Successfully parsed file <https://builds.apache.org/job/Atlas-0.8-IntegrationTests/ws/server-api/target/checkstyle-result.xml>
with 38693 unique warnings and 0 duplicates.
[CHECKSTYLE] Successfully parsed file <https://builds.apache.org/job/Atlas-0.8-IntegrationTests/ws/shaded/hbase-client-shaded/target/checkstyle-result.xml>
with 38693 unique warnings and 0 duplicates.
[CHECKSTYLE] Successfully parsed file <https://builds.apache.org/job/Atlas-0.8-IntegrationTests/ws/shaded/hbase-server-shaded/target/checkstyle-result.xml>
with 38693 unique warnings and 0 duplicates.
[CHECKSTYLE] Successfully parsed file <https://builds.apache.org/job/Atlas-0.8-IntegrationTests/ws/target/checkstyle-result.xml>
with 38693 unique warnings and 0 duplicates.
[CHECKSTYLE] Successfully parsed file <https://builds.apache.org/job/Atlas-0.8-IntegrationTests/ws/typesystem/target/checkstyle-result.xml>
with 42934 unique warnings and 0 duplicates.
<Git Blamer> Using GitBlamer to create author and commit information for all warnings.
<Git Blamer> GIT_COMMIT=9da91296f4e5637c35d78649f16ed23ebecf8b09, workspace=<https://builds.apache.org/job/Atlas-0.8-IntegrationTests/ws/>
 > git rev-parse 9da91296f4e5637c35d78649f16ed23ebecf8b09^{commit} # timeout=10
<Git Blamer> Skipping file <https://builds.apache.org/job/Atlas-0.8-IntegrationTests/ws/typesystem/src/main/java/org/apache/atlas/typesystem/IStruct.java,>
no result found.
[FINDBUGS] Collecting findbugs analysis files...
[FINDBUGS] Searching for all files in <https://builds.apache.org/job/Atlas-0.8-IntegrationTests/ws/>
that match the pattern **/target/findbugs.xml
[FINDBUGS] Parsing 15 files in <https://builds.apache.org/job/Atlas-0.8-IntegrationTests/ws/>
[FINDBUGS] Successfully parsed file <https://builds.apache.org/job/Atlas-0.8-IntegrationTests/ws/authorization/target/findbugs.xml>
with 0 unique warnings and 0 duplicates.
[FINDBUGS] Successfully parsed file <https://builds.apache.org/job/Atlas-0.8-IntegrationTests/ws/catalog/target/findbugs.xml>
with 0 unique warnings and 0 duplicates.
[FINDBUGS] Successfully parsed file <https://builds.apache.org/job/Atlas-0.8-IntegrationTests/ws/client/client-v1/target/findbugs.xml>
with 0 unique warnings and 0 duplicates.
[FINDBUGS] Successfully parsed file <https://builds.apache.org/job/Atlas-0.8-IntegrationTests/ws/client/client-v2/target/findbugs.xml>
with 0 unique warnings and 0 duplicates.
[FINDBUGS] Successfully parsed file <https://builds.apache.org/job/Atlas-0.8-IntegrationTests/ws/client/common/target/findbugs.xml>
with 0 unique warnings and 0 duplicates.
[FINDBUGS] Successfully parsed file <https://builds.apache.org/job/Atlas-0.8-IntegrationTests/ws/common/target/findbugs.xml>
with 0 unique warnings and 0 duplicates.
[FINDBUGS] Successfully parsed file <https://builds.apache.org/job/Atlas-0.8-IntegrationTests/ws/graphdb/api/target/findbugs.xml>
with 0 unique warnings and 0 duplicates.
[FINDBUGS] Successfully parsed file <https://builds.apache.org/job/Atlas-0.8-IntegrationTests/ws/graphdb/common/target/findbugs.xml>
with 0 unique warnings and 0 duplicates.
[FINDBUGS] Successfully parsed file <https://builds.apache.org/job/Atlas-0.8-IntegrationTests/ws/graphdb/titan0/target/findbugs.xml>
with 0 unique warnings and 0 duplicates.
[FINDBUGS] Successfully parsed file <https://builds.apache.org/job/Atlas-0.8-IntegrationTests/ws/graphdb/titan1/target/findbugs.xml>
with 0 unique warnings and 0 duplicates.
[FINDBUGS] Successfully parsed file <https://builds.apache.org/job/Atlas-0.8-IntegrationTests/ws/intg/target/findbugs.xml>
with 0 unique warnings and 0 duplicates.
[FINDBUGS] Successfully parsed file <https://builds.apache.org/job/Atlas-0.8-IntegrationTests/ws/notification/target/findbugs.xml>
with 0 unique warnings and 0 duplicates.
[FINDBUGS] Successfully parsed file <https://builds.apache.org/job/Atlas-0.8-IntegrationTests/ws/repository/target/findbugs.xml>
with 0 unique warnings and 0 duplicates.
[FINDBUGS] Successfully parsed file <https://builds.apache.org/job/Atlas-0.8-IntegrationTests/ws/server-api/target/findbugs.xml>
with 0 unique warnings and 0 duplicates.
[FINDBUGS] Successfully parsed file <https://builds.apache.org/job/Atlas-0.8-IntegrationTests/ws/typesystem/target/findbugs.xml>
with 0 unique warnings and 0 duplicates.
<Git Blamer> Using GitBlamer to create author and commit information for all warnings.
<Git Blamer> GIT_COMMIT=9da91296f4e5637c35d78649f16ed23ebecf8b09, workspace=<https://builds.apache.org/job/Atlas-0.8-IntegrationTests/ws/>
Archiving artifacts
[Fast Archiver] No prior successful build to compare, so performing full copy of artifacts
TestNG Reports Processing: START
Looking for TestNG results report in workspace using pattern: **/target/surefire-reports/testng-results.xml,**/target/failsafe-reports/testng-results.xml
Saving reports...
Processing '/x1/jenkins/jenkins-home/jobs/Atlas-0.8-IntegrationTests/builds/237/testng/testng-results.xml'
1.492537% of tests failed, which exceeded threshold of 0%. Marking build as UNSTABLE
TestNG Reports Processing: FINISH

Mime
View raw message