atlas-dev mailing list archives

Site index · List index
Message view « Date » · « Thread »
Top « Date » · « Thread »
From Apache Jenkins Server <jenk...@builds.apache.org>
Subject Build failed in Jenkins: Atlas-1.0-IntegrationTests #887
Date Mon, 27 Aug 2018 02:58:23 GMT
See <https://builds.apache.org/job/Atlas-1.0-IntegrationTests/887/display/redirect?page=changes>

Changes:

[madhan] ATLAS-2836: Remove redundant encoding of vertex property keys - #2

------------------------------------------
[...truncated 581.56 KB...]
127.0.0.1 - - [27/Aug/2018:02:48:59 +0000] "GET //localhost:31000/api/atlas/v2/entity/uniqueAttribute/type/hive_process?attr:qualifiedName=QUERY:default.table28yqujn5ds@primary:1535338132000:default.tablebiccgdqjzr@primary:1535338131000-%3E:INSERT:default.table5pldicgtu5@primary:1535338132000
HTTP/1.1" 404 277 "-" "Java/1.8.0_172"
127.0.0.1 - - [27/Aug/2018:02:49:04 +0000] "GET //localhost:31000/api/atlas/v2/entity/uniqueAttribute/type/hive_process?attr:qualifiedName=QUERY:default.table28yqujn5ds@primary:1535338132000:default.tablebiccgdqjzr@primary:1535338131000-%3E:INSERT:default.table5pldicgtu5@primary:1535338132000
HTTP/1.1" 200 3025 "-" "Java/1.8.0_172"
127.0.0.1 - - [27/Aug/2018:02:49:04 +0000] "GET //localhost:31000/api/atlas/v2/entity/uniqueAttribute/type/hive_process?attr:qualifiedName=QUERY:default.table28yqujn5ds@primary:1535338132000:default.tablebiccgdqjzr@primary:1535338131000-%3E:INSERT:default.table5pldicgtu5@primary:1535338132000
HTTP/1.1" 200 3025 "-" "Java/1.8.0_172"
127.0.0.1 - - [27/Aug/2018:02:49:04 +0000] "GET //localhost:31000/api/atlas/v2/entity/guid/0ffaac33-9b18-4826-bed4-88164c983a59
HTTP/1.1" 200 3025 "-" "Java/1.8.0_172"
127.0.0.1 - - [27/Aug/2018:02:49:04 +0000] "GET //localhost:31000/api/atlas/v2/entity/guid/4590ad3e-0905-441a-8662-cd66aca815a3
HTTP/1.1" 200 5562 "-" "Java/1.8.0_172"
127.0.0.1 - - [27/Aug/2018:02:49:04 +0000] "GET //localhost:31000/api/atlas/v2/entity/guid/101de489-0a9a-4b70-8dc9-b3629e70aa35
HTTP/1.1" 200 6348 "-" "Java/1.8.0_172"
127.0.0.1 - - [27/Aug/2018:02:49:04 +0000] "GET //localhost:31000/api/atlas/v2/entity/guid/f2b6fc73-b1cd-41a2-8da0-b832d05c506d
HTTP/1.1" 200 6351 "-" "Java/1.8.0_172"
127.0.0.1 - - [27/Aug/2018:02:49:07 +0000] "GET //localhost:31000/api/atlas/v2/entity/uniqueAttribute/type/hive_process?attr:qualifiedName=QUERY:default.table28yqujn5ds@primary:1535338132000:default.tablebiccgdqjzr@primary:1535338131000-%3E:INSERT:default.table5pldicgtu5@primary:1535338132000
HTTP/1.1" 200 3025 "-" "Java/1.8.0_172"
127.0.0.1 - - [27/Aug/2018:02:49:07 +0000] "GET //localhost:31000/api/atlas/v2/entity/uniqueAttribute/type/hive_process?attr:qualifiedName=QUERY:default.table28yqujn5ds@primary:1535338132000:default.tablebiccgdqjzr@primary:1535338131000-%3E:INSERT:default.table5pldicgtu5@primary:1535338132000
HTTP/1.1" 200 3025 "-" "Java/1.8.0_172"
127.0.0.1 - - [27/Aug/2018:02:49:07 +0000] "GET //localhost:31000/api/atlas/v2/entity/guid/0ffaac33-9b18-4826-bed4-88164c983a59
HTTP/1.1" 200 3025 "-" "Java/1.8.0_172"
127.0.0.1 - - [27/Aug/2018:02:49:07 +0000] "GET //localhost:31000/api/atlas/v2/entity/guid/4590ad3e-0905-441a-8662-cd66aca815a3
HTTP/1.1" 200 5562 "-" "Java/1.8.0_172"
127.0.0.1 - - [27/Aug/2018:02:49:07 +0000] "GET //localhost:31000/api/atlas/v2/entity/guid/101de489-0a9a-4b70-8dc9-b3629e70aa35
HTTP/1.1" 200 6348 "-" "Java/1.8.0_172"
127.0.0.1 - - [27/Aug/2018:02:49:07 +0000] "GET //localhost:31000/api/atlas/v2/entity/guid/f2b6fc73-b1cd-41a2-8da0-b832d05c506d
HTTP/1.1" 200 6351 "-" "Java/1.8.0_172"
127.0.0.1 - - [27/Aug/2018:02:49:10 +0000] "GET //localhost:31000/api/atlas/v2/entity/uniqueAttribute/type/hive_table?attr:qualifiedName=default.tablejwkitaiaxd@primary
HTTP/1.1" 200 5180 "-" "Java/1.8.0_172"
127.0.0.1 - - [27/Aug/2018:02:49:10 +0000] "GET //localhost:31000/api/atlas/v2/entity/uniqueAttribute/type/hive_table?attr:qualifiedName=default.tablejwkitaiaxd@primary
HTTP/1.1" 200 5180 "-" "Java/1.8.0_172"
127.0.0.1 - - [27/Aug/2018:02:49:10 +0000] "GET //localhost:31000/api/atlas/v2/entity/uniqueAttribute/type/hive_table?attr:qualifiedName=dbqprup5ugqr.table4uf1xlylyw@primary
HTTP/1.1" 404 159 "-" "Java/1.8.0_172"
127.0.0.1 - - [27/Aug/2018:02:49:15 +0000] "GET //localhost:31000/api/atlas/v2/entity/uniqueAttribute/type/hive_table?attr:qualifiedName=dbqprup5ugqr.table4uf1xlylyw@primary
HTTP/1.1" 200 5623 "-" "Java/1.8.0_172"
127.0.0.1 - - [27/Aug/2018:02:49:15 +0000] "GET //localhost:31000/api/atlas/v2/entity/uniqueAttribute/type/hive_table?attr:qualifiedName=dbqprup5ugqr.table4uf1xlylyw@primary
HTTP/1.1" 200 5623 "-" "Java/1.8.0_172"
127.0.0.1 - - [27/Aug/2018:02:49:15 +0000] "GET //localhost:31000/api/atlas/v2/lineage/cb0ffc4b-357b-41a1-8e7a-237351501afb?depth=0&direction=INPUT
HTTP/1.1" 200 1619 "-" "Java/1.8.0_172"
127.0.0.1 - - [27/Aug/2018:02:49:16 +0000] "GET //localhost:31000/api/atlas/v2/lineage/e9d60063-e5d7-4bdf-8a1c-594bdf63d290?depth=0&direction=OUTPUT
HTTP/1.1" 200 1620 "-" "Java/1.8.0_172"
127.0.0.1 - - [27/Aug/2018:02:49:18 +0000] "GET //localhost:31000/api/atlas/v2/entity/uniqueAttribute/type/hive_table?attr:qualifiedName=default.table1asbok6tep@primary
HTTP/1.1" 404 154 "-" "Java/1.8.0_172"
127.0.0.1 - - [27/Aug/2018:02:49:23 +0000] "GET //localhost:31000/api/atlas/v2/entity/uniqueAttribute/type/hive_table?attr:qualifiedName=default.table1asbok6tep@primary
HTTP/1.1" 200 6914 "-" "Java/1.8.0_172"
127.0.0.1 - - [27/Aug/2018:02:49:23 +0000] "GET //localhost:31000/api/atlas/v2/entity/uniqueAttribute/type/hive_table?attr:qualifiedName=default.table1asbok6tep@primary
HTTP/1.1" 200 6914 "-" "Java/1.8.0_172"
127.0.0.1 - - [27/Aug/2018:02:49:23 +0000] "GET //localhost:31000/api/atlas/v2/entity/uniqueAttribute/type/hive_process?attr:qualifiedName=LOAD-%3E:default.table1asbok6tep@primary:1535338157000
HTTP/1.1" 404 177 "-" "Java/1.8.0_172"
127.0.0.1 - - [27/Aug/2018:02:49:28 +0000] "GET //localhost:31000/api/atlas/v2/entity/uniqueAttribute/type/hive_process?attr:qualifiedName=LOAD-%3E:default.table1asbok6tep@primary:1535338157000
HTTP/1.1" 200 2129 "-" "Java/1.8.0_172"
127.0.0.1 - - [27/Aug/2018:02:49:28 +0000] "GET //localhost:31000/api/atlas/v2/entity/uniqueAttribute/type/hive_process?attr:qualifiedName=LOAD-%3E:default.table1asbok6tep@primary:1535338157000
HTTP/1.1" 200 2129 "-" "Java/1.8.0_172"
127.0.0.1 - - [27/Aug/2018:02:49:28 +0000] "GET //localhost:31000/api/atlas/v2/entity/guid/ee762fe4-cf5a-4fea-b65c-a9b07c9ce98e
HTTP/1.1" 200 2129 "-" "Java/1.8.0_172"
127.0.0.1 - - [27/Aug/2018:02:49:28 +0000] "GET //localhost:31000/api/atlas/v2/entity/guid/f6c64137-3969-4a21-b39c-740d68a81b08
HTTP/1.1" 200 1442 "-" "Java/1.8.0_172"
127.0.0.1 - - [27/Aug/2018:02:49:28 +0000] "GET //localhost:31000/api/atlas/v2/entity/guid/767da35d-a504-4152-8719-d87f96f7e69c
HTTP/1.1" 200 7382 "-" "Java/1.8.0_172"
127.0.0.1 - - [27/Aug/2018:02:49:28 +0000] "GET //localhost:31000/api/atlas/v2/entity/uniqueAttribute/type/hdfs_path?attr:qualifiedName=pfile:/home/jenkins/jenkins-slave/workspace/atlas-1.0-integrationtests/addons/hive-bridge/target/loaddfsfile-data-ktxyhsrnjr
HTTP/1.1" 200 1442 "-" "Java/1.8.0_172"
127.0.0.1 - - [27/Aug/2018:02:49:28 +0000] "GET //localhost:31000/api/atlas/v2/entity/uniqueAttribute/type/hdfs_path?attr:qualifiedName=pfile:/home/jenkins/jenkins-slave/workspace/atlas-1.0-integrationtests/addons/hive-bridge/target/loaddfsfile-data-ktxyhsrnjr
HTTP/1.1" 200 1442 "-" "Java/1.8.0_172"
127.0.0.1 - - [27/Aug/2018:02:49:28 +0000] "GET //localhost:31000/api/atlas/v2/entity/guid/767da35d-a504-4152-8719-d87f96f7e69c
HTTP/1.1" 200 7382 "-" "Java/1.8.0_172"
127.0.0.1 - - [27/Aug/2018:02:49:29 +0000] "GET //localhost:31000/api/atlas/v2/entity/uniqueAttribute/type/hive_process?attr:qualifiedName=LOAD-%3E:default.table1asbok6tep@primary:1535338157000
HTTP/1.1" 200 2129 "-" "Java/1.8.0_172"
127.0.0.1 - - [27/Aug/2018:02:49:34 +0000] "GET //localhost:31000/api/atlas/v2/entity/uniqueAttribute/type/hive_process?attr:qualifiedName=LOAD-%3E:default.table1asbok6tep@primary:1535338157000
HTTP/1.1" 200 2586 "-" "Java/1.8.0_172"
127.0.0.1 - - [27/Aug/2018:02:49:34 +0000] "GET //localhost:31000/api/atlas/v2/entity/uniqueAttribute/type/hive_process?attr:qualifiedName=LOAD-%3E:default.table1asbok6tep@primary:1535338157000
HTTP/1.1" 200 2586 "-" "Java/1.8.0_172"
127.0.0.1 - - [27/Aug/2018:02:49:34 +0000] "GET //localhost:31000/api/atlas/v2/entity/guid/ee762fe4-cf5a-4fea-b65c-a9b07c9ce98e
HTTP/1.1" 200 2586 "-" "Java/1.8.0_172"
127.0.0.1 - - [27/Aug/2018:02:49:34 +0000] "GET //localhost:31000/api/atlas/v2/entity/guid/53bcedfe-26e9-4bb6-ae5c-69678056a079
HTTP/1.1" 200 1446 "-" "Java/1.8.0_172"
127.0.0.1 - - [27/Aug/2018:02:49:34 +0000] "GET //localhost:31000/api/atlas/v2/entity/guid/f6c64137-3969-4a21-b39c-740d68a81b08
HTTP/1.1" 200 1444 "-" "Java/1.8.0_172"
127.0.0.1 - - [27/Aug/2018:02:49:34 +0000] "GET //localhost:31000/api/atlas/v2/entity/guid/767da35d-a504-4152-8719-d87f96f7e69c
HTTP/1.1" 200 7383 "-" "Java/1.8.0_172"
127.0.0.1 - - [27/Aug/2018:02:49:34 +0000] "GET //localhost:31000/api/atlas/v2/entity/uniqueAttribute/type/hive_process?attr:qualifiedName=LOAD-%3E:default.tablelthvsffjsb@primary:1535338174000
HTTP/1.1" 404 177 "-" "Java/1.8.0_172"
127.0.0.1 - - [27/Aug/2018:02:49:39 +0000] "GET //localhost:31000/api/atlas/v2/entity/uniqueAttribute/type/hive_process?attr:qualifiedName=LOAD-%3E:default.tablelthvsffjsb@primary:1535338174000
HTTP/1.1" 200 1588 "-" "Java/1.8.0_172"
127.0.0.1 - - [27/Aug/2018:02:49:39 +0000] "GET //localhost:31000/api/atlas/v2/entity/uniqueAttribute/type/hive_process?attr:qualifiedName=LOAD-%3E:default.tablelthvsffjsb@primary:1535338174000
HTTP/1.1" 200 1588 "-" "Java/1.8.0_172"
127.0.0.1 - - [27/Aug/2018:02:49:40 +0000] "GET //localhost:31000/api/atlas/v2/entity/uniqueAttribute/type/hive_process?attr:qualifiedName=LOAD-%3E:default.tableqqdtghm8zk@primary:1535338179000
HTTP/1.1" 404 177 "-" "Java/1.8.0_172"
127.0.0.1 - - [27/Aug/2018:02:49:45 +0000] "GET //localhost:31000/api/atlas/v2/entity/uniqueAttribute/type/hive_process?attr:qualifiedName=LOAD-%3E:default.tableqqdtghm8zk@primary:1535338179000
HTTP/1.1" 200 1675 "-" "Java/1.8.0_172"
127.0.0.1 - - [27/Aug/2018:02:49:45 +0000] "GET //localhost:31000/api/atlas/v2/entity/uniqueAttribute/type/hive_process?attr:qualifiedName=LOAD-%3E:default.tableqqdtghm8zk@primary:1535338179000
HTTP/1.1" 200 1675 "-" "Java/1.8.0_172"
127.0.0.1 - - [27/Aug/2018:02:49:50 +0000] "GET //localhost:31000/api/atlas/v2/entity/uniqueAttribute/type/hive_column?attr:qualifiedName=dbmsqnwy74zc.tablen3yvdbkotz.id@primary
HTTP/1.1" 404 163 "-" "Java/1.8.0_172"
127.0.0.1 - - [27/Aug/2018:02:49:55 +0000] "GET //localhost:31000/api/atlas/v2/entity/uniqueAttribute/type/hive_column?attr:qualifiedName=dbmsqnwy74zc.tablen3yvdbkotz.id@primary
HTTP/1.1" 200 845 "-" "Java/1.8.0_172"
127.0.0.1 - - [27/Aug/2018:02:49:55 +0000] "GET //localhost:31000/api/atlas/v2/entity/uniqueAttribute/type/hive_column?attr:qualifiedName=dbmsqnwy74zc.tablen3yvdbkotz.id@primary
HTTP/1.1" 200 845 "-" "Java/1.8.0_172"
127.0.0.1 - - [27/Aug/2018:02:49:55 +0000] "POST //localhost:31000/api/atlas/v2/types/typedefs/
HTTP/1.1" 200 425 "-" "Java/1.8.0_172"
127.0.0.1 - - [27/Aug/2018:02:49:56 +0000] "POST //localhost:31000/api/atlas/v2/entity/guid/b76b1623-e4d1-4656-a871-f448f36ce67e/classifications
HTTP/1.1" 204 0 "-" "Java/1.8.0_172"
127.0.0.1 - - [27/Aug/2018:02:49:57 +0000] "GET //localhost:31000/api/atlas/v2/entity/uniqueAttribute/type/hive_column?attr:qualifiedName=dbmsqnwy74zc.tablen3yvdbkotz.id_new@primary
HTTP/1.1" 404 167 "-" "Java/1.8.0_172"
127.0.0.1 - - [27/Aug/2018:02:50:02 +0000] "GET //localhost:31000/api/atlas/v2/entity/uniqueAttribute/type/hive_column?attr:qualifiedName=dbmsqnwy74zc.tablen3yvdbkotz.id_new@primary
HTTP/1.1" 200 1045 "-" "Java/1.8.0_172"
127.0.0.1 - - [27/Aug/2018:02:50:02 +0000] "GET //localhost:31000/api/atlas/v2/entity/uniqueAttribute/type/hive_column?attr:qualifiedName=dbmsqnwy74zc.tablen3yvdbkotz.id_new@primary
HTTP/1.1" 200 1045 "-" "Java/1.8.0_172"
127.0.0.1 - - [27/Aug/2018:02:50:02 +0000] "GET //localhost:31000/api/atlas/entities/b76b1623-e4d1-4656-a871-f448f36ce67e
HTTP/1.1" 200 1065 "-" "Java/1.8.0_172"
127.0.0.1 - - [27/Aug/2018:02:50:03 +0000] "GET //localhost:31000/api/atlas/v2/entity/uniqueAttribute/type/hive_table?attr:qualifiedName=default.tableb3zv65alrw@primary
HTTP/1.1" 404 154 "-" "Java/1.8.0_172"
127.0.0.1 - - [27/Aug/2018:02:50:08 +0000] "GET //localhost:31000/api/atlas/v2/entity/uniqueAttribute/type/hive_table?attr:qualifiedName=default.tableb3zv65alrw@primary
HTTP/1.1" 200 5476 "-" "Java/1.8.0_172"
127.0.0.1 - - [27/Aug/2018:02:50:08 +0000] "GET //localhost:31000/api/atlas/v2/entity/uniqueAttribute/type/hive_table?attr:qualifiedName=default.tableb3zv65alrw@primary
HTTP/1.1" 200 5476 "-" "Java/1.8.0_172"
127.0.0.1 - - [27/Aug/2018:02:50:08 +0000] "GET //localhost:31000/api/atlas/v2/entity/uniqueAttribute/type/hive_process?attr:qualifiedName=TRUNCATETABLE-%3E:default.tableb3zv65alrw@primary:1535338202000
HTTP/1.1" 200 1186 "-" "Java/1.8.0_172"
127.0.0.1 - - [27/Aug/2018:02:50:08 +0000] "GET //localhost:31000/api/atlas/v2/entity/uniqueAttribute/type/hive_process?attr:qualifiedName=TRUNCATETABLE-%3E:default.tableb3zv65alrw@primary:1535338202000
HTTP/1.1" 200 1186 "-" "Java/1.8.0_172"
127.0.0.1 - - [27/Aug/2018:02:50:08 +0000] "GET //localhost:31000/api/atlas/v2/entity/guid/75f94cad-00f1-41d8-b0df-15d2b4dd530e
HTTP/1.1" 200 1186 "-" "Java/1.8.0_172"
127.0.0.1 - - [27/Aug/2018:02:50:08 +0000] "GET //localhost:31000/api/atlas/v2/entity/guid/bb7e0529-8f97-4119-a649-67491dae02e6
HTTP/1.1" 200 5476 "-" "Java/1.8.0_172"
127.0.0.1 - - [27/Aug/2018:02:50:08 +0000] "GET //localhost:31000/api/atlas/v2/lineage/bb7e0529-8f97-4119-a649-67491dae02e6?depth=0&direction=INPUT
HTTP/1.1" 200 135 "-" "Java/1.8.0_172"
127.0.0.1 - - [27/Aug/2018:02:50:11 +0000] "GET //localhost:31000/api/atlas/v2/entity/uniqueAttribute/type/hive_process?attr:qualifiedName=QUERY:default.tablema86aaw1dt@primary:1535338209000-%3E
HTTP/1.1" 404 178 "-" "Java/1.8.0_172"
127.0.0.1 - - [27/Aug/2018:02:50:16 +0000] "GET //localhost:31000/api/atlas/v2/entity/uniqueAttribute/type/hive_process?attr:qualifiedName=QUERY:default.tablema86aaw1dt@primary:1535338209000-%3E
HTTP/1.1" 200 2114 "-" "Java/1.8.0_172"
127.0.0.1 - - [27/Aug/2018:02:50:16 +0000] "GET //localhost:31000/api/atlas/v2/entity/uniqueAttribute/type/hive_process?attr:qualifiedName=QUERY:default.tablema86aaw1dt@primary:1535338209000-%3E
HTTP/1.1" 200 2114 "-" "Java/1.8.0_172"
127.0.0.1 - - [27/Aug/2018:02:50:16 +0000] "GET //localhost:31000/api/atlas/v2/entity/guid/09f00eef-141b-44a6-a90f-b79d81ee8a0e
HTTP/1.1" 200 2114 "-" "Java/1.8.0_172"
127.0.0.1 - - [27/Aug/2018:02:50:16 +0000] "GET //localhost:31000/api/atlas/v2/entity/guid/372add97-ed76-4f63-a905-a147889c7bd1
HTTP/1.1" 200 5640 "-" "Java/1.8.0_172"
127.0.0.1 - - [27/Aug/2018:02:50:16 +0000] "GET //localhost:31000/api/atlas/v2/entity/guid/ad33fdf4-5d72-4ee1-97d4-159fe431e905
HTTP/1.1" 200 1440 "-" "Java/1.8.0_172"
127.0.0.1 - - [27/Aug/2018:02:50:16 +0000] "GET //localhost:31000/api/atlas/v2/entity/uniqueAttribute/type/hdfs_path?attr:qualifiedName=pfile:/home/jenkins/jenkins-slave/workspace/atlas-1.0-integrationtests/addons/hive-bridge/target/somedfspath1-data-gnt9oendmw
HTTP/1.1" 200 1440 "-" "Java/1.8.0_172"
127.0.0.1 - - [27/Aug/2018:02:50:16 +0000] "GET //localhost:31000/api/atlas/v2/entity/uniqueAttribute/type/hdfs_path?attr:qualifiedName=pfile:/home/jenkins/jenkins-slave/workspace/atlas-1.0-integrationtests/addons/hive-bridge/target/somedfspath1-data-gnt9oendmw
HTTP/1.1" 200 1440 "-" "Java/1.8.0_172"
127.0.0.1 - - [27/Aug/2018:02:50:16 +0000] "GET //localhost:31000/api/atlas/v2/entity/uniqueAttribute/type/hive_table?attr:qualifiedName=default.tablema86aaw1dt@primary
HTTP/1.1" 200 5640 "-" "Java/1.8.0_172"
127.0.0.1 - - [27/Aug/2018:02:50:16 +0000] "GET //localhost:31000/api/atlas/v2/entity/uniqueAttribute/type/hive_table?attr:qualifiedName=default.tablema86aaw1dt@primary
HTTP/1.1" 200 5640 "-" "Java/1.8.0_172"
127.0.0.1 - - [27/Aug/2018:02:50:16 +0000] "GET //localhost:31000/api/atlas/v2/entity/guid/372add97-ed76-4f63-a905-a147889c7bd1
HTTP/1.1" 200 5640 "-" "Java/1.8.0_172"
127.0.0.1 - - [27/Aug/2018:02:50:19 +0000] "GET //localhost:31000/api/atlas/v2/entity/uniqueAttribute/type/hive_table?attr:qualifiedName=default.tablema86aaw1dt@primary
HTTP/1.1" 200 5640 "-" "Java/1.8.0_172"
127.0.0.1 - - [27/Aug/2018:02:50:19 +0000] "GET //localhost:31000/api/atlas/v2/entity/uniqueAttribute/type/hive_table?attr:qualifiedName=default.tablema86aaw1dt@primary
HTTP/1.1" 200 5640 "-" "Java/1.8.0_172"
127.0.0.1 - - [27/Aug/2018:02:50:19 +0000] "GET //localhost:31000/api/atlas/v2/entity/uniqueAttribute/type/hive_process?attr:qualifiedName=QUERY:default.tablema86aaw1dt@primary:1535338209000-%3E
HTTP/1.1" 200 2114 "-" "Java/1.8.0_172"
127.0.0.1 - - [27/Aug/2018:02:50:19 +0000] "GET //localhost:31000/api/atlas/v2/entity/uniqueAttribute/type/hive_process?attr:qualifiedName=QUERY:default.tablema86aaw1dt@primary:1535338209000-%3E
HTTP/1.1" 200 2114 "-" "Java/1.8.0_172"
127.0.0.1 - - [27/Aug/2018:02:50:19 +0000] "GET //localhost:31000/api/atlas/v2/entity/guid/09f00eef-141b-44a6-a90f-b79d81ee8a0e
HTTP/1.1" 200 2114 "-" "Java/1.8.0_172"
127.0.0.1 - - [27/Aug/2018:02:50:19 +0000] "GET //localhost:31000/api/atlas/v2/entity/guid/372add97-ed76-4f63-a905-a147889c7bd1
HTTP/1.1" 200 5640 "-" "Java/1.8.0_172"
127.0.0.1 - - [27/Aug/2018:02:50:19 +0000] "GET //localhost:31000/api/atlas/v2/entity/guid/ad33fdf4-5d72-4ee1-97d4-159fe431e905
HTTP/1.1" 200 1440 "-" "Java/1.8.0_172"
127.0.0.1 - - [27/Aug/2018:02:50:19 +0000] "GET //localhost:31000/api/atlas/v2/entity/uniqueAttribute/type/hdfs_path?attr:qualifiedName=pfile:/home/jenkins/jenkins-slave/workspace/atlas-1.0-integrationtests/addons/hive-bridge/target/somedfspath1-data-gnt9oendmw
HTTP/1.1" 200 1440 "-" "Java/1.8.0_172"
127.0.0.1 - - [27/Aug/2018:02:50:19 +0000] "GET //localhost:31000/api/atlas/v2/entity/uniqueAttribute/type/hdfs_path?attr:qualifiedName=pfile:/home/jenkins/jenkins-slave/workspace/atlas-1.0-integrationtests/addons/hive-bridge/target/somedfspath1-data-gnt9oendmw
HTTP/1.1" 200 1440 "-" "Java/1.8.0_172"
127.0.0.1 - - [27/Aug/2018:02:50:22 +0000] "GET //localhost:31000/api/atlas/v2/entity/uniqueAttribute/type/hive_table?attr:qualifiedName=default.tablema86aaw1dt@primary
HTTP/1.1" 200 5640 "-" "Java/1.8.0_172"
127.0.0.1 - - [27/Aug/2018:02:50:22 +0000] "GET //localhost:31000/api/atlas/v2/entity/uniqueAttribute/type/hive_table?attr:qualifiedName=default.tablema86aaw1dt@primary
HTTP/1.1" 200 5640 "-" "Java/1.8.0_172"
127.0.0.1 - - [27/Aug/2018:02:50:22 +0000] "GET //localhost:31000/api/atlas/v2/entity/uniqueAttribute/type/hive_process?attr:qualifiedName=QUERY:default.tablema86aaw1dt@primary:1535338209000-%3E
HTTP/1.1" 200 2569 "-" "Java/1.8.0_172"
127.0.0.1 - - [27/Aug/2018:02:50:22 +0000] "GET //localhost:31000/api/atlas/v2/entity/uniqueAttribute/type/hive_process?attr:qualifiedName=QUERY:default.tablema86aaw1dt@primary:1535338209000-%3E
HTTP/1.1" 200 2569 "-" "Java/1.8.0_172"
127.0.0.1 - - [27/Aug/2018:02:50:22 +0000] "GET //localhost:31000/api/atlas/v2/entity/guid/09f00eef-141b-44a6-a90f-b79d81ee8a0e
HTTP/1.1" 200 2569 "-" "Java/1.8.0_172"
127.0.0.1 - - [27/Aug/2018:02:50:22 +0000] "GET //localhost:31000/api/atlas/v2/entity/guid/372add97-ed76-4f63-a905-a147889c7bd1
HTTP/1.1" 200 5640 "-" "Java/1.8.0_172"
127.0.0.1 - - [27/Aug/2018:02:50:22 +0000] "GET //localhost:31000/api/atlas/v2/entity/guid/86bf4123-b1f6-476c-aedb-35b7856db758
HTTP/1.1" 200 1440 "-" "Java/1.8.0_172"
127.0.0.1 - - [27/Aug/2018:02:50:22 +0000] "GET //localhost:31000/api/atlas/v2/entity/guid/ad33fdf4-5d72-4ee1-97d4-159fe431e905
HTTP/1.1" 200 1441 "-" "Java/1.8.0_172"
127.0.0.1 - - [27/Aug/2018:02:50:22 +0000] "GET //localhost:31000/api/atlas/v2/entity/uniqueAttribute/type/hdfs_path?attr:qualifiedName=pfile:/home/jenkins/jenkins-slave/workspace/atlas-1.0-integrationtests/addons/hive-bridge/target/somedfspath2-data-v7faevy9x9
HTTP/1.1" 200 1440 "-" "Java/1.8.0_172"
127.0.0.1 - - [27/Aug/2018:02:50:22 +0000] "GET //localhost:31000/api/atlas/v2/entity/uniqueAttribute/type/hdfs_path?attr:qualifiedName=pfile:/home/jenkins/jenkins-slave/workspace/atlas-1.0-integrationtests/addons/hive-bridge/target/somedfspath2-data-v7faevy9x9
HTTP/1.1" 200 1440 "-" "Java/1.8.0_172"
Tests run: 45, Failures: 1, Errors: 0, Skipped: 0, Time elapsed: 485.412 sec <<<
FAILURE! - in TestSuite
testDropDatabaseWithoutCascade(org.apache.atlas.hive.hook.HiveHookIT)  Time elapsed: 7.133
sec  <<< FAILURE!
java.lang.AssertionError: Entity was not supposed to exist for typeName = hive_db, attributeName
= qualifiedName, attributeValue = dbm59my0m2pd@primary
	at org.testng.Assert.fail(Assert.java:94)
	at org.apache.atlas.hive.hook.HiveHookIT.testDropDatabaseWithoutCascade(HiveHookIT.java:1621)


Results :

Failed tests: 
  HiveHookIT.testDropDatabaseWithoutCascade:1621 Entity was not supposed to exist for typeName
= hive_db, attributeName = qualifiedName, attributeValue = dbm59my0m2pd@primary

Tests run: 45, Failures: 1, Errors: 0, Skipped: 0

[INFO] 
[INFO] --- jetty-maven-plugin:9.3.14.v20161028:stop (stop-jetty) @ hive-bridge ---
[INFO] Waiting 10 seconds for jetty to stop
[INFO] Stopped ServerConnector@8da7154{HTTP/1.1,[http/1.1]}{0.0.0.0:31000}
[INFO] Closing Spring root WebApplicationContext
[INFO] Shutting down log4j
[INFO] Stopped o.e.j.m.p.JettyWebAppContext@10c9e866{/,file://<https://builds.apache.org/job/Atlas-1.0-IntegrationTests/ws/webapp/target/atlas-webapp-1.1.0-SNAPSHOT/,UNAVAILABLE}{/home/jenkins/jenkins-slave/workspace/Atlas-1.0-IntegrationTests/webapp/target/atlas-webapp-1.1.0-SNAPSHOT.war}>
[INFO] Server reports itself as stopped
[INFO] 
[INFO] --- maven-source-plugin:2.4:jar-no-fork (attach-sources) @ hive-bridge ---
[INFO] Building jar: <https://builds.apache.org/job/Atlas-1.0-IntegrationTests/ws/addons/hive-bridge/target/hive-bridge-1.1.0-SNAPSHOT-sources.jar>
[INFO] 
[INFO] --- maven-source-plugin:2.4:test-jar-no-fork (attach-sources) @ hive-bridge ---
[INFO] Building jar: <https://builds.apache.org/job/Atlas-1.0-IntegrationTests/ws/addons/hive-bridge/target/hive-bridge-1.1.0-SNAPSHOT-test-sources.jar>
log4j:WARN No appenders could be found for logger (org.apache.zookeeper.ClientCnxn).
log4j:WARN Please initialize the log4j system properly.
log4j:WARN See http://logging.apache.org/log4j/1.2/faq.html#noconfig for more info.
[INFO] 
[INFO] --- maven-failsafe-plugin:2.18.1:verify (verify) @ hive-bridge ---
[INFO] Failsafe report directory: <https://builds.apache.org/job/Atlas-1.0-IntegrationTests/ws/addons/hive-bridge/target/failsafe-reports>
[INFO] ------------------------------------------------------------------------
[INFO] Reactor Summary:
[INFO] 
[INFO] Apache Atlas Server Build Tools 1.0 ................ SUCCESS [  0.786 s]
[INFO] apache-atlas 1.1.0-SNAPSHOT ........................ SUCCESS [  4.780 s]
[INFO] Apache Atlas Test Utility Tools .................... SUCCESS [ 11.712 s]
[INFO] Apache Atlas Integration ........................... SUCCESS [ 27.823 s]
[INFO] Apache Atlas Common ................................ SUCCESS [  8.966 s]
[INFO] Apache Atlas Client ................................ SUCCESS [  0.623 s]
[INFO] atlas-client-common ................................ SUCCESS [  7.459 s]
[INFO] atlas-client-v1 .................................... SUCCESS [  7.709 s]
[INFO] Apache Atlas Server API ............................ SUCCESS [  5.777 s]
[INFO] Apache Atlas Notification .......................... SUCCESS [  9.765 s]
[INFO] atlas-client-v2 .................................... SUCCESS [  6.242 s]
[INFO] Apache Atlas Graph Database Projects ............... SUCCESS [  0.471 s]
[INFO] Apache Atlas Graph Database API .................... SUCCESS [  4.874 s]
[INFO] Graph Database Common Code ......................... SUCCESS [  5.420 s]
[INFO] Apache Atlas JanusGraph DB Impl .................... SUCCESS [ 17.785 s]
[INFO] Apache Atlas Graph Database Implementation Dependencies SUCCESS [  2.485 s]
[INFO] Shaded version of Apache hbase client .............. SUCCESS [  9.819 s]
[INFO] Shaded version of Apache hbase server .............. SUCCESS [ 25.028 s]
[INFO] Apache Atlas Authorization ......................... SUCCESS [  7.516 s]
[INFO] Apache Atlas Repository ............................ SUCCESS [ 36.463 s]
[INFO] Apache Atlas UI .................................... SUCCESS [01:54 min]
[INFO] Apache Atlas Web Application ....................... SUCCESS [10:03 min]
[INFO] Apache Atlas Documentation ......................... SUCCESS [  8.740 s]
[INFO] Apache Atlas FileSystem Model ...................... SUCCESS [  3.213 s]
[INFO] Apache Atlas Plugin Classloader .................... SUCCESS [  6.520 s]
[INFO] Apache Atlas Hive Bridge Shim ...................... SUCCESS [  5.333 s]
[INFO] Apache Atlas Hive Bridge ........................... FAILURE [09:25 min]
[INFO] Apache Atlas Falcon Bridge Shim .................... SKIPPED
[INFO] Apache Atlas Falcon Bridge ......................... SKIPPED
[INFO] Apache Atlas Sqoop Bridge Shim ..................... SKIPPED
[INFO] Apache Atlas Sqoop Bridge .......................... SKIPPED
[INFO] Apache Atlas Storm Bridge Shim ..................... SKIPPED
[INFO] Apache Atlas Storm Bridge .......................... SKIPPED
[INFO] Apache Atlas Hbase Bridge Shim ..................... SKIPPED
[INFO] Apache Atlas Hbase Bridge .......................... SKIPPED
[INFO] Apache Atlas Kafka Bridge .......................... SKIPPED
[INFO] Apache Atlas Distribution 1.1.0-SNAPSHOT ........... SKIPPED
[INFO] ------------------------------------------------------------------------
[INFO] BUILD FAILURE
[INFO] ------------------------------------------------------------------------
[INFO] Total time: 25:10 min
[INFO] Finished at: 2018-08-27T02:50:30Z
[INFO] ------------------------------------------------------------------------
[ERROR] Failed to execute goal org.apache.maven.plugins:maven-failsafe-plugin:2.18.1:verify
(verify) on project hive-bridge: There are test failures.
[ERROR] 
[ERROR] Please refer to <https://builds.apache.org/job/Atlas-1.0-IntegrationTests/ws/addons/hive-bridge/target/failsafe-reports>
for the individual test results.
[ERROR] -> [Help 1]
[ERROR] 
[ERROR] To see the full stack trace of the errors, re-run Maven with the -e switch.
[ERROR] Re-run Maven using the -X switch to enable full debug logging.
[ERROR] 
[ERROR] For more information about the errors and possible solutions, please read the following
articles:
[ERROR] [Help 1] http://cwiki.apache.org/confluence/display/MAVEN/MojoFailureException
[ERROR] 
[ERROR] After correcting the problems, you can resume the build with the command
[ERROR]   mvn <goals> -rf :hive-bridge
Build step 'Execute shell' marked build as failure
[CHECKSTYLE] Collecting checkstyle analysis files...
[CHECKSTYLE] Searching for all files in <https://builds.apache.org/job/Atlas-1.0-IntegrationTests/ws/>
that match the pattern **/target/checkstyle-result.xml
[CHECKSTYLE] Parsing 25 files in <https://builds.apache.org/job/Atlas-1.0-IntegrationTests/ws/>
[CHECKSTYLE] Successfully parsed file <https://builds.apache.org/job/Atlas-1.0-IntegrationTests/ws/addons/hdfs-model/target/checkstyle-result.xml>
with 0 unique warnings and 0 duplicates.
[CHECKSTYLE] Successfully parsed file <https://builds.apache.org/job/Atlas-1.0-IntegrationTests/ws/addons/hive-bridge-shim/target/checkstyle-result.xml>
with 15 unique warnings and 0 duplicates.
[CHECKSTYLE] Successfully parsed file <https://builds.apache.org/job/Atlas-1.0-IntegrationTests/ws/authorization/target/checkstyle-result.xml>
with 988 unique warnings and 0 duplicates.
[CHECKSTYLE] Successfully parsed file <https://builds.apache.org/job/Atlas-1.0-IntegrationTests/ws/client/client-v1/target/checkstyle-result.xml>
with 1887 unique warnings and 0 duplicates.
[CHECKSTYLE] Successfully parsed file <https://builds.apache.org/job/Atlas-1.0-IntegrationTests/ws/client/client-v2/target/checkstyle-result.xml>
with 2246 unique warnings and 0 duplicates.
[CHECKSTYLE] Successfully parsed file <https://builds.apache.org/job/Atlas-1.0-IntegrationTests/ws/client/common/target/checkstyle-result.xml>
with 2738 unique warnings and 0 duplicates.
[CHECKSTYLE] Successfully parsed file <https://builds.apache.org/job/Atlas-1.0-IntegrationTests/ws/client/target/checkstyle-result.xml>
with 2738 unique warnings and 0 duplicates.
[CHECKSTYLE] Successfully parsed file <https://builds.apache.org/job/Atlas-1.0-IntegrationTests/ws/common/target/checkstyle-result.xml>
with 3815 unique warnings and 0 duplicates.
[CHECKSTYLE] Successfully parsed file <https://builds.apache.org/job/Atlas-1.0-IntegrationTests/ws/dashboardv2/target/checkstyle-result.xml>
with 3815 unique warnings and 0 duplicates.
[CHECKSTYLE] Successfully parsed file <https://builds.apache.org/job/Atlas-1.0-IntegrationTests/ws/docs/target/checkstyle-result.xml>
with 3815 unique warnings and 0 duplicates.
[CHECKSTYLE] Successfully parsed file <https://builds.apache.org/job/Atlas-1.0-IntegrationTests/ws/graphdb/api/target/checkstyle-result.xml>
with 4117 unique warnings and 0 duplicates.
[CHECKSTYLE] Successfully parsed file <https://builds.apache.org/job/Atlas-1.0-IntegrationTests/ws/graphdb/common/target/checkstyle-result.xml>
with 4343 unique warnings and 0 duplicates.
[CHECKSTYLE] Successfully parsed file <https://builds.apache.org/job/Atlas-1.0-IntegrationTests/ws/graphdb/graphdb-impls/target/checkstyle-result.xml>
with 4343 unique warnings and 0 duplicates.
[CHECKSTYLE] Successfully parsed file <https://builds.apache.org/job/Atlas-1.0-IntegrationTests/ws/graphdb/janus/target/checkstyle-result.xml>
with 6669 unique warnings and 0 duplicates.
[CHECKSTYLE] Successfully parsed file <https://builds.apache.org/job/Atlas-1.0-IntegrationTests/ws/graphdb/target/checkstyle-result.xml>
with 6669 unique warnings and 0 duplicates.
[CHECKSTYLE] Successfully parsed file <https://builds.apache.org/job/Atlas-1.0-IntegrationTests/ws/intg/target/checkstyle-result.xml>
with 18768 unique warnings and 0 duplicates.
[CHECKSTYLE] Successfully parsed file <https://builds.apache.org/job/Atlas-1.0-IntegrationTests/ws/notification/target/checkstyle-result.xml>
with 20042 unique warnings and 0 duplicates.
[CHECKSTYLE] Successfully parsed file <https://builds.apache.org/job/Atlas-1.0-IntegrationTests/ws/plugin-classloader/target/checkstyle-result.xml>
with 20155 unique warnings and 0 duplicates.
[CHECKSTYLE] Successfully parsed file <https://builds.apache.org/job/Atlas-1.0-IntegrationTests/ws/repository/target/checkstyle-result.xml>
with 39328 unique warnings and 0 duplicates.
[CHECKSTYLE] Successfully parsed file <https://builds.apache.org/job/Atlas-1.0-IntegrationTests/ws/server-api/target/checkstyle-result.xml>
with 39496 unique warnings and 0 duplicates.
[CHECKSTYLE] Successfully parsed file <https://builds.apache.org/job/Atlas-1.0-IntegrationTests/ws/shaded/hbase-client-shaded/target/checkstyle-result.xml>
with 39496 unique warnings and 0 duplicates.
[CHECKSTYLE] Successfully parsed file <https://builds.apache.org/job/Atlas-1.0-IntegrationTests/ws/shaded/hbase-server-shaded/target/checkstyle-result.xml>
with 39496 unique warnings and 0 duplicates.
[CHECKSTYLE] Successfully parsed file <https://builds.apache.org/job/Atlas-1.0-IntegrationTests/ws/target/checkstyle-result.xml>
with 39496 unique warnings and 0 duplicates.
[CHECKSTYLE] Successfully parsed file <https://builds.apache.org/job/Atlas-1.0-IntegrationTests/ws/test-tools/target/checkstyle-result.xml>
with 39534 unique warnings and 0 duplicates.
[CHECKSTYLE] Successfully parsed file <https://builds.apache.org/job/Atlas-1.0-IntegrationTests/ws/webapp/target/checkstyle-result.xml>
with 47888 unique warnings and 0 duplicates.
<Git Blamer> Using GitBlamer to create author and commit information for all warnings.
<Git Blamer> GIT_COMMIT=3483b71c7f13164ea8fbaf7e16050f503f2e460e, workspace=<https://builds.apache.org/job/Atlas-1.0-IntegrationTests/ws/>
 > git rev-parse 3483b71c7f13164ea8fbaf7e16050f503f2e460e^{commit} # timeout=10
[CHECKSTYLE] Computing warning deltas based on reference build #886
[FINDBUGS] Collecting findbugs analysis files...
[FINDBUGS] Searching for all files in <https://builds.apache.org/job/Atlas-1.0-IntegrationTests/ws/>
that match the pattern **/target/findbugs.xml
[FINDBUGS] Parsing 16 files in <https://builds.apache.org/job/Atlas-1.0-IntegrationTests/ws/>
[FINDBUGS] Successfully parsed file <https://builds.apache.org/job/Atlas-1.0-IntegrationTests/ws/addons/hive-bridge-shim/target/findbugs.xml>
with 0 unique warnings and 0 duplicates.
[FINDBUGS] Successfully parsed file <https://builds.apache.org/job/Atlas-1.0-IntegrationTests/ws/authorization/target/findbugs.xml>
with 0 unique warnings and 0 duplicates.
[FINDBUGS] Successfully parsed file <https://builds.apache.org/job/Atlas-1.0-IntegrationTests/ws/client/client-v1/target/findbugs.xml>
with 0 unique warnings and 0 duplicates.
[FINDBUGS] Successfully parsed file <https://builds.apache.org/job/Atlas-1.0-IntegrationTests/ws/client/client-v2/target/findbugs.xml>
with 0 unique warnings and 0 duplicates.
[FINDBUGS] Successfully parsed file <https://builds.apache.org/job/Atlas-1.0-IntegrationTests/ws/client/common/target/findbugs.xml>
with 0 unique warnings and 0 duplicates.
[FINDBUGS] Successfully parsed file <https://builds.apache.org/job/Atlas-1.0-IntegrationTests/ws/common/target/findbugs.xml>
with 0 unique warnings and 0 duplicates.
[FINDBUGS] Successfully parsed file <https://builds.apache.org/job/Atlas-1.0-IntegrationTests/ws/graphdb/api/target/findbugs.xml>
with 0 unique warnings and 0 duplicates.
[FINDBUGS] Successfully parsed file <https://builds.apache.org/job/Atlas-1.0-IntegrationTests/ws/graphdb/common/target/findbugs.xml>
with 0 unique warnings and 0 duplicates.
[FINDBUGS] Successfully parsed file <https://builds.apache.org/job/Atlas-1.0-IntegrationTests/ws/graphdb/janus/target/findbugs.xml>
with 0 unique warnings and 0 duplicates.
[FINDBUGS] Successfully parsed file <https://builds.apache.org/job/Atlas-1.0-IntegrationTests/ws/intg/target/findbugs.xml>
with 0 unique warnings and 0 duplicates.
[FINDBUGS] Successfully parsed file <https://builds.apache.org/job/Atlas-1.0-IntegrationTests/ws/notification/target/findbugs.xml>
with 0 unique warnings and 0 duplicates.
[FINDBUGS] Successfully parsed file <https://builds.apache.org/job/Atlas-1.0-IntegrationTests/ws/plugin-classloader/target/findbugs.xml>
with 0 unique warnings and 0 duplicates.
[FINDBUGS] Successfully parsed file <https://builds.apache.org/job/Atlas-1.0-IntegrationTests/ws/repository/target/findbugs.xml>
with 0 unique warnings and 0 duplicates.
[FINDBUGS] Successfully parsed file <https://builds.apache.org/job/Atlas-1.0-IntegrationTests/ws/server-api/target/findbugs.xml>
with 0 unique warnings and 0 duplicates.
[FINDBUGS] Successfully parsed file <https://builds.apache.org/job/Atlas-1.0-IntegrationTests/ws/test-tools/target/findbugs.xml>
with 0 unique warnings and 0 duplicates.
[FINDBUGS] Successfully parsed file <https://builds.apache.org/job/Atlas-1.0-IntegrationTests/ws/webapp/target/findbugs.xml>
with 0 unique warnings and 0 duplicates.
<Git Blamer> Using GitBlamer to create author and commit information for all warnings.
<Git Blamer> GIT_COMMIT=3483b71c7f13164ea8fbaf7e16050f503f2e460e, workspace=<https://builds.apache.org/job/Atlas-1.0-IntegrationTests/ws/>
[FINDBUGS] Computing warning deltas based on reference build #886
Archiving artifacts
[Fast Archiver] Compressed 168.90 MB of artifacts by 83.9% relative to #886
TestNG Reports Processing: START
Looking for TestNG results report in workspace using pattern: **/target/surefire-reports/testng-results.xml,**/target/failsafe-reports/testng-results.xml
Saving reports...
Processing '/x1/jenkins/jenkins-home/jobs/Atlas-1.0-IntegrationTests/builds/887/testng/testng-results-1.xml'
Processing '/x1/jenkins/jenkins-home/jobs/Atlas-1.0-IntegrationTests/builds/887/testng/testng-results.xml'
0.609756% of tests failed, which exceeded threshold of 0%. Marking build as UNSTABLE
TestNG Reports Processing: FINISH

Mime
View raw message