atlas-dev mailing list archives

Site index · List index
Message view « Date » · « Thread »
Top « Date » · « Thread »
From Apache Jenkins Server <jenk...@builds.apache.org>
Subject Build failed in Jenkins: PreCommit-ATLAS-Build-Test #534-branch-0.8-updated-REST-APIs-that-read-entities-with-an-option-.patch
Date Sun, 05 Aug 2018 08:02:47 GMT
See <https://builds.apache.org/job/PreCommit-ATLAS-Build-Test/534/display/redirect?page=changes>

Changes:

[madhan] ATLAS-2809: updated authorization model to authorize add/update/remove

------------------------------------------
[...truncated 238.98 KB...]
Tests run: 3, Failures: 0, Errors: 0, Skipped: 0, Time elapsed: 59.831 sec - in org.apache.atlas.repository.audit.InMemoryAuditRepositoryTest
Java HotSpot(TM) 64-Bit Server VM warning: ignoring option MaxPermSize=512m; support was removed
in 8.0
Tests run: 9, Failures: 0, Errors: 0, Skipped: 0, Time elapsed: 59.871 sec - in org.apache.atlas.utils.ObjectUpdateSynchronizerTest
Java HotSpot(TM) 64-Bit Server VM warning: ignoring option MaxPermSize=512m; support was removed
in 8.0
Java HotSpot(TM) 64-Bit Server VM warning: ignoring option MaxPermSize=512m; support was removed
in 8.0
Tests run: 0, Failures: 0, Errors: 0, Skipped: 0, Time elapsed: 59.112 sec - in org.apache.atlas.repository.store.graph.v1.InverseReferenceUpdateV1Test
Running org.apache.atlas.repository.graph.Gremlin3QueryOptimizerTest
Tests run: 0, Failures: 0, Errors: 0, Skipped: 0, Time elapsed: 58.469 sec - in org.apache.atlas.repository.store.graph.v1.AtlasDeleteHandlerV1Test
Tests run: 0, Failures: 0, Errors: 0, Skipped: 0, Time elapsed: 60.794 sec - in org.apache.atlas.utils.TestResourceFileUtils
Running org.apache.atlas.repository.graph.ReverseReferenceUpdateHardDeleteTest
Java HotSpot(TM) 64-Bit Server VM warning: ignoring option MaxPermSize=512m; support was removed
in 8.0
Java HotSpot(TM) 64-Bit Server VM warning: ignoring option MaxPermSize=512m; support was removed
in 8.0
Tests run: 6, Failures: 0, Errors: 0, Skipped: 0, Time elapsed: 60.871 sec - in org.apache.atlas.repository.impexp.ZipSourceTest
Tests run: 8, Failures: 0, Errors: 0, Skipped: 0, Time elapsed: 60.906 sec - in org.apache.atlas.repository.impexp.ImportTransformsTest
Java HotSpot(TM) 64-Bit Server VM warning: ignoring option MaxPermSize=512m; support was removed
in 8.0
Tests run: 8, Failures: 0, Errors: 0, Skipped: 0, Time elapsed: 61.585 sec - in org.apache.atlas.repository.impexp.ZipSinkTest
Tests run: 6, Failures: 0, Errors: 0, Skipped: 0, Time elapsed: 61.564 sec - in org.apache.atlas.repository.impexp.TypeAttributeDifferenceTest
Java HotSpot(TM) 64-Bit Server VM warning: ignoring option MaxPermSize=512m; support was removed
in 8.0
Java HotSpot(TM) 64-Bit Server VM warning: ignoring option MaxPermSize=512m; support was removed
in 8.0
Running org.apache.atlas.repository.graph.TestIntSequence
Java HotSpot(TM) 64-Bit Server VM warning: ignoring option MaxPermSize=512m; support was removed
in 8.0
Running org.apache.atlas.repository.graph.GraphHelperTest
Java HotSpot(TM) 64-Bit Server VM warning: ignoring option MaxPermSize=512m; support was removed
in 8.0
Running org.apache.atlas.repository.graph.GraphBackedSearchIndexerTest
Running org.apache.atlas.repository.graph.GraphBackedSearchIndexerMockTest
Running org.apache.atlas.repository.graph.GraphBackedRepositorySoftDeleteTest
Running org.apache.atlas.repository.graph.GraphBackedMetadataRepositoryTest
Tests run: 6, Failures: 0, Errors: 0, Skipped: 0, Time elapsed: 63.763 sec - in org.apache.atlas.repository.impexp.AtlasImportRequestTest
Running org.apache.atlas.repository.graph.AbstractGremlinQueryOptimizerTest
Running org.apache.atlas.repository.BaseTest
Running org.apache.atlas.repository.graph.ReverseReferenceUpdateSoftDeleteTest
Java HotSpot(TM) 64-Bit Server VM warning: ignoring option MaxPermSize=512m; support was removed
in 8.0
Tests run: 1, Failures: 0, Errors: 0, Skipped: 0, Time elapsed: 64.474 sec - in org.apache.atlas.repository.impexp.ImportTransformerJSONTest
Running org.apache.atlas.repository.clusterinfo.ClusterServiceTest
Java HotSpot(TM) 64-Bit Server VM warning: ignoring option MaxPermSize=512m; support was removed
in 8.0
Tests run: 8, Failures: 0, Errors: 0, Skipped: 0, Time elapsed: 64.163 sec - in org.apache.atlas.repository.impexp.ImportTransformerTest
Tests run: 33, Failures: 0, Errors: 0, Skipped: 0, Time elapsed: 63.595 sec - in org.apache.atlas.repository.graph.Gremlin2QueryOptimizerTest
Java HotSpot(TM) 64-Bit Server VM warning: ignoring option MaxPermSize=512m; support was removed
in 8.0
Java HotSpot(TM) 64-Bit Server VM warning: ignoring option MaxPermSize=512m; support was removed
in 8.0
Running org.apache.atlas.service.DefaultMetadataServiceTest
Running org.apache.atlas.repository.userprofile.UserProfileServiceTest
Running org.apache.atlas.service.StoreBackedTypeCacheMetadataServiceTest
Running org.apache.atlas.util.CompiledQueryCacheKeyTest
Tests run: 2, Failures: 0, Errors: 0, Skipped: 0, Time elapsed: 69.306 sec - in org.apache.atlas.repository.graph.GraphHelperMockTest
Java HotSpot(TM) 64-Bit Server VM warning: ignoring option MaxPermSize=512m; support was removed
in 8.0
Running org.apache.atlas.discovery.GraphBackedDiscoveryServiceTest
Tests run: 1, Failures: 0, Errors: 0, Skipped: 0, Time elapsed: 82.113 sec - in org.apache.atlas.repository.store.graph.v1.AtlasEntityDefStoreV1Test
Java HotSpot(TM) 64-Bit Server VM warning: ignoring option MaxPermSize=512m; support was removed
in 8.0
Tests run: 5, Failures: 0, Errors: 0, Skipped: 0, Time elapsed: 87.109 sec - in org.apache.atlas.repository.typestore.GraphBackedTypeStoreTest
Running org.apache.atlas.discovery.DataSetLineageServiceTest
Java HotSpot(TM) 64-Bit Server VM warning: ignoring option MaxPermSize=512m; support was removed
in 8.0
Tests run: 2, Failures: 0, Errors: 0, Skipped: 0, Time elapsed: 90.203 sec - in org.apache.atlas.repository.typestore.StoreBackedTypeCacheTest
Java HotSpot(TM) 64-Bit Server VM warning: ignoring option MaxPermSize=512m; support was removed
in 8.0
Running org.apache.atlas.discovery.EntityDiscoveryServiceTest
Running org.apache.atlas.services.MetricsServiceTest
Tests run: 3, Failures: 0, Errors: 0, Skipped: 0, Time elapsed: 109.821 sec - in org.apache.atlas.repository.impexp.ExportImportAuditServiceTest
Java HotSpot(TM) 64-Bit Server VM warning: ignoring option MaxPermSize=512m; support was removed
in 8.0
Running org.apache.atlas.lineage.EntityLineageServiceTest
Tests run: 5, Failures: 0, Errors: 0, Skipped: 0, Time elapsed: 114.89 sec - in org.apache.atlas.repository.store.graph.v1.InverseReferenceUpdateSoftDeleteV1Test
Java HotSpot(TM) 64-Bit Server VM warning: ignoring option MaxPermSize=512m; support was removed
in 8.0
Running org.apache.atlas.TestModules
Tests run: 5, Failures: 0, Errors: 0, Skipped: 0, Time elapsed: 118.917 sec - in org.apache.atlas.repository.store.graph.v1.InverseReferenceUpdateHardDeleteV1Test
Java HotSpot(TM) 64-Bit Server VM warning: ignoring option MaxPermSize=512m; support was removed
in 8.0
Tests run: 0, Failures: 0, Errors: 0, Skipped: 0, Time elapsed: 59.387 sec - in org.apache.atlas.repository.graph.TestIntSequence
Java HotSpot(TM) 64-Bit Server VM warning: ignoring option MaxPermSize=512m; support was removed
in 8.0
Tests run: 33, Failures: 0, Errors: 0, Skipped: 0, Time elapsed: 63.099 sec - in org.apache.atlas.repository.graph.Gremlin3QueryOptimizerTest
Java HotSpot(TM) 64-Bit Server VM warning: ignoring option MaxPermSize=512m; support was removed
in 8.0
Running org.apache.atlas.query.QueryProcessorTest
Running org.apache.atlas.query.LexerTest
Tests run: 0, Failures: 0, Errors: 0, Skipped: 0, Time elapsed: 60.955 sec - in org.apache.atlas.repository.graph.AbstractGremlinQueryOptimizerTest
Java HotSpot(TM) 64-Bit Server VM warning: ignoring option MaxPermSize=512m; support was removed
in 8.0
Running org.apache.atlas.query.ParserTest
Tests run: 0, Failures: 0, Errors: 0, Skipped: 0, Time elapsed: 63.595 sec - in org.apache.atlas.repository.BaseTest
Tests run: 3, Failures: 0, Errors: 0, Skipped: 0, Time elapsed: 64.8 sec - in org.apache.atlas.repository.graph.GraphBackedSearchIndexerMockTest
Java HotSpot(TM) 64-Bit Server VM warning: ignoring option MaxPermSize=512m; support was removed
in 8.0
Java HotSpot(TM) 64-Bit Server VM warning: ignoring option MaxPermSize=512m; support was removed
in 8.0
Running org.apache.atlas.query.LineageQueryTest
Running org.apache.atlas.query.GremlinTest
Tests run: 5, Failures: 0, Errors: 0, Skipped: 0, Time elapsed: 62.108 sec - in org.apache.atlas.util.CompiledQueryCacheKeyTest
Java HotSpot(TM) 64-Bit Server VM warning: ignoring option MaxPermSize=512m; support was removed
in 8.0
Running org.apache.atlas.query.ExpressionTest
Running org.apache.atlas.query.BaseGremlinTest
Tests run: 5, Failures: 0, Errors: 0, Skipped: 0, Time elapsed: 85.376 sec - in org.apache.atlas.repository.graph.GraphBackedSearchIndexerTest
Java HotSpot(TM) 64-Bit Server VM warning: ignoring option MaxPermSize=512m; support was removed
in 8.0
Running org.apache.atlas.TestUtils
Tests run: 5, Failures: 0, Errors: 0, Skipped: 0, Time elapsed: 92.404 sec - in org.apache.atlas.repository.graph.ReverseReferenceUpdateHardDeleteTest
Java HotSpot(TM) 64-Bit Server VM warning: ignoring option MaxPermSize=512m; support was removed
in 8.0
Tests run: 4, Failures: 0, Errors: 0, Skipped: 0, Time elapsed: 155.59 sec - in org.apache.atlas.repository.audit.HBaseBasedAuditRepositoryTest
Running org.apache.atlas.BaseRepositoryTest
Java HotSpot(TM) 64-Bit Server VM warning: ignoring option MaxPermSize=512m; support was removed
in 8.0
Running org.apache.atlas.RepositoryServiceLoadingTest
Tests run: 13, Failures: 0, Errors: 0, Skipped: 0, Time elapsed: 160.589 sec - in org.apache.atlas.repository.store.graph.v1.AtlasEntityStoreV1Test
Tests run: 1, Failures: 0, Errors: 0, Skipped: 0, Time elapsed: 100.931 sec - in org.apache.atlas.repository.clusterinfo.ClusterServiceTest
Tests run: 5, Failures: 0, Errors: 0, Skipped: 0, Time elapsed: 103.162 sec - in org.apache.atlas.repository.graph.ReverseReferenceUpdateSoftDeleteTest
Tests run: 11, Failures: 0, Errors: 0, Skipped: 0, Time elapsed: 168.875 sec - in org.apache.atlas.repository.store.graph.v1.SoftDeleteHandlerV1Test
Tests run: 21, Failures: 0, Errors: 0, Skipped: 0, Time elapsed: 169.363 sec - in org.apache.atlas.repository.graph.GraphBackedRepositoryHardDeleteTest
Tests run: 0, Failures: 0, Errors: 0, Skipped: 0, Time elapsed: 85.155 sec - in org.apache.atlas.discovery.DataSetLineageServiceTest
Tests run: 14, Failures: 0, Errors: 0, Skipped: 0, Time elapsed: 173.64 sec - in org.apache.atlas.repository.store.graph.AtlasTypeDefGraphStoreTest
Tests run: 11, Failures: 0, Errors: 0, Skipped: 0, Time elapsed: 176.494 sec - in org.apache.atlas.repository.store.graph.v1.HardDeleteHandlerV1Test
Tests run: 0, Failures: 0, Errors: 0, Skipped: 0, Time elapsed: 59.986 sec - in org.apache.atlas.TestModules
Tests run: 1, Failures: 0, Errors: 0, Skipped: 0, Time elapsed: 84.108 sec - in org.apache.atlas.services.MetricsServiceTest
Tests run: 6, Failures: 0, Errors: 0, Skipped: 0, Time elapsed: 86.851 sec - in org.apache.atlas.discovery.EntityDiscoveryServiceTest
Tests run: 1, Failures: 0, Errors: 0, Skipped: 0, Time elapsed: 61.076 sec - in org.apache.atlas.query.LexerTest
Tests run: 5, Failures: 0, Errors: 0, Skipped: 0, Time elapsed: 62.069 sec - in org.apache.atlas.query.QueryProcessorTest
Tests run: 3, Failures: 0, Errors: 0, Skipped: 0, Time elapsed: 118.45 sec - in org.apache.atlas.service.StoreBackedTypeCacheMetadataServiceTest
Tests run: 14, Failures: 0, Errors: 0, Skipped: 0, Time elapsed: 124.867 sec - in org.apache.atlas.repository.graph.GraphHelperTest
Tests run: 0, Failures: 0, Errors: 0, Skipped: 0, Time elapsed: 54.138 sec - in org.apache.atlas.query.BaseGremlinTest
Tests run: 19, Failures: 0, Errors: 0, Skipped: 0, Time elapsed: 57.364 sec - in org.apache.atlas.query.ExpressionTest
Tests run: 12, Failures: 0, Errors: 0, Skipped: 0, Time elapsed: 191.691 sec - in org.apache.atlas.repository.impexp.ExportServiceTest
Tests run: 14, Failures: 0, Errors: 0, Skipped: 0, Time elapsed: 64.051 sec - in org.apache.atlas.query.ParserTest
Tests run: 11, Failures: 1, Errors: 0, Skipped: 0, Time elapsed: 125.489 sec <<<
FAILURE! - in org.apache.atlas.repository.userprofile.UserProfileServiceTest
filterInternalType(org.apache.atlas.repository.userprofile.UserProfileServiceTest)  Time elapsed:
0.13 sec  <<< FAILURE!
java.lang.AssertionError: expected [7] but found [6]
	at org.testng.Assert.fail(Assert.java:94)
	at org.testng.Assert.failNotEquals(Assert.java:496)
	at org.testng.Assert.assertEquals(Assert.java:125)
	at org.testng.Assert.assertEquals(Assert.java:372)
	at org.testng.Assert.assertEquals(Assert.java:382)
	at org.apache.atlas.repository.userprofile.UserProfileServiceTest.filterInternalType(UserProfileServiceTest.java:70)

Tests run: 12, Failures: 1, Errors: 0, Skipped: 0, Time elapsed: 195.685 sec <<<
FAILURE! - in org.apache.atlas.repository.impexp.ImportServiceTest
postTest(org.apache.atlas.repository.impexp.ImportServiceTest)  Time elapsed: 1.603 sec  <<<
FAILURE!
java.lang.AssertionError: expected object to not be null
	at org.testng.Assert.fail(Assert.java:94)
	at org.testng.Assert.assertNotNull(Assert.java:406)
	at org.testng.Assert.assertNotNull(Assert.java:391)
	at org.apache.atlas.repository.impexp.ExportImportTestBase.assertAuditEntry(ExportImportTestBase.java:44)
	at org.apache.atlas.repository.impexp.ImportServiceTest.postTest(ImportServiceTest.java:84)

Tests run: 0, Failures: 0, Errors: 0, Skipped: 0, Time elapsed: 44.887 sec - in org.apache.atlas.TestUtils
Tests run: 0, Failures: 0, Errors: 0, Skipped: 0, Time elapsed: 39.598 sec - in org.apache.atlas.BaseRepositoryTest
Tests run: 30, Failures: 0, Errors: 0, Skipped: 0, Time elapsed: 139.381 sec - in org.apache.atlas.repository.graph.GraphBackedMetadataRepositoryTest
Tests run: 21, Failures: 0, Errors: 0, Skipped: 0, Time elapsed: 140.219 sec - in org.apache.atlas.repository.graph.GraphBackedRepositorySoftDeleteTest
Tests run: 1, Failures: 0, Errors: 0, Skipped: 0, Time elapsed: 47.26 sec - in org.apache.atlas.RepositoryServiceLoadingTest
Tests run: 5, Failures: 0, Errors: 0, Skipped: 0, Time elapsed: 85.748 sec - in org.apache.atlas.query.LineageQueryTest
Tests run: 27, Failures: 0, Errors: 0, Skipped: 0, Time elapsed: 148.48 sec - in org.apache.atlas.service.DefaultMetadataServiceTest
Tests run: 23, Failures: 0, Errors: 0, Skipped: 0, Time elapsed: 104.782 sec - in org.apache.atlas.lineage.EntityLineageServiceTest
Tests run: 21, Failures: 0, Errors: 0, Skipped: 0, Time elapsed: 91.074 sec - in org.apache.atlas.query.GremlinTest
Tests run: 338, Failures: 0, Errors: 0, Skipped: 0, Time elapsed: 274.815 sec - in org.apache.atlas.discovery.GraphBackedDiscoveryServiceTest
Tests run: 2, Failures: 0, Errors: 0, Skipped: 0, Time elapsed: 375.927 sec - in org.apache.atlas.repository.graph.GraphRepoMapperScaleTest

Results :

Failed tests: 
  ImportServiceTest.postTest:84->ExportImportTestBase.assertAuditEntry:44 expected object
to not be null
  UserProfileServiceTest.filterInternalType:70 expected [7] but found [6]

Tests run: 823, Failures: 2, Errors: 0, Skipped: 0

[INFO] ------------------------------------------------------------------------
[INFO] Reactor Summary:
[INFO] 
[INFO] Apache Atlas Server Build Tools 1.0 ................ SUCCESS [  0.675 s]
[INFO] apache-atlas 0.8.3-SNAPSHOT ........................ SUCCESS [  3.894 s]
[INFO] Apache Atlas Integration ........................... SUCCESS [ 13.208 s]
[INFO] Apache Atlas Common ................................ SUCCESS [  2.105 s]
[INFO] Apache Atlas Typesystem ............................ SUCCESS [ 36.121 s]
[INFO] Apache Atlas Client ................................ SUCCESS [  0.165 s]
[INFO] atlas-client-common ................................ SUCCESS [  0.735 s]
[INFO] atlas-client-v1 .................................... SUCCESS [  3.457 s]
[INFO] Apache Atlas Server API ............................ SUCCESS [  0.823 s]
[INFO] Apache Atlas Notification .......................... SUCCESS [ 13.609 s]
[INFO] atlas-client-v2 .................................... SUCCESS [  0.861 s]
[INFO] Apache Atlas Graph Database Projects ............... SUCCESS [  0.126 s]
[INFO] Apache Atlas Graph Database API .................... SUCCESS [  0.681 s]
[INFO] Graph Database Common Code ......................... SUCCESS [  0.989 s]
[INFO] Apache Atlas Titan 1.0.0 GraphDB Impl .............. SUCCESS [ 30.268 s]
[INFO] Shaded version of Apache hbase client .............. SUCCESS [  7.928 s]
[INFO] Apache Atlas Titan 0.5.4 Graph DB Impl ............. SUCCESS [01:06 min]
[INFO] Apache Atlas Graph Database Implementation Dependencies SUCCESS [  0.229 s]
[INFO] Shaded version of Apache hbase server .............. SUCCESS [ 21.650 s]
[INFO] Apache Atlas Repository ............................ FAILURE [07:02 min]
[INFO] Apache Atlas Authorization ......................... SKIPPED
[INFO] Apache Atlas Business Catalog ...................... SKIPPED
[INFO] Apache Atlas UI .................................... SKIPPED
[INFO] Apache Atlas Web Application ....................... SKIPPED
[INFO] Apache Atlas Documentation ......................... SKIPPED
[INFO] Apache Atlas FileSystem Model ...................... SKIPPED
[INFO] Apache Atlas Plugin Classloader .................... SKIPPED
[INFO] Apache Atlas Hive Bridge Shim ...................... SKIPPED
[INFO] Apache Atlas Hive Bridge ........................... SKIPPED
[INFO] Apache Atlas Falcon Bridge Shim .................... SKIPPED
[INFO] Apache Atlas Falcon Bridge ......................... SKIPPED
[INFO] Apache Atlas Sqoop Bridge Shim ..................... SKIPPED
[INFO] Apache Atlas Sqoop Bridge .......................... SKIPPED
[INFO] Apache Atlas Storm Bridge Shim ..................... SKIPPED
[INFO] Apache Atlas Storm Bridge .......................... SKIPPED
[INFO] Apache Atlas Hbase Bridge Shim ..................... SKIPPED
[INFO] Apache Atlas Hbase Bridge .......................... SKIPPED
[INFO] Apache Atlas Migration Exporter .................... SKIPPED
[INFO] Apache Atlas Distribution 0.8.3-SNAPSHOT ........... SKIPPED
[INFO] ------------------------------------------------------------------------
[INFO] BUILD FAILURE
[INFO] ------------------------------------------------------------------------
[INFO] Total time: 10:27 min
[INFO] Finished at: 2018-08-05T08:02:46Z
[INFO] ------------------------------------------------------------------------
[ERROR] Failed to execute goal org.apache.maven.plugins:maven-surefire-plugin:2.18.1:test
(default-test) on project atlas-repository: There are test failures.
[ERROR] 
[ERROR] Please refer to <https://builds.apache.org/job/PreCommit-ATLAS-Build-Test/ws/repository/target/surefire-reports>
for the individual test results.
[ERROR] -> [Help 1]
[ERROR] 
[ERROR] To see the full stack trace of the errors, re-run Maven with the -e switch.
[ERROR] Re-run Maven using the -X switch to enable full debug logging.
[ERROR] 
[ERROR] For more information about the errors and possible solutions, please read the following
articles:
[ERROR] [Help 1] http://cwiki.apache.org/confluence/display/MAVEN/MojoFailureException
[ERROR] 
[ERROR] After correcting the problems, you can resume the build with the command
[ERROR]   mvn <goals> -rf :atlas-repository




{color:red}-1 overall{color}.  

    {color:green}+1 @author{color}.  The patch does not contain any @author tags.

Console output: https://builds.apache.org/job/PreCommit-ATLAS-Build-Test/534//console

This message is automatically generated.


======================================================================
======================================================================
    Adding comment to Jira.
======================================================================
======================================================================




======================================================================
======================================================================
    Finished build.
======================================================================
======================================================================


+ EXIT_CODE=1
+ '[' -d <https://builds.apache.org/job/PreCommit-ATLAS-Build-Test/ws/../atlas_patchprocess_6938>
']'
+ '[' -d <https://builds.apache.org/job/PreCommit-ATLAS-Build-Test/ws/atlas_patchprocess_6938>
']'
+ mv <https://builds.apache.org/job/PreCommit-ATLAS-Build-Test/ws/atlas_patchprocess_6938>
<https://builds.apache.org/job/PreCommit-ATLAS-Build-Test/ws/patchprocess>
+ rm -f <https://builds.apache.org/job/PreCommit-ATLAS-Build-Test/ws/../atlas_patchprocess_6938>
+ exit 1
Build step 'Execute shell' marked build as failure
Set build name.
New build name is '#534-branch-0.8-updated-REST-APIs-that-read-entities-with-an-option-.patch'
Archiving artifacts

Mime
View raw message