atlas-dev mailing list archives

Site index · List index
Message view « Date » · « Thread »
Top « Date » · « Thread »
From Apache Jenkins Server <jenk...@builds.apache.org>
Subject Build failed in Jenkins: Atlas-master-IntegrationTests #1804
Date Fri, 06 Jul 2018 09:26:59 GMT
See <https://builds.apache.org/job/Atlas-master-IntegrationTests/1804/display/redirect>

------------------------------------------
[...truncated 769.69 KB...]
127.0.0.1 - - [06/Jul/2018:07:45:27 +0000] "GET //localhost:31000/api/atlas/entities?type=falcon_feed&property=qualifiedName&value=feedwxTIfWnZA1@clusterw5ylBt4Ugb
HTTP/1.1" 503 345 "-" "Java/1.8.0_172"
127.0.0.1 - - [06/Jul/2018:07:45:33 +0000] "GET //localhost:31000/api/atlas/entities?type=falcon_feed&property=qualifiedName&value=feedwxTIfWnZA1@clusterw5ylBt4Ugb
HTTP/1.1" 503 345 "-" "Java/1.8.0_172"
127.0.0.1 - - [06/Jul/2018:07:45:38 +0000] "GET //localhost:31000/api/atlas/entities?type=falcon_feed&property=qualifiedName&value=feedwxTIfWnZA1@clusterw5ylBt4Ugb
HTTP/1.1" 503 345 "-" "Java/1.8.0_172"
127.0.0.1 - - [06/Jul/2018:07:45:43 +0000] "GET //localhost:31000/api/atlas/entities?type=falcon_feed&property=qualifiedName&value=feedwxTIfWnZA1@clusterw5ylBt4Ugb
HTTP/1.1" 503 345 "-" "Java/1.8.0_172"
127.0.0.1 - - [06/Jul/2018:07:45:48 +0000] "GET //localhost:31000/api/atlas/entities?type=falcon_feed&property=qualifiedName&value=feedwxTIfWnZA1@clusterw5ylBt4Ugb
HTTP/1.1" 503 345 "-" "Java/1.8.0_172"
127.0.0.1 - - [06/Jul/2018:07:47:25 +0000] "GET //localhost:31000/api/atlas/entities?type=falcon_cluster&property=qualifiedName&value=clusteriKjLthL4Kn
HTTP/1.1" 503 345 "-" "Java/1.8.0_172"
127.0.0.1 - - [06/Jul/2018:07:47:30 +0000] "GET //localhost:31000/api/atlas/entities?type=falcon_cluster&property=qualifiedName&value=clusteriKjLthL4Kn
HTTP/1.1" 503 345 "-" "Java/1.8.0_172"
127.0.0.1 - - [06/Jul/2018:07:47:35 +0000] "GET //localhost:31000/api/atlas/entities?type=falcon_cluster&property=qualifiedName&value=clusteriKjLthL4Kn
HTTP/1.1" 503 345 "-" "Java/1.8.0_172"
127.0.0.1 - - [06/Jul/2018:07:47:40 +0000] "GET //localhost:31000/api/atlas/entities?type=falcon_cluster&property=qualifiedName&value=clusteriKjLthL4Kn
HTTP/1.1" 503 345 "-" "Java/1.8.0_172"
127.0.0.1 - - [06/Jul/2018:07:47:45 +0000] "GET //localhost:31000/api/atlas/entities?type=falcon_cluster&property=qualifiedName&value=clusteriKjLthL4Kn
HTTP/1.1" 503 345 "-" "Java/1.8.0_172"
127.0.0.1 - - [06/Jul/2018:07:47:50 +0000] "GET //localhost:31000/api/atlas/entities?type=falcon_cluster&property=qualifiedName&value=clusteriKjLthL4Kn
HTTP/1.1" 503 345 "-" "Java/1.8.0_172"
127.0.0.1 - - [06/Jul/2018:07:47:55 +0000] "GET //localhost:31000/api/atlas/entities?type=falcon_cluster&property=qualifiedName&value=clusteriKjLthL4Kn
HTTP/1.1" 503 345 "-" "Java/1.8.0_172"
127.0.0.1 - - [06/Jul/2018:07:48:00 +0000] "GET //localhost:31000/api/atlas/entities?type=falcon_cluster&property=qualifiedName&value=clusteriKjLthL4Kn
HTTP/1.1" 503 345 "-" "Java/1.8.0_172"
127.0.0.1 - - [06/Jul/2018:07:48:06 +0000] "GET //localhost:31000/api/atlas/entities?type=falcon_cluster&property=qualifiedName&value=clusteriKjLthL4Kn
HTTP/1.1" 503 345 "-" "Java/1.8.0_172"
127.0.0.1 - - [06/Jul/2018:07:48:11 +0000] "GET //localhost:31000/api/atlas/entities?type=falcon_cluster&property=qualifiedName&value=clusteriKjLthL4Kn
HTTP/1.1" 503 345 "-" "Java/1.8.0_172"
127.0.0.1 - - [06/Jul/2018:07:48:16 +0000] "GET //localhost:31000/api/atlas/entities?type=falcon_cluster&property=qualifiedName&value=clusteriKjLthL4Kn
HTTP/1.1" 503 345 "-" "Java/1.8.0_172"
127.0.0.1 - - [06/Jul/2018:07:48:21 +0000] "GET //localhost:31000/api/atlas/entities?type=falcon_cluster&property=qualifiedName&value=clusteriKjLthL4Kn
HTTP/1.1" 503 345 "-" "Java/1.8.0_172"
127.0.0.1 - - [06/Jul/2018:07:48:26 +0000] "GET //localhost:31000/api/atlas/entities?type=falcon_cluster&property=qualifiedName&value=clusteriKjLthL4Kn
HTTP/1.1" 503 345 "-" "Java/1.8.0_172"
127.0.0.1 - - [06/Jul/2018:07:48:31 +0000] "GET //localhost:31000/api/atlas/entities?type=falcon_cluster&property=qualifiedName&value=clusteriKjLthL4Kn
HTTP/1.1" 503 345 "-" "Java/1.8.0_172"
127.0.0.1 - - [06/Jul/2018:07:48:36 +0000] "GET //localhost:31000/api/atlas/entities?type=falcon_cluster&property=qualifiedName&value=clusteriKjLthL4Kn
HTTP/1.1" 503 345 "-" "Java/1.8.0_172"
127.0.0.1 - - [06/Jul/2018:07:48:41 +0000] "GET //localhost:31000/api/atlas/entities?type=falcon_cluster&property=qualifiedName&value=clusteriKjLthL4Kn
HTTP/1.1" 503 345 "-" "Java/1.8.0_172"
Tests run: 3, Failures: 3, Errors: 0, Skipped: 0, Time elapsed: 523.594 sec <<< FAILURE!
- in org.apache.atlas.falcon.hook.FalconHookIT
testCreateProcess(org.apache.atlas.falcon.hook.FalconHookIT)  Time elapsed: 82.717 sec  <<<
FAILURE!
java.lang.AssertionError: Assertions failed. Failing after waiting for timeout 80000 msecs
	at org.apache.atlas.AtlasBaseClient.callAPIWithResource(AtlasBaseClient.java:395)
	at org.apache.atlas.AtlasBaseClient.callAPIWithResource(AtlasBaseClient.java:323)
	at org.apache.atlas.AtlasBaseClient.callAPIWithRetries(AtlasBaseClient.java:479)
	at org.apache.atlas.AtlasClient.callAPIWithRetries(AtlasClient.java:931)
	at org.apache.atlas.AtlasClient.getEntity(AtlasClient.java:640)
	at org.apache.atlas.falcon.hook.FalconHookIT$1.evaluate(FalconHookIT.java:310)
	at org.apache.atlas.falcon.hook.FalconHookIT.waitFor(FalconHookIT.java:340)
	at org.apache.atlas.falcon.hook.FalconHookIT.assertEntityIsRegistered(FalconHookIT.java:307)
	at org.apache.atlas.falcon.hook.FalconHookIT.assertClusterIsRegistered(FalconHookIT.java:161)
	at org.apache.atlas.falcon.hook.FalconHookIT.testCreateProcess(FalconHookIT.java:130)

testCreateProcessWithHDFSFeed(org.apache.atlas.falcon.hook.FalconHookIT)  Time elapsed: 265.441
sec  <<< FAILURE!
java.lang.AssertionError: Assertions failed. Failing after waiting for timeout 80000 msecs
	at org.apache.atlas.AtlasBaseClient.callAPIWithResource(AtlasBaseClient.java:395)
	at org.apache.atlas.AtlasBaseClient.callAPIWithResource(AtlasBaseClient.java:323)
	at org.apache.atlas.AtlasBaseClient.callAPIWithRetries(AtlasBaseClient.java:479)
	at org.apache.atlas.AtlasClient.callAPIWithRetries(AtlasClient.java:931)
	at org.apache.atlas.AtlasClient.getEntity(AtlasClient.java:640)
	at org.apache.atlas.falcon.hook.FalconHookIT$1.evaluate(FalconHookIT.java:310)
	at org.apache.atlas.falcon.hook.FalconHookIT.waitFor(FalconHookIT.java:340)
	at org.apache.atlas.falcon.hook.FalconHookIT.assertEntityIsRegistered(FalconHookIT.java:307)
	at org.apache.atlas.falcon.hook.FalconHookIT.assertFeedIsRegistered(FalconHookIT.java:250)
	at org.apache.atlas.falcon.hook.FalconHookIT.getHDFSFeed(FalconHookIT.java:170)
	at org.apache.atlas.falcon.hook.FalconHookIT.testCreateProcessWithHDFSFeed(FalconHookIT.java:283)

testReplicationFeed(org.apache.atlas.falcon.hook.FalconHookIT)  Time elapsed: 173.388 sec
 <<< FAILURE!
java.lang.AssertionError: Assertions failed. Failing after waiting for timeout 80000 msecs
	at org.apache.atlas.AtlasBaseClient.callAPIWithResource(AtlasBaseClient.java:395)
	at org.apache.atlas.AtlasBaseClient.callAPIWithResource(AtlasBaseClient.java:323)
	at org.apache.atlas.AtlasBaseClient.callAPIWithRetries(AtlasBaseClient.java:479)
	at org.apache.atlas.AtlasClient.callAPIWithRetries(AtlasClient.java:931)
	at org.apache.atlas.AtlasClient.getEntity(AtlasClient.java:640)
	at org.apache.atlas.falcon.hook.FalconHookIT$1.evaluate(FalconHookIT.java:310)
	at org.apache.atlas.falcon.hook.FalconHookIT.waitFor(FalconHookIT.java:340)
	at org.apache.atlas.falcon.hook.FalconHookIT.assertEntityIsRegistered(FalconHookIT.java:307)
	at org.apache.atlas.falcon.hook.FalconHookIT.assertClusterIsRegistered(FalconHookIT.java:161)
	at org.apache.atlas.falcon.hook.FalconHookIT.testReplicationFeed(FalconHookIT.java:258)


Results :

Failed tests: 
  FalconHookIT.testCreateProcess:130->assertClusterIsRegistered:161->assertEntityIsRegistered:307->waitFor:344
Assertions failed. Failing after waiting for timeout 80000 msecs
  FalconHookIT.testCreateProcessWithHDFSFeed:283->getHDFSFeed:170->assertFeedIsRegistered:250->assertEntityIsRegistered:307->waitFor:344
Assertions failed. Failing after waiting for timeout 80000 msecs
  FalconHookIT.testReplicationFeed:258->assertClusterIsRegistered:161->assertEntityIsRegistered:307->waitFor:344
Assertions failed. Failing after waiting for timeout 80000 msecs

Tests run: 3, Failures: 3, Errors: 0, Skipped: 0

[INFO] 
[INFO] --- jetty-maven-plugin:9.3.14.v20161028:stop (stop-jetty) @ falcon-bridge ---
[INFO] Waiting 10 seconds for jetty to stop
[INFO] Stopped ServerConnector@2330a96f{HTTP/1.1,[http/1.1]}{0.0.0.0:31000}
[INFO] Closing Spring root WebApplicationContext
[INFO] Shutting down log4j
[INFO] Stopped o.e.j.m.p.JettyWebAppContext@2b963bb7{/,file://<https://builds.apache.org/job/Atlas-master-IntegrationTests/ws/webapp/target/atlas-webapp-2.0.0-SNAPSHOT/,UNAVAILABLE}{/home/jenkins/jenkins-slave/workspace/Atlas-master-IntegrationTests/webapp/target/atlas-webapp-2.0.0-SNAPSHOT.war}>
[INFO] Server reports itself as stopped
[INFO] 
[INFO] --- maven-antrun-plugin:1.7:run (default) @ falcon-bridge ---
log4j:WARN No appenders could be found for logger (org.apache.zookeeper.ClientCnxn).
log4j:WARN Please initialize the log4j system properly.
log4j:WARN See http://logging.apache.org/log4j/1.2/faq.html#noconfig for more info.
[WARNING] Parameter tasks is deprecated, use target instead
[INFO] Executing tasks

main:
   [delete] Deleting directory <https://builds.apache.org/job/Atlas-master-IntegrationTests/ws/addons/hive-bridge/target/data>
   [delete] Deleting directory <https://builds.apache.org/job/Atlas-master-IntegrationTests/ws/addons/hive-bridge/target/logs>
[INFO] Executed tasks
[INFO] 
[INFO] --- maven-source-plugin:2.4:jar-no-fork (attach-sources) @ falcon-bridge ---
[INFO] Building jar: <https://builds.apache.org/job/Atlas-master-IntegrationTests/ws/addons/falcon-bridge/target/falcon-bridge-2.0.0-SNAPSHOT-sources.jar>
[INFO] 
[INFO] --- maven-source-plugin:2.4:test-jar-no-fork (attach-sources) @ falcon-bridge ---
[INFO] Building jar: <https://builds.apache.org/job/Atlas-master-IntegrationTests/ws/addons/falcon-bridge/target/falcon-bridge-2.0.0-SNAPSHOT-test-sources.jar>
[INFO] 
[INFO] --- maven-failsafe-plugin:2.18.1:verify (verify) @ falcon-bridge ---
[INFO] Failsafe report directory: <https://builds.apache.org/job/Atlas-master-IntegrationTests/ws/addons/falcon-bridge/target/failsafe-reports>
[INFO] ------------------------------------------------------------------------
[INFO] Reactor Summary:
[INFO] 
[INFO] Apache Atlas Server Build Tools .................... SUCCESS [  0.712 s]
[INFO] apache-atlas ....................................... SUCCESS [  4.211 s]
[INFO] Apache Atlas Test Utility Tools .................... SUCCESS [ 10.623 s]
[INFO] Open Connector Framework (OCF) ..................... SUCCESS [ 10.483 s]
[INFO] Open Metadata Repository Services (OMRS) ........... SUCCESS [ 34.806 s]
[INFO] Open Metadata and Governance (OMAG) Server APIs .... SUCCESS [  8.074 s]
[INFO] Connected Asset Open Metadata Access Service (OMAS)  SUCCESS [  9.053 s]
[INFO] Asset Consumer Open Metadata Access Service (OMAS) . SUCCESS [  8.448 s]
[INFO] Open Metadata and Governance (OMAG) Server ......... SUCCESS [  5.023 s]
[INFO] Apache Atlas Integration ........................... SUCCESS [ 20.003 s]
[INFO] Apache Atlas Common ................................ SUCCESS [  7.809 s]
[INFO] Apache Atlas Client ................................ SUCCESS [  0.486 s]
[INFO] atlas-client-common ................................ SUCCESS [  6.482 s]
[INFO] atlas-client-v1 .................................... SUCCESS [  7.100 s]
[INFO] Apache Atlas Server API ............................ SUCCESS [  5.430 s]
[INFO] Apache Atlas Notification .......................... SUCCESS [  9.290 s]
[INFO] atlas-client-v2 .................................... SUCCESS [  5.989 s]
[INFO] Apache Atlas Graph Database Projects ............... SUCCESS [  0.461 s]
[INFO] Apache Atlas Graph Database API .................... SUCCESS [  4.689 s]
[INFO] Graph Database Common Code ......................... SUCCESS [  5.081 s]
[INFO] Apache Atlas JanusGraph DB Impl .................... SUCCESS [ 16.705 s]
[INFO] Apache Atlas Graph Database Implementation Dependencies SUCCESS [  2.228 s]
[INFO] Shaded version of Apache hbase client .............. SUCCESS [  8.087 s]
[INFO] Shaded version of Apache hbase server .............. SUCCESS [ 21.112 s]
[INFO] Apache Atlas Authorization ......................... SUCCESS [  6.632 s]
[INFO] Apache Atlas Repository ............................ SUCCESS [ 35.288 s]
[INFO] Apache Atlas UI .................................... SUCCESS [01:56 min]
[INFO] Apache Atlas Web Application ....................... SUCCESS [04:05 min]
[INFO] Apache Atlas Documentation ......................... SUCCESS [  4.570 s]
[INFO] Apache Atlas FileSystem Model ...................... SUCCESS [  3.138 s]
[INFO] Apache Atlas Plugin Classloader .................... SUCCESS [  6.614 s]
[INFO] Apache Atlas Hive Bridge Shim ...................... SUCCESS [  5.264 s]
[INFO] Apache Atlas Hive Bridge ........................... SUCCESS [07:30 min]
[INFO] Apache Atlas Falcon Bridge Shim .................... SUCCESS [  9.729 s]
[INFO] Apache Atlas Falcon Bridge ......................... FAILURE [09:43 min]
[INFO] Apache Atlas Sqoop Bridge Shim ..................... SKIPPED
[INFO] Apache Atlas Sqoop Bridge .......................... SKIPPED
[INFO] Apache Atlas Storm Bridge Shim ..................... SKIPPED
[INFO] Apache Atlas Storm Bridge .......................... SKIPPED
[INFO] Apache Atlas Hbase Bridge Shim ..................... SKIPPED
[INFO] Apache Atlas Hbase Bridge .......................... SKIPPED
[INFO] Apache Atlas Kafka Bridge .......................... SKIPPED
[INFO] Apache Atlas Distribution .......................... SKIPPED
[INFO] ------------------------------------------------------------------------
[INFO] BUILD FAILURE
[INFO] ------------------------------------------------------------------------
[INFO] Total time: 28:01 min
[INFO] Finished at: 2018-07-06T07:48:47Z
[INFO] Final Memory: 683M/2305M
[INFO] ------------------------------------------------------------------------
[ERROR] Failed to execute goal org.apache.maven.plugins:maven-failsafe-plugin:2.18.1:verify
(verify) on project falcon-bridge: There are test failures.
[ERROR] 
[ERROR] Please refer to <https://builds.apache.org/job/Atlas-master-IntegrationTests/ws/addons/falcon-bridge/target/failsafe-reports>
for the individual test results.
[ERROR] -> [Help 1]
[ERROR] 
[ERROR] To see the full stack trace of the errors, re-run Maven with the -e switch.
[ERROR] Re-run Maven using the -X switch to enable full debug logging.
[ERROR] 
[ERROR] For more information about the errors and possible solutions, please read the following
articles:
[ERROR] [Help 1] http://cwiki.apache.org/confluence/display/MAVEN/MojoFailureException
[ERROR] 
[ERROR] After correcting the problems, you can resume the build with the command
[ERROR]   mvn <goals> -rf :falcon-bridge
Build step 'Execute shell' marked build as failure
[CHECKSTYLE] Collecting checkstyle analysis files...
[CHECKSTYLE] Searching for all files in <https://builds.apache.org/job/Atlas-master-IntegrationTests/ws/>
that match the pattern **/target/checkstyle-result.xml
[CHECKSTYLE] Parsing 33 files in <https://builds.apache.org/job/Atlas-master-IntegrationTests/ws/>
[CHECKSTYLE] Successfully parsed file <https://builds.apache.org/job/Atlas-master-IntegrationTests/ws/addons/falcon-bridge-shim/target/checkstyle-result.xml>
with 29 unique warnings and 0 duplicates.
[CHECKSTYLE] Successfully parsed file <https://builds.apache.org/job/Atlas-master-IntegrationTests/ws/addons/hdfs-model/target/checkstyle-result.xml>
with 29 unique warnings and 0 duplicates.
[CHECKSTYLE] Successfully parsed file <https://builds.apache.org/job/Atlas-master-IntegrationTests/ws/addons/hive-bridge-shim/target/checkstyle-result.xml>
with 44 unique warnings and 0 duplicates.
[CHECKSTYLE] Successfully parsed file <https://builds.apache.org/job/Atlas-master-IntegrationTests/ws/addons/hive-bridge/target/checkstyle-result.xml>
with 2362 unique warnings and 0 duplicates.
[CHECKSTYLE] Successfully parsed file <https://builds.apache.org/job/Atlas-master-IntegrationTests/ws/authorization/target/checkstyle-result.xml>
with 3059 unique warnings and 0 duplicates.
[CHECKSTYLE] Successfully parsed file <https://builds.apache.org/job/Atlas-master-IntegrationTests/ws/client/client-v1/target/checkstyle-result.xml>
with 3958 unique warnings and 0 duplicates.
[CHECKSTYLE] Successfully parsed file <https://builds.apache.org/job/Atlas-master-IntegrationTests/ws/client/client-v2/target/checkstyle-result.xml>
with 4317 unique warnings and 0 duplicates.
[CHECKSTYLE] Successfully parsed file <https://builds.apache.org/job/Atlas-master-IntegrationTests/ws/client/common/target/checkstyle-result.xml>
with 4808 unique warnings and 0 duplicates.
[CHECKSTYLE] Successfully parsed file <https://builds.apache.org/job/Atlas-master-IntegrationTests/ws/client/target/checkstyle-result.xml>
with 4808 unique warnings and 0 duplicates.
[CHECKSTYLE] Successfully parsed file <https://builds.apache.org/job/Atlas-master-IntegrationTests/ws/common/target/checkstyle-result.xml>
with 5875 unique warnings and 0 duplicates.
[CHECKSTYLE] Successfully parsed file <https://builds.apache.org/job/Atlas-master-IntegrationTests/ws/dashboardv2/target/checkstyle-result.xml>
with 5875 unique warnings and 0 duplicates.
[CHECKSTYLE] Successfully parsed file <https://builds.apache.org/job/Atlas-master-IntegrationTests/ws/docs/target/checkstyle-result.xml>
with 5875 unique warnings and 0 duplicates.
[CHECKSTYLE] Successfully parsed file <https://builds.apache.org/job/Atlas-master-IntegrationTests/ws/graphdb/api/target/checkstyle-result.xml>
with 6177 unique warnings and 0 duplicates.
[CHECKSTYLE] Successfully parsed file <https://builds.apache.org/job/Atlas-master-IntegrationTests/ws/graphdb/common/target/checkstyle-result.xml>
with 6403 unique warnings and 0 duplicates.
[CHECKSTYLE] Successfully parsed file <https://builds.apache.org/job/Atlas-master-IntegrationTests/ws/graphdb/graphdb-impls/target/checkstyle-result.xml>
with 6403 unique warnings and 0 duplicates.
[CHECKSTYLE] Successfully parsed file <https://builds.apache.org/job/Atlas-master-IntegrationTests/ws/graphdb/janus/target/checkstyle-result.xml>
with 8725 unique warnings and 0 duplicates.
[CHECKSTYLE] Successfully parsed file <https://builds.apache.org/job/Atlas-master-IntegrationTests/ws/graphdb/target/checkstyle-result.xml>
with 8725 unique warnings and 0 duplicates.
[CHECKSTYLE] Successfully parsed file <https://builds.apache.org/job/Atlas-master-IntegrationTests/ws/intg/target/checkstyle-result.xml>
with 20754 unique warnings and 0 duplicates.
[CHECKSTYLE] Successfully parsed file <https://builds.apache.org/job/Atlas-master-IntegrationTests/ws/notification/target/checkstyle-result.xml>
with 21999 unique warnings and 0 duplicates.
[CHECKSTYLE] Successfully parsed file <https://builds.apache.org/job/Atlas-master-IntegrationTests/ws/om-fwk-ocf/target/checkstyle-result.xml>
with 27040 unique warnings and 0 duplicates.
[CHECKSTYLE] Successfully parsed file <https://builds.apache.org/job/Atlas-master-IntegrationTests/ws/omag-api/target/checkstyle-result.xml>
with 28595 unique warnings and 0 duplicates.
[CHECKSTYLE] Successfully parsed file <https://builds.apache.org/job/Atlas-master-IntegrationTests/ws/omag-server/target/checkstyle-result.xml>
with 28604 unique warnings and 0 duplicates.
[CHECKSTYLE] Successfully parsed file <https://builds.apache.org/job/Atlas-master-IntegrationTests/ws/omas-assetconsumer/target/checkstyle-result.xml>
with 31443 unique warnings and 0 duplicates.
[CHECKSTYLE] Successfully parsed file <https://builds.apache.org/job/Atlas-master-IntegrationTests/ws/omas-connectedasset/target/checkstyle-result.xml>
with 34856 unique warnings and 0 duplicates.
[CHECKSTYLE] Successfully parsed file <https://builds.apache.org/job/Atlas-master-IntegrationTests/ws/omrs/target/checkstyle-result.xml>
with 74827 unique warnings and 0 duplicates.
[CHECKSTYLE] Successfully parsed file <https://builds.apache.org/job/Atlas-master-IntegrationTests/ws/plugin-classloader/target/checkstyle-result.xml>
with 74940 unique warnings and 0 duplicates.
[CHECKSTYLE] Successfully parsed file <https://builds.apache.org/job/Atlas-master-IntegrationTests/ws/repository/target/checkstyle-result.xml>
with 93940 unique warnings and 0 duplicates.
[CHECKSTYLE] Successfully parsed file <https://builds.apache.org/job/Atlas-master-IntegrationTests/ws/server-api/target/checkstyle-result.xml>
with 94108 unique warnings and 0 duplicates.
[CHECKSTYLE] Successfully parsed file <https://builds.apache.org/job/Atlas-master-IntegrationTests/ws/shaded/hbase-client-shaded/target/checkstyle-result.xml>
with 94108 unique warnings and 0 duplicates.
[CHECKSTYLE] Successfully parsed file <https://builds.apache.org/job/Atlas-master-IntegrationTests/ws/shaded/hbase-server-shaded/target/checkstyle-result.xml>
with 94108 unique warnings and 0 duplicates.
[CHECKSTYLE] Successfully parsed file <https://builds.apache.org/job/Atlas-master-IntegrationTests/ws/target/checkstyle-result.xml>
with 94108 unique warnings and 0 duplicates.
[CHECKSTYLE] Successfully parsed file <https://builds.apache.org/job/Atlas-master-IntegrationTests/ws/test-tools/target/checkstyle-result.xml>
with 94146 unique warnings and 0 duplicates.
[CHECKSTYLE] Successfully parsed file <https://builds.apache.org/job/Atlas-master-IntegrationTests/ws/webapp/target/checkstyle-result.xml>
with 102499 unique warnings and 0 duplicates.
<Git Blamer> Using GitBlamer to create author and commit information for all warnings.
<Git Blamer> GIT_COMMIT=ec396b931b21df05ce52d4b323370ac9e64b426b, workspace=<https://builds.apache.org/job/Atlas-master-IntegrationTests/ws/>
 > git rev-parse ec396b931b21df05ce52d4b323370ac9e64b426b^{commit} # timeout=10
<Git Blamer> Skipping file <https://builds.apache.org/job/Atlas-master-IntegrationTests/ws/graphdb/janus/src/main/java/org/apache/atlas/repository/graphdb/janus/graphson/AtlasGraphSONMode.java,>
no result found.
[CHECKSTYLE] Computing warning deltas based on reference build #1803
[FINDBUGS] Collecting findbugs analysis files...
[FINDBUGS] Searching for all files in <https://builds.apache.org/job/Atlas-master-IntegrationTests/ws/>
that match the pattern **/target/findbugs.xml
[FINDBUGS] Parsing 24 files in <https://builds.apache.org/job/Atlas-master-IntegrationTests/ws/>
[FINDBUGS] Successfully parsed file <https://builds.apache.org/job/Atlas-master-IntegrationTests/ws/addons/falcon-bridge-shim/target/findbugs.xml>
with 0 unique warnings and 0 duplicates.
[FINDBUGS] Successfully parsed file <https://builds.apache.org/job/Atlas-master-IntegrationTests/ws/addons/hive-bridge-shim/target/findbugs.xml>
with 0 unique warnings and 0 duplicates.
[FINDBUGS] Successfully parsed file <https://builds.apache.org/job/Atlas-master-IntegrationTests/ws/addons/hive-bridge/target/findbugs.xml>
with 0 unique warnings and 0 duplicates.
[FINDBUGS] Successfully parsed file <https://builds.apache.org/job/Atlas-master-IntegrationTests/ws/authorization/target/findbugs.xml>
with 0 unique warnings and 0 duplicates.
[FINDBUGS] Successfully parsed file <https://builds.apache.org/job/Atlas-master-IntegrationTests/ws/client/client-v1/target/findbugs.xml>
with 0 unique warnings and 0 duplicates.
[FINDBUGS] Successfully parsed file <https://builds.apache.org/job/Atlas-master-IntegrationTests/ws/client/client-v2/target/findbugs.xml>
with 0 unique warnings and 0 duplicates.
[FINDBUGS] Successfully parsed file <https://builds.apache.org/job/Atlas-master-IntegrationTests/ws/client/common/target/findbugs.xml>
with 0 unique warnings and 0 duplicates.
[FINDBUGS] Successfully parsed file <https://builds.apache.org/job/Atlas-master-IntegrationTests/ws/common/target/findbugs.xml>
with 0 unique warnings and 0 duplicates.
[FINDBUGS] Successfully parsed file <https://builds.apache.org/job/Atlas-master-IntegrationTests/ws/graphdb/api/target/findbugs.xml>
with 0 unique warnings and 0 duplicates.
[FINDBUGS] Successfully parsed file <https://builds.apache.org/job/Atlas-master-IntegrationTests/ws/graphdb/common/target/findbugs.xml>
with 0 unique warnings and 0 duplicates.
[FINDBUGS] Successfully parsed file <https://builds.apache.org/job/Atlas-master-IntegrationTests/ws/graphdb/janus/target/findbugs.xml>
with 0 unique warnings and 0 duplicates.
[FINDBUGS] Successfully parsed file <https://builds.apache.org/job/Atlas-master-IntegrationTests/ws/intg/target/findbugs.xml>
with 0 unique warnings and 0 duplicates.
[FINDBUGS] Successfully parsed file <https://builds.apache.org/job/Atlas-master-IntegrationTests/ws/notification/target/findbugs.xml>
with 0 unique warnings and 0 duplicates.
[FINDBUGS] Successfully parsed file <https://builds.apache.org/job/Atlas-master-IntegrationTests/ws/om-fwk-ocf/target/findbugs.xml>
with 0 unique warnings and 0 duplicates.
[FINDBUGS] Successfully parsed file <https://builds.apache.org/job/Atlas-master-IntegrationTests/ws/omag-api/target/findbugs.xml>
with 0 unique warnings and 0 duplicates.
[FINDBUGS] Successfully parsed file <https://builds.apache.org/job/Atlas-master-IntegrationTests/ws/omag-server/target/findbugs.xml>
with 0 unique warnings and 0 duplicates.
[FINDBUGS] Successfully parsed file <https://builds.apache.org/job/Atlas-master-IntegrationTests/ws/omas-assetconsumer/target/findbugs.xml>
with 0 unique warnings and 0 duplicates.
[FINDBUGS] Successfully parsed file <https://builds.apache.org/job/Atlas-master-IntegrationTests/ws/omas-connectedasset/target/findbugs.xml>
with 0 unique warnings and 0 duplicates.
[FINDBUGS] Successfully parsed file <https://builds.apache.org/job/Atlas-master-IntegrationTests/ws/omrs/target/findbugs.xml>
with 0 unique warnings and 0 duplicates.
[FINDBUGS] Successfully parsed file <https://builds.apache.org/job/Atlas-master-IntegrationTests/ws/plugin-classloader/target/findbugs.xml>
with 0 unique warnings and 0 duplicates.
[FINDBUGS] Successfully parsed file <https://builds.apache.org/job/Atlas-master-IntegrationTests/ws/repository/target/findbugs.xml>
with 0 unique warnings and 0 duplicates.
[FINDBUGS] Successfully parsed file <https://builds.apache.org/job/Atlas-master-IntegrationTests/ws/server-api/target/findbugs.xml>
with 0 unique warnings and 0 duplicates.
[FINDBUGS] Successfully parsed file <https://builds.apache.org/job/Atlas-master-IntegrationTests/ws/test-tools/target/findbugs.xml>
with 0 unique warnings and 0 duplicates.
[FINDBUGS] Successfully parsed file <https://builds.apache.org/job/Atlas-master-IntegrationTests/ws/webapp/target/findbugs.xml>
with 0 unique warnings and 0 duplicates.
<Git Blamer> Using GitBlamer to create author and commit information for all warnings.
<Git Blamer> GIT_COMMIT=ec396b931b21df05ce52d4b323370ac9e64b426b, workspace=<https://builds.apache.org/job/Atlas-master-IntegrationTests/ws/>
[FINDBUGS] Computing warning deltas based on reference build #1803
Archiving artifacts
[Fast Archiver] Compressed 168.23 MB of artifacts by 83.6% relative to #1803
TestNG Reports Processing: START
Looking for TestNG results report in workspace using pattern: **/target/surefire-reports/testng-results.xml,**/target/failsafe-reports/testng-results.xml
Saving reports...
Processing '/x1/jenkins/jenkins-home/jobs/Atlas-master-IntegrationTests/builds/1804/testng/testng-results-1.xml'
Processing '/x1/jenkins/jenkins-home/jobs/Atlas-master-IntegrationTests/builds/1804/testng/testng-results-2.xml'
Processing '/x1/jenkins/jenkins-home/jobs/Atlas-master-IntegrationTests/builds/1804/testng/testng-results.xml'
1.796407% of tests failed, which exceeded threshold of 0%. Marking build as UNSTABLE
TestNG Reports Processing: FINISH

Mime
View raw message