atlas-dev mailing list archives

Site index · List index
Message view « Date » · « Thread »
Top « Date » · « Thread »
From Apache Jenkins Server <jenk...@builds.apache.org>
Subject Build failed in Jenkins: PreCommit-ATLAS-Build-Test #496-master-ATLAS-upgrade-guava-version-to-25.1.patch
Date Tue, 03 Jul 2018 05:09:21 GMT
See <https://builds.apache.org/job/PreCommit-ATLAS-Build-Test/496/display/redirect>

------------------------------------------
[...truncated 468.57 KB...]
	at org.apache.atlas.utils.ObjectUpdateSynchronizerTest.twoThreadsAccessingSameGuid_Serialize(ObjectUpdateSynchronizerTest.java:82)


Results :

Failed tests: 
org.apache.atlas.query.DSLParsingTest.testInvalidDSL(org.apache.atlas.query.DSLParsingTest)
  Run 1: DSLParsingTest.testInvalidDSL:46 » ExceptionInInitializer
  Run 2: DSLParsingTest.testInvalidDSL:46 NoClassDefFound Could not initialize class or...
  Run 3: DSLParsingTest.testInvalidDSL:46 NoClassDefFound Could not initialize class or...
  Run 4: DSLParsingTest.testInvalidDSL:46 NoClassDefFound Could not initialize class or...
  Run 5: DSLParsingTest.testInvalidDSL:46 NoClassDefFound Could not initialize class or...
  Run 6: DSLParsingTest.testInvalidDSL:46 NoClassDefFound Could not initialize class or...
  Run 7: DSLParsingTest.testInvalidDSL:46 NoClassDefFound Could not initialize class or...
  Run 8: DSLParsingTest.testInvalidDSL:46 NoClassDefFound Could not initialize class or...

  GremlinQueryComposerTest.DBAsDSelectLimit:119->verify:363->verify:351->getParsedQuery:373
» ExceptionInInitializer
  GremlinQueryComposerTest.DBHasName:62->verify:363->verify:351->getParsedQuery:373
NoClassDefFound
  GremlinQueryComposerTest.DBOrderBy:126->verify:363->verify:351->getParsedQuery:373
NoClassDefFound
  GremlinQueryComposerTest.DBasD:68->verify:363->verify:351->getParsedQuery:373 NoClassDefFound
  GremlinQueryComposerTest.DBasDSelect:75->verify:363->verify:351->getParsedQuery:373
NoClassDefFound
  GremlinQueryComposerTest.classification:40->verify:363->verify:351->getParsedQuery:373
NoClassDefFound
  GremlinQueryComposerTest.countMinMax:195->verify:363->verify:351->getParsedQuery:373
NoClassDefFound
  GremlinQueryComposerTest.dimension:46->verify:363->verify:351->getParsedQuery:373
NoClassDefFound
  GremlinQueryComposerTest.fromDB:54->verify:363->verify:351->getParsedQuery:373
NoClassDefFound
  GremlinQueryComposerTest.fromDBGroupBy:155->verify:363->verify:351->getParsedQuery:373
NoClassDefFound
  GremlinQueryComposerTest.fromDBOrderByNameDesc:143->verify:363->verify:351->getParsedQuery:373
NoClassDefFound
  GremlinQueryComposerTest.fromDBSelect:150->verify:363->verify:351->getParsedQuery:373
NoClassDefFound
  GremlinQueryComposerTest.groupByMin:103->verify:363->verify:351->getParsedQuery:373
NoClassDefFound
  GremlinQueryComposerTest.groupByOrderBy:110->verify:363->verify:351->getParsedQuery:373
NoClassDefFound
  GremlinQueryComposerTest.invalidQueries:333->verify:363->verify:351->getParsedQuery:373
NoClassDefFound
  GremlinQueryComposerTest.invalidQueries2:338->verify:359->verify:351->getParsedQuery:373
NoClassDefFound
  GremlinQueryComposerTest.keywordsInWhereClause:297->verify:363->verify:351->getParsedQuery:373
NoClassDefFound
org.apache.atlas.query.GremlinQueryComposerTest.nestedQueries(org.apache.atlas.query.GremlinQueryComposerTest)
  Run 1: GremlinQueryComposerTest.nestedQueries:291->verify:363->verify:351->getParsedQuery:373
NoClassDefFound
  Run 2: GremlinQueryComposerTest.nestedQueries:291->verify:363->verify:351->getParsedQuery:373
NoClassDefFound
  Run 3: GremlinQueryComposerTest.nestedQueries:291->verify:363->verify:351->getParsedQuery:373
NoClassDefFound
  Run 4: GremlinQueryComposerTest.nestedQueries:291->verify:363->verify:351->getParsedQuery:373
NoClassDefFound
  Run 5: GremlinQueryComposerTest.nestedQueries:291->verify:363->verify:351->getParsedQuery:373
NoClassDefFound
  Run 6: GremlinQueryComposerTest.nestedQueries:291->verify:363->verify:351->getParsedQuery:373
NoClassDefFound
  Run 7: GremlinQueryComposerTest.nestedQueries:291->verify:363->verify:351->getParsedQuery:373
NoClassDefFound
  Run 8: GremlinQueryComposerTest.nestedQueries:291->verify:363->verify:351->getParsedQuery:373
NoClassDefFound
  Run 9: GremlinQueryComposerTest.nestedQueries:291->verify:363->verify:351->getParsedQuery:373
NoClassDefFound
  Run 10: GremlinQueryComposerTest.nestedQueries:291->verify:363->verify:351->getParsedQuery:373
NoClassDefFound
  Run 11: GremlinQueryComposerTest.nestedQueries:291->verify:363->verify:351->getParsedQuery:373
NoClassDefFound

  GremlinQueryComposerTest.numericAttributes:312->verify:363->verify:351->getParsedQuery:373
NoClassDefFound
  GremlinQueryComposerTest.subType:190->verify:363->verify:351->getParsedQuery:373
NoClassDefFound
  GremlinQueryComposerTest.systemAttributes:318->verify:363->verify:351->getParsedQuery:373
NoClassDefFound
  GremlinQueryComposerTest.tableSelectColumns:85->verify:363->verify:351->getParsedQuery:373
NoClassDefFound
  GremlinQueryComposerTest.traitWithSpace:207->verify:363->verify:351->getParsedQuery:373
NoClassDefFound
  GremlinQueryComposerTest.valueArray:97->verify:363->verify:351->getParsedQuery:373
NoClassDefFound
  GremlinQueryComposerTest.whereClauseTextContains:162->verify:363->verify:351->getParsedQuery:373
NoClassDefFound
  GremlinQueryComposerTest.whereClauseWithAsTextContains:174->verify:363->verify:351->getParsedQuery:373
NoClassDefFound
  GremlinQueryComposerTest.whereClauseWithBooleanCondition:214->verify:363->verify:351->getParsedQuery:373
NoClassDefFound
  GremlinQueryComposerTest.whereClauseWithDateCompare:181->verify:363->verify:351->getParsedQuery:373
NoClassDefFound
  GremlinQueryComposerTest.whereComplexAndSelect:327->verify:363->verify:351->getParsedQuery:373
NoClassDefFound
  CassandraAuditRepositoryTest.setup:45 » ExceptionInInitializer
  AtlasImportRequestTest.optionsDefaultsTest:75 » ExceptionInInitializer
  AtlasImportRequestTest.serializeAtlasImportRequstFromJson:125 NoClassDefFound ...
  AtlasImportRequestTest.serializeAtlasImportRequstFromJsonWith1Transform:104 NoClassDefFound
  AtlasImportRequestTest.serializeAtlasImportRequstFromJsonWithEmptyOptions:31 NoClassDefFound
  AtlasImportRequestTest.serializeAtlasImportRequstFromJsonWithEmptyTransforms:87 NoClassDefFound
  AtlasImportRequestTest.serializeOptions_VerifyAccessors:56 NoClassDefFound Cou...
  ImportTransformerJSONTest.createAtlasImportTransformFromJson:35 » ExceptionInInitializer
  ImportTransformsTest.setup:44 » ExceptionInInitializer
  TypeAttributeDifferenceTest.setup:36 » ExceptionInInitializer
  ZipSinkTest.correctInit_succeeds:87->initZipSinkWithExportOrder:50 » ExceptionInInitializer
  ZipSinkTest.recordsDoesNotRecordEntityEntries:193->initZipSinkWithExportOrder:50 NoClassDefFound
  ZipSinkTest.recordsEntityEntries:150 NoClassDefFound Could not initialize clas...
  ZipSinkTest.recordsEntityWithExtInfoEntries:165 NoClassDefFound Could not init...
  ZipSinkTest.verifyExportOrderEntryName_verifies:114->getZipInputStreamForDefaultExportOrder:67->initZipSinkWithExportOrder:50
NoClassDefFound
  ZipSinkTest.zipWithExactlyOneEntry_ContentsVerified:123->getZipInputStreamForDefaultExportOrder:67->initZipSinkWithExportOrder:50
NoClassDefFound
  ZipSinkTest.zipWithExactlyOneEntry_succeeds:96->getZipInputStreamForDefaultExportOrder:67->initZipSinkWithExportOrder:50
NoClassDefFound
  ZipSinkTest.zipWithExactlyTwoEntries_ContentsVerified:133->useZipSinkToCreateEntries:200
NoClassDefFound
  MigrationProgressServiceTest.absentStatusNodeReturnsDefaultStatus:50->getMigrationStatusForTest:87
» ExceptionInInitializer
  MigrationProgressServiceTest.cachedStatusReturnedIfQueriedBeforeCacheExpiration:76->getMigrationStatusForTest:87
NoClassDefFound
  MigrationProgressServiceTest.cachedUpdatedIfQueriedAfterCacheExpiration:96->getMigrationStatusForTest:87
NoClassDefFound
  MigrationProgressServiceTest.existingStatusNodeRetrurnStatus:66->getMigrationStatusForTest:87
NoClassDefFound
  TypesDefScrubberTest.performScrub:64 » ExceptionInInitializer
  AtlasEntityStoreV2BulkImportPercentTest.bulkImportPercentageTestLessThan100:85->runWithSize:150->invokeBulkImportProgress:155
» ExceptionInInitializer
  AtlasEntityStoreV2BulkImportPercentTest.percentTest_Equal10:68->runWithSize:150->invokeBulkImportProgress:155
NoClassDefFound
  AtlasEntityStoreV2BulkImportPercentTest.percentTest_Equal1001:124->runWithSize:150->invokeBulkImportProgress:155
NoClassDefFound
  AtlasEntityStoreV2BulkImportPercentTest.percentTest_Equal101:95->runWithSize:150->invokeBulkImportProgress:155
NoClassDefFound
  AtlasEntityStoreV2BulkImportPercentTest.percentTest_Equal200:105->runWithSize:150->invokeBulkImportProgress:155
NoClassDefFound
  AtlasEntityStoreV2BulkImportPercentTest.percentTest_Equal202:115->runWithSize:150->invokeBulkImportProgress:155
NoClassDefFound
  AtlasEntityStoreV2BulkImportPercentTest.percentTest_Equal269:142->runWithSize:150->invokeBulkImportProgress:155
NoClassDefFound
  AtlasEntityStoreV2BulkImportPercentTest.percentTest_Equal4:62->runWithSize:150->invokeBulkImportProgress:155
NoClassDefFound
  AtlasEntityStoreV2BulkImportPercentTest.percentTest_Equal4323:133->runWithSize:150->invokeBulkImportProgress:155
NoClassDefFound
  ObjectUpdateSynchronizerTest.severalThreadsAccessingOverlappingListOfGuidsEnsuringSerialOutput:166->assertArrayEquals:195
null: lists don't have the same size expected [50] but found [0]
  ObjectUpdateSynchronizerTest.severalThreadsAccessingSameGuid_Serialize:87->verifyMultipleThreadRun:173->assertArrayEquals:195
null: lists don't have the same size expected [100] but found [0]
  ObjectUpdateSynchronizerTest.severalThreadsNonSequentialAccessingListOfGuids:122->assertArrayEquals:195
null: lists don't have the same size expected [50] but found [0]
  ObjectUpdateSynchronizerTest.severalThreadsSequentialAccessingListOfGuids:107->assertArrayEquals:195
null: lists don't have the same size expected [100] but found [0]
  ObjectUpdateSynchronizerTest.singleThreadRun:68->verifyMultipleThreadRun:173->assertArrayEquals:195
null: lists don't have the same size expected [10] but found [0]
  ObjectUpdateSynchronizerTest.twoThreadsAccessingSameGuid_Serialize:82->verifyMultipleThreadRun:173->assertArrayEquals:195
null: lists don't have the same size expected [20] but found [0]

Tests run: 130, Failures: 68, Errors: 0, Skipped: 20

[INFO] ------------------------------------------------------------------------
[INFO] Reactor Summary:
[INFO] 
[INFO] Apache Atlas Server Build Tools .................... SUCCESS [  0.792 s]
[INFO] apache-atlas ....................................... SUCCESS [  4.133 s]
[INFO] Apache Atlas Test Utility Tools .................... SUCCESS [  4.763 s]
[INFO] Open Connector Framework (OCF) ..................... SUCCESS [  1.836 s]
[INFO] Open Metadata Repository Services (OMRS) ........... SUCCESS [  6.279 s]
[INFO] Open Metadata and Governance (OMAG) Server APIs .... SUCCESS [  1.055 s]
[INFO] Connected Asset Open Metadata Access Service (OMAS)  SUCCESS [  1.373 s]
[INFO] Asset Consumer Open Metadata Access Service (OMAS) . SUCCESS [  0.959 s]
[INFO] Open Metadata and Governance (OMAG) Server ......... SUCCESS [  1.598 s]
[INFO] Apache Atlas Integration ........................... SUCCESS [ 40.798 s]
[INFO] Apache Atlas Common ................................ SUCCESS [  2.342 s]
[INFO] Apache Atlas Client ................................ SUCCESS [  0.165 s]
[INFO] atlas-client-common ................................ SUCCESS [  0.732 s]
[INFO] atlas-client-v1 .................................... SUCCESS [  2.666 s]
[INFO] Apache Atlas Server API ............................ SUCCESS [  1.001 s]
[INFO] Apache Atlas Notification .......................... SUCCESS [ 16.069 s]
[INFO] atlas-client-v2 .................................... SUCCESS [  0.754 s]
[INFO] Apache Atlas Graph Database Projects ............... SUCCESS [  0.076 s]
[INFO] Apache Atlas Graph Database API .................... SUCCESS [  1.268 s]
[INFO] Graph Database Common Code ......................... SUCCESS [  0.766 s]
[INFO] Apache Atlas JanusGraph DB Impl .................... SUCCESS [02:12 min]
[INFO] Apache Atlas Graph Database Implementation Dependencies SUCCESS [  2.286 s]
[INFO] Shaded version of Apache hbase client .............. SUCCESS [  7.864 s]
[INFO] Shaded version of Apache hbase server .............. SUCCESS [ 21.499 s]
[INFO] Apache Atlas Authorization ......................... SUCCESS [  2.403 s]
[INFO] Apache Atlas Repository ............................ FAILURE [ 21.979 s]
[INFO] Apache Atlas UI .................................... SKIPPED
[INFO] Apache Atlas Web Application ....................... SKIPPED
[INFO] Apache Atlas Documentation ......................... SKIPPED
[INFO] Apache Atlas FileSystem Model ...................... SKIPPED
[INFO] Apache Atlas Plugin Classloader .................... SKIPPED
[INFO] Apache Atlas Hive Bridge Shim ...................... SKIPPED
[INFO] Apache Atlas Hive Bridge ........................... SKIPPED
[INFO] Apache Atlas Falcon Bridge Shim .................... SKIPPED
[INFO] Apache Atlas Falcon Bridge ......................... SKIPPED
[INFO] Apache Atlas Sqoop Bridge Shim ..................... SKIPPED
[INFO] Apache Atlas Sqoop Bridge .......................... SKIPPED
[INFO] Apache Atlas Storm Bridge Shim ..................... SKIPPED
[INFO] Apache Atlas Storm Bridge .......................... SKIPPED
[INFO] Apache Atlas Hbase Bridge Shim ..................... SKIPPED
[INFO] Apache Atlas Hbase Bridge .......................... SKIPPED
[INFO] Apache Atlas Kafka Bridge .......................... SKIPPED
[INFO] Apache Atlas Distribution .......................... SKIPPED
[INFO] ------------------------------------------------------------------------
[INFO] BUILD FAILURE
[INFO] ------------------------------------------------------------------------
[INFO] Total time: 04:39 min
[INFO] Finished at: 2018-07-03T05:09:19Z
[INFO] Final Memory: 158M/1989M
[INFO] ------------------------------------------------------------------------
[ERROR] Failed to execute goal org.apache.maven.plugins:maven-surefire-plugin:2.18.1:test
(default-test) on project atlas-repository: ExecutionException: java.lang.RuntimeException:
There was an error in the forked process
[ERROR] java.lang.ExceptionInInitializerError
[ERROR] 	at java.lang.Class.forName0(Native Method)
[ERROR] 	at java.lang.Class.forName(Class.java:264)
[ERROR] 	at org.slf4j.impl.Log4jLoggerFactory.<clinit>(Log4jLoggerFactory.java:48)
[ERROR] 	at org.slf4j.impl.StaticLoggerBinder.<init>(StaticLoggerBinder.java:72)
[ERROR] 	at org.slf4j.impl.StaticLoggerBinder.<clinit>(StaticLoggerBinder.java:45)
[ERROR] 	at org.slf4j.LoggerFactory.bind(LoggerFactory.java:150)
[ERROR] 	at org.slf4j.LoggerFactory.performInitialization(LoggerFactory.java:124)
[ERROR] 	at org.slf4j.LoggerFactory.getILoggerFactory(LoggerFactory.java:412)
[ERROR] 	at org.slf4j.LoggerFactory.getLogger(LoggerFactory.java:357)
[ERROR] 	at org.slf4j.LoggerFactory.getLogger(LoggerFactory.java:383)
[ERROR] 	at org.apache.atlas.TestModules$TestOnlyModule.<clinit>(TestModules.java:91)
[ERROR] 	at org.apache.atlas.TestModules$TestOnlyModule$$FastClassByGuice$$6018b472.newInstance(<generated>)
[ERROR] 	at com.google.inject.internal.DefaultConstructionProxyFactory$FastClassProxy.newInstance(DefaultConstructionProxyFactory.java:89)
[ERROR] 	at com.google.inject.internal.ConstructorInjector.provision(ConstructorInjector.java:111)
[ERROR] 	at com.google.inject.internal.ConstructorInjector.construct(ConstructorInjector.java:90)
[ERROR] 	at com.google.inject.internal.ConstructorBindingImpl$Factory.get(ConstructorBindingImpl.java:268)
[ERROR] 	at com.google.inject.internal.InjectorImpl$2$1.call(InjectorImpl.java:1019)
[ERROR] 	at com.google.inject.internal.InjectorImpl.callInContext(InjectorImpl.java:1085)
[ERROR] 	at com.google.inject.internal.InjectorImpl$2.get(InjectorImpl.java:1015)
[ERROR] 	at com.google.inject.internal.InjectorImpl.getInstance(InjectorImpl.java:1054)
[ERROR] 	at org.testng.TestRunner.getModules(TestRunner.java:1639)
[ERROR] 	at org.testng.TestRunner.getInjector(TestRunner.java:1621)
[ERROR] 	at org.testng.internal.ClassImpl.getInstanceFromGuice(ClassImpl.java:132)
[ERROR] 	at org.testng.internal.ClassImpl.getDefaultInstance(ClassImpl.java:112)
[ERROR] 	at org.testng.internal.ClassImpl.getInstances(ClassImpl.java:183)
[ERROR] 	at org.testng.internal.TestNGClassFinder.<init>(TestNGClassFinder.java:128)
[ERROR] 	at org.testng.TestRunner.initMethods(TestRunner.java:413)
[ERROR] 	at org.testng.TestRunner.init(TestRunner.java:239)
[ERROR] 	at org.testng.TestRunner.init(TestRunner.java:209)
[ERROR] 	at org.testng.TestRunner.<init>(TestRunner.java:157)
[ERROR] 	at org.testng.SuiteRunner$DefaultTestRunnerFactory.newTestRunner(SuiteRunner.java:546)
[ERROR] 	at org.testng.SuiteRunner.init(SuiteRunner.java:159)
[ERROR] 	at org.testng.SuiteRunner.<init>(SuiteRunner.java:113)
[ERROR] 	at org.testng.TestNG.createSuiteRunner(TestNG.java:1274)
[ERROR] 	at org.testng.TestNG.createSuiteRunners(TestNG.java:1261)
[ERROR] 	at org.testng.TestNG.runSuitesLocally(TestNG.java:1115)
[ERROR] 	at org.testng.TestNG.run(TestNG.java:1032)
[ERROR] 	at org.apache.maven.surefire.testng.TestNGExecutor.run(TestNGExecutor.java:115)
[ERROR] 	at org.apache.maven.surefire.testng.TestNGDirectoryTestSuite.executeSingleClass(TestNGDirectoryTestSuite.java:129)
[ERROR] 	at org.apache.maven.surefire.testng.TestNGDirectoryTestSuite.execute(TestNGDirectoryTestSuite.java:113)
[ERROR] 	at org.apache.maven.surefire.testng.TestNGProvider.invoke(TestNGProvider.java:111)
[ERROR] 	at org.apache.maven.surefire.booter.ForkedBooter.invokeProviderInSameClassLoader(ForkedBooter.java:203)
[ERROR] 	at org.apache.maven.surefire.booter.ForkedBooter.runSuitesInProcess(ForkedBooter.java:155)
[ERROR] 	at org.apache.maven.surefire.booter.ForkedBooter.main(ForkedBooter.java:103)
[ERROR] Caused by: java.lang.IllegalStateException: Detected both log4j-over-slf4j.jar AND
slf4j-log4j12.jar on the class path, preempting StackOverflowError. See also http://www.slf4j.org/codes.html#log4jDelegationLoop
for more details.
[ERROR] 	at org.apache.log4j.Log4jLoggerFactory.<clinit>(Log4jLoggerFactory.java:51)
[ERROR] 	... 44 more
[ERROR] -> [Help 1]
[ERROR] 
[ERROR] To see the full stack trace of the errors, re-run Maven with the -e switch.
[ERROR] Re-run Maven using the -X switch to enable full debug logging.
[ERROR] 
[ERROR] For more information about the errors and possible solutions, please read the following
articles:
[ERROR] [Help 1] http://cwiki.apache.org/confluence/display/MAVEN/MojoFailureException
[ERROR] 
[ERROR] After correcting the problems, you can resume the build with the command
[ERROR]   mvn <goals> -rf :atlas-repository




{color:red}-1 overall{color}.  

    {color:green}+1 @author{color}.  The patch does not contain any @author tags.

Console output: https://builds.apache.org/job/PreCommit-ATLAS-Build-Test/496//console

This message is automatically generated.


======================================================================
======================================================================
    Adding comment to Jira.
======================================================================
======================================================================




======================================================================
======================================================================
    Finished build.
======================================================================
======================================================================


+ EXIT_CODE=1
+ '[' -d <https://builds.apache.org/job/PreCommit-ATLAS-Build-Test/ws/../atlas_patchprocess_22171>
']'
+ '[' -d <https://builds.apache.org/job/PreCommit-ATLAS-Build-Test/ws/atlas_patchprocess_22171>
']'
+ mv <https://builds.apache.org/job/PreCommit-ATLAS-Build-Test/ws/atlas_patchprocess_22171>
<https://builds.apache.org/job/PreCommit-ATLAS-Build-Test/ws/patchprocess>
+ rm -f <https://builds.apache.org/job/PreCommit-ATLAS-Build-Test/ws/../atlas_patchprocess_22171>
+ exit 1
Build step 'Execute shell' marked build as failure
Set build name.
New build name is '#496-master-ATLAS-upgrade-guava-version-to-25.1.patch'
Archiving artifacts

Mime
View raw message